{"text_format":"1","workbook":"xlsx","n_sheets":22,"sheets":["Disclaimer","Instructions","opex_indoor75_hm","opex_AOEM95_hm","opex_indoor95_hm","opex_AOEM75_hm","Data entry","Summary","Trolley","MHH","Operator Spray","Operator Granules","Operator_exposure_values_AOEM","Worker","Look up","cropsWorker","Small Tables","Operator_exposure_values_PHED","Resident","Bystander","Recreational Exposure","Default values"],"not_rendered":{"charts":0,"images":1,"macros":1,"external_links":0,"defined_names":740,"comments":3,"pivot_tables":0},"unopened":[],"bounds":{"document_bytes":16777216,"sheet_cells":100000,"rows_first":2000,"rows_last":500,"rows_between":2000,"halvings":0,"cell_chars":16384,"cell_head_chars":4096},"cells_cut":0,"cells_raw":0,"read":"whole","date_system":"1900"}

{"sheet":"Disclaimer","index":0,"n_rows":3,"n_cols":1,"rows_kept":3,"cut":false,"hidden":false,"merged":[]}
[]
[]
["DISCLAIMER: Croplife Europe (CLE) is making the tool available for risk assessors of plant protection products to aid them in the exposure and risk assessment of substances used in plant protection products in the context of plant protection products regulation (PPPR) according to EFSA exposure guidance 2022.\nThe tool has been subjected to thorough testing; however, CLE does not guarantee that the tool works error-free. CLE offers no warranty either to the reliability of the tool and the provided information or to the conclusions or assumptions made by any user on the basis of the use of this tool or the use of such information or to the regulatory acceptance of the assessments conducted using the tool. All usage is at the discretion of the user and CLE is not liable for any consequences resulting from such use.\nBefore using this calculator, the user should make sure that the latest version is being used."]

{"sheet":"Instructions","index":1,"n_rows":14,"n_cols":1,"rows_kept":14,"cut":false,"hidden":false,"merged":[]}
[]
["Instructions for using the workbook"]
[]
["The information required for the exposure assessment needs to be entered in the worksheet \"Data entry\"."]
["In the following worksheets formulas calculate the exposure values automatically"]
["Worksheet \"Operator Spray\" is for spray applications. PPE options can be selected in this worksheet"]
["Worksheet \"Operator Granules\" is for granular applications. Currently the calculator does not allow operator exposure for indoor applications. PPE options can be selected in this worksheet"]
["Worksheet \"Recreational Exposure\" is only applicable for amenity grassland areas where members of the public are likely to have access"]
["The combined results of the exposure assessment are presented in worksheet \"Summary\""]
["This calculator should be used in conjuction with the Guidance on the Assessment of Exposure for Operators, Workers, Residents and Bystanders in Risk Assessment for Plant Protection Products"]
[]
["EFSA (European Food Safety Authority), Charistou A, Coja T, Craig P, Hamey P, Martin S, Sanvido O, Chiusolo A, Colas M and Istace F, 2022. Guidance on the assessment of exposure of operators, workers, residents and bystanders in risk assessment of plant protection products. EFSA Journal 2022;20(1):7032, 134 pp. https://doi.org/10.2903/j.efsa.2022.7032"]
[]
["Latest offline calculator update: 02 August 2023"]

{"sheet":"opex_indoor75_hm","index":2,"n_rows":59,"n_cols":7,"rows_kept":59,"cut":false,"hidden":true,"merged":[]}
["Column12","Column1","Column2","Column3","Column4","Column5","Column6"]
[null,"ML Tank","","","","",""]
[null,"intercept","log TA","form:liquid","form:WP","WPS","F shield"]
["Total hands","3.27","0.64","0.64","1.28","1.17",""]
["Protected hands","1.46","0.46","0.32","1.66","0.2",""]
["Total body","3.04","0.74","0.52","1.85","",""]
["Protected body","1.58","0.62","0.12","1.84","",""]
["Head","1.46","1","0.34","0.7","","-1.67"]
["Inhalation","1.38","0.38","-0.87","1.96","-0.03",""]
[null,"","","","","",""]
[null,"","","","","",""]
[null,"Appl. LCTM","","","","",""]
[null,"","","","","",""]
[null,"","","","","",""]
[null,"","","","","",""]
[null,"","","","","",""]
[null,"","","","","",""]
[null,"","","","","",""]
[null,"","","","","",""]
[null,"","","","","",""]
[null,"A HCTM","",null,"","",""]
[null,"","","","","",""]
[null,"","","","","",""]
[null,"","","","","",""]
[null,"","","","","",""]
[null,"","","","","",""]
[null,"","","","","",""]
[null,"","","","","",""]
[null,"","","","","",""]
[null,"","","","","",""]
[null,"A HCHH","","","","",""]
[null,"intercept","log TA","dense","trolley","rain suit","protective coverall"]
["Total hands","4.4","0.83","0.17","-0.62","",""]
["Protected hands","1.71","1","1.32","-1.04","",""]
["Total body","5.59","1","0.67","-0.81","",""]
["Protected body"," ","1","1.64","-1.23","-2.42","-0.54"]
["Head","2.7","0.18","0.29","-0.41","",""]
["Inhalation","2.69","1","0.08","-0.19","",""]
[null,"","","","","",""]
[null,"","","","","",""]
[null,"","","","","",""]
[null,"ML knapsack","","","","",""]
[null,"75th percentile","","","","",""]
["Total hands","9497","","","","",""]
["Protected hands","21","","","","",""]
["Total body","803","","","","",""]
["Protected body","25","","","","",""]
["Head","5.5","","","","",""]
["Inhalation","35","","","","",""]
[null,"","","","","",""]
[null,"","","","","",""]
[null,"A LCHH ","","","","",""]
[null,"normal","dense","dense with rain trousers","","",""]
["Total hands","1323","1323","1323","","",""]
["Protected hands","1.5","1.5","1.5","","",""]
["Total body","16797","55521","55521","","",""]
["Protected body","132","12180","80","","",""]
["Head","21","21","21","","",""]
["Inhalation","47","47","47","","",""]

{"sheet":"opex_AOEM95_hm","index":3,"n_rows":59,"n_cols":7,"rows_kept":59,"cut":false,"hidden":true,"merged":[]}
["Column7","Column1","Column2","Column3","Column4","Column5","Column6"]
[null,"ML Tank","","","","",""]
[null,"intercept","log TA","form:liquid","form:WP","WPS","F shield"]
["Total hands","3.74","0.69","0.71","1.21","1.3",""]
["Protected hands","2.29","0.53","0.83","1.39","0.38",""]
["Total body","3.87","0.69","0.72","1.29","",""]
["Protected body","2.09","0.78","0.44","1.58","",""]
["Head","2.19","1","0.39","0.11","","-1.16"]
["Inhalation","1.81","0.49","-0.92","1.54","0.19",""]
[null,"","","","","",""]
[null,"","","","","",""]
[null,"Appl. LCTM","","","","",""]
[null,"intercept","log TA","droplets: normal","equipmt: normal","",""]
["Total hands","2.96","0.73","0.61","-0.21","",""]
["Protected hands","-0.46","0.12","1.79","2.19","",""]
["Total body","1.94","1","1.51","-0.82","",""]
["Protected body","0.47","1","1.05","-0.77","",""]
["Head","1.16","1","1.03","-1.12","",""]
["Inhalation","1.27","0.58","0.33","-1.14","",""]
[null,"","","","","",""]
[null,"A HCTM","","","","",""]
[null,"intercept","log TA","cabin: no_cabin","","",""]
["Total hands","3.32","1","0.48","","",""]
["Protected hands","2.88","1","0.08","","",""]
["Total body","3.92","1","0.79","","",""]
["Protected body","2.21","1","0.15","","",""]
["Head","2.29","1","1.56","","",""]
["Inhalation","1.32","1","0.6","","",""]
[null,"","","","","",""]
[null,"","","","","",""]
[null,"A HCHH","","","","",""]
[null,"intercept","log TA","culture: normal","","",""]
["Total hands","4.41","0.77","-0.47","","",""]
["Protected hands","2.61","1","-0.51","","",""]
["Total body","6.34","0.01","-1.09","","",""]
["Protected body","5.27","","-1.99","","",""]
["Head","3.5","0.33","-0.59","","",""]
["Inhalation","2.52","0.6","-0.26","","",""]
[null,"","","","","",""]
[null,"","","","","",""]
[null,"","","","","",""]
[null,"ML knapsack","","","","",""]
[null,"95th percentile","","","","",""]
["Total hands","25490","","","","",""]
["Protected hands","164","","","","",""]
["Total body","2787","","","","",""]
["Protected body","103","","","","",""]
["Head","11","","","","",""]
["Inhalation","36","","","","",""]
[null,"","","","","",""]
[null,"","","","","",""]
[null,"A LCHH ","","","","",""]
[null,"95th percentile","","","","",""]
["Total hands","4213","","","","",""]
["Protected hands","22","","","","",""]
["Total body","137007","","","","",""]
["Protected body","62630","","","","",""]
["Head","85","","","","",""]
["Inhalation","26","","","","",""]

{"sheet":"opex_indoor95_hm","index":4,"n_rows":59,"n_cols":7,"rows_kept":59,"cut":false,"hidden":true,"merged":[]}
["Column12","Column1","Column2","Column3","Column4","Column5","Column6"]
[null,"ML Tank","","","","",""]
[null,"intercept","log TA","form:liquid","form:WP","WPS","F shield"]
["Total hands","3.74","0.69","0.71","1.21","1.3",""]
["Protected hands","2.29","0.53","0.83","1.39","0.38",""]
["Total body","3.87","0.69","0.72","1.29","",""]
["Protected body","2.09","0.78","0.44","1.58","",""]
["Head","2.19","1","0.39","0.11","","-1.16"]
["Inhalation","1.81","0.49","-0.92","1.54","0.19",""]
[null,"","","","","",""]
[null,"","","","","",""]
[null,"Appl. LCTM","","","","",""]
[null,"","","","","",""]
[null,"","","","","",""]
[null,"","","","","",""]
[null,"","","","","",""]
[null,"","","","","",""]
[null,"","","","","",""]
[null,"","","","","",""]
[null,"","","","","",""]
[null,"A HCTM","","","","",""]
[null,"","","","","",""]
[null,"","","","","",""]
[null,"","","","","",""]
[null,"","","","","",""]
[null,"","","","","",""]
[null,"","","","","",""]
[null,"","","","","",""]
[null,"","","","","",""]
[null,"","","","","",""]
[null,"A HCHH","","","","",""]
[null,"intercept","log TA","dense","trolley","rain suit","protective coverall"]
["Total hands","4.81","0.84","0.14","-0.82","",""]
["Protected hands","2.36","0.67","0.76","-1.19","",""]
["Total body","6.1","1","0.48","-0.92","",""]
["Protected body","5.07","1","1.07","-1.71","-2.2","-0.64"]
["Head","3.1","0.33","0.79","0.25","",""]
["Inhalation","2.82","1","0.63","-0.26","",""]
[null,"","","","","",""]
[null,"","","","","",""]
[null,"","","","","",""]
[null,"ML knapsack","","","","",""]
[null,"95th percentile","","","","",""]
["Total hands","25490","","","","",""]
["Protected hands","164","","","","",""]
["Total body","2787","","","","",""]
["Protected body","103","","","","",""]
["Head","11","","","","",""]
["Inhalation","36","","","","",""]
[null,"","","","","",""]
[null,"","","","","",""]
[null,"A LCHH ","","","","",""]
[null,"normal","dense","dense with rain trousers","","",""]
["Total hands","4159","4159","4159","","",""]
["Protected hands","12","12","12","","",""]
["Total body","28082","85382","85382","","",""]
["Protected body","640","27958","154","","",""]
["Head","39","39","39","","",""]
["Inhalation","80","80","80","","",""]

{"sheet":"opex_AOEM75_hm","index":5,"n_rows":59,"n_cols":7,"rows_kept":59,"cut":false,"hidden":true,"merged":[]}
["Column7","Column1","Column2","Column3","Column4","Column5","Column6"]
[null,"ML Tank","","","","",""]
[null,"intercept","log TA","form:liquid","form:WP","WPS","F shield"]
["Total hands","3.27","0.64","0.64","1.28","1.17",""]
["Protected hands","1.46","0.46","0.32","1.66","0.2",""]
["Total body","3.04","0.74","0.52","1.85","",""]
["Protected body","1.58","0.62","0.12","1.84","",""]
["Head","1.46","1","0.34","0.7","","-1.67"]
["Inhalation","1.38","0.38","-0.87","1.96","-0.03",""]
[null,"","","","","",""]
[null,"","","","","",""]
[null,"Appl. LCTM","","","","",""]
[null,"intercept","log TA","droplets: normal","equipmt: normal","",""]
["Total hands","2.84","1","0.37","-1.04","",""]
["Protected hands","0.23","0.54","1.11","0.29","",""]
["Total body","2.54","1","0.81","-1.43","",""]
["Protected body","0.74","1","0.7","-1.09","",""]
["Head","0.24","1","0.88","-0.53","",""]
["Inhalation","0.72","0.5","0.01","-0.71","",""]
[null,"","","","","",""]
[null,"A HCTM","","","","",""]
[null,"intercept","log TA","cabin: no_cabin","","",""]
["Total hands","3.12","0.89","0.28","","",""]
["Protected hands","1.55","1","","","",""]
["Total body","3.47","1","0.48","","",""]
["Protected body","1.83","1","0.23","","",""]
["Head","1.17","1","1.89","","",""]
["Inhalation","0.99","0.57","0.82","","",""]
[null,"","","","","",""]
[null,"","","","","",""]
[null,"A HCHH","","","","",""]
[null,"intercept","log TA","culture: normal","","",""]
["Total hands","4.26","0.84","-0.83","","",""]
["Protected hands","2.26","1","-0.88","","",""]
["Total body","6.08","0.16","-1.29","","",""]
["Protected body","4.65","","-1.64","","",""]
["Head","3.27","0.32","-1.09","","",""]
["Inhalation","2.17","0.83","-0.26","","",""]
[null,"","","","","",""]
[null,"","","","","",""]
[null,"","","","","",""]
[null,"ML knapsack","","","","",""]
[null,"75th percentile","","","","",""]
["Total hands","9497","","","","",""]
["Protected hands","21","","","","",""]
["Total body","803","","","","",""]
["Protected body","25","","","","",""]
["Head","5.5","","","","",""]
["Inhalation","35","","","","",""]
[null,"","","","","",""]
[null,"","","","","",""]
[null,"A LCHH ","","","","",""]
[null,"75th percentile","","","","",""]
["Total hands","1544","","","","",""]
["Protected hands","5","","","","",""]
["Total body","88868","","","","",""]
["Protected body","8903","","","","",""]
["Head","12","","","","",""]
["Inhalation","26","","","","",""]

{"sheet":"Data entry","index":6,"n_rows":43,"n_cols":8,"rows_kept":43,"cut":false,"hidden":false,"merged":[[14,5,14,8],[15,5,15,8],[16,4,16,8]]}
["Note: Some drop-down menus depend on others. To avoid errors, please fill-in from top to bottom"]
[null,null,"Application Scenarios"]
[null,null,"Product name "]
[null,null,"Formulation type"]
[null,null,"Crop type","Activity"]
[]
[null,null,"Scenario"]
[null,null,"Indoor or Outdoor application"]
[null,null,"Max. application rate of the product [L or kg/ha]",null,{"$f":"IF(i_FormVal<>'Look up'!A4,\"kg/ha\",\"L/ha\")","v":"kg/ha"}]
[null,null,"Minimum volume water for application (liquids)",null,"L/ha"]
[null,null,"Maximum volume water for application (liquids)",null,"L/ha"]
[null,null,"Application method"]
[null,null,"Application equipment",null,null,"Drift reduction",0]
[null,null,"Buffer strip",null,"m",{"$f":"IFERROR(IF(i_FormVal=\"Granules, fine granules\",\"\",IF(Bystander!C18=\"NA\",\"No drift data for a buffer strip of \"&i_Buffer&\" m, please select a different buffer strip.\",\"\")),\"\")","v":""}]
[null,null,"Max. number of applications",1]
[null,null,"Interval between multiple applications",365,"days",{"$f":"IF(AND(i_AppNo=1, i_AppInt<>365),\"For single applications interval must be 365 days\",\"\")","v":""}]
[null,null,"Season (upward spraying orchards only)","not relevant"]
[]
[null,null,"Active substance properties"]
[null,null,"Active substance name"]
[null,null,"Concentration of active substance [g a.s./L or kg]",null,null,null,null,{"$f":"IF(i_FormVal<>'Look up'!A4,\"g a.s./kg\",\"g a.s./L\")","v":"g a.s./kg"}]
[null,null,"Minimum in-use-concentration of active substance",{"$f":"IFERROR(IF(i_FormVal<>\"Granules, fine granules\",i_AppRatePPP*D21/i_MaxVol,\"N/A\"),\"\")","v":""},{"$f":"IFERROR(IF(i_FormVal<>\"Granules, fine granules\",i_AppRatePPP*E21/i_MaxVol,\"N/A\"),\"\")","v":""},{"$f":"IFERROR(IF(i_FormVal<>\"Granules, fine granules\",i_AppRatePPP*F21/i_MaxVol,\"N/A\"),\"\")","v":""},{"$f":"IFERROR(IF(i_FormVal<>\"Granules, fine granules\",i_AppRatePPP*G21/i_MaxVol,\"N/A\"),\"\")","v":""},"g a.s./L"]
[null,null,"Maximum in-use-concentration of active substance",{"$f":"IFERROR(IF(i_FormVal<>\"Granules, fine granules\",i_AppRatePPP*D21/i_MinVol,\"N/A\"),\"\")","v":""},{"$f":"IFERROR(IF(i_FormVal<>\"Granules, fine granules\",i_AppRatePPP*E21/i_MinVol,\"N/A\"),\"\")","v":""},{"$f":"IFERROR(IF(i_FormVal<>\"Granules, fine granules\",i_AppRatePPP*F21/i_MinVol,\"N/A\"),\"\")","v":""},{"$f":"IFERROR(IF(i_FormVal<>\"Granules, fine granules\",i_AppRatePPP*G21/i_MinVol,\"N/A\"),\"\")","v":""},"g a.s./L"]
[null,null,"Maximum application rate of active substance",{"$f":"i_AppRatePPP*D21/1000","v":0},{"$f":"i_AppRatePPP*E21/1000","v":0},{"$f":"i_AppRatePPP*F21/1000","v":0},{"$f":"i_AppRatePPP*G21/1000","v":0},"kg a.s./ha"]
[]
[null,null,"Acceptable Operator Exposure Level (AOEL)",null,null,null,null,"mg/kg bw/day"]
[null,null,"Acute Acceptable Operator Exposure Level (AAOEL)",null,null,null,null,"mg/kg bw/day"]
[]
[null,null,"Foliar DT50",30,30,30,30,"days"]
[null,null,"Initial Dislodgeable Foliar Residue",3,3,3,3,"µg/cm² of foliage/kg a.s. applied/ha "]
[null,null,"Dermal absorption of product"]
[null,null,"Dermal absorption of in-use dilution"]
[null,null,"Oral absorption of active substance",1,1,1,1]
[null,null,"Inhalation absorption of active substance",1,1,1,1]
[null,null,"Vapour pressure of active substance",null,null,null,null,"Pa"]
[null,null,"Molecular weight of active substance",null,null,null,null,"g/mol"]
[]
[]
[]
[]
[]
[]
[null,null,null,{"$f":"IF(i_VP1<0.005,'Look up'!$A22,'Look up'!$A23)","v":"low volatile substances having a vapour pressure of < 0.005 Pa"},{"$f":"IF(i_VP2<0.005,'Look up'!$A22,'Look up'!$A23)","v":"low volatile substances having a vapour pressure of < 0.005 Pa"},{"$f":"IF(i_VP3<0.005,'Look up'!$A22,'Look up'!$A23)","v":"low volatile substances having a vapour pressure of < 0.005 Pa"},{"$f":"IF(i_VP4<0.005,'Look up'!$A22,'Look up'!$A23)","v":"low volatile substances having a vapour pressure of < 0.005 Pa"}]

{"sheet":"Summary","index":7,"n_rows":41,"n_cols":21,"rows_kept":41,"cut":false,"hidden":false,"merged":[[18,0,23,0],[34,0,37,0],[0,1,0,4],[32,19,32,20],[33,19,33,20],[13,0,17,0],[29,0,33,0],[24,17,24,18],[38,0,39,0],[34,17,34,18],[34,19,34,20],[35,17,35,18],[35,19,35,20],[36,17,36,18],[36,19,36,20],[37,17,37,18],[37,19,37,20],[34,1,34,2],[35,1,35,2],[36,1,36,2],[37,1,37,2],[34,13,34,14],[35,13,35,14],[36,13,36,14],[37,5,37,6],[34,5,34,6],[35,5,35,6],[36,5,36,6],[34,9,34,10],[35,9,35,10],[36,9,36,10],[37,13,37,14],[31,19,31,20],[31,17,31,18],[32,17,32,18],[37,9,37,10],[30,1,30,2],[31,1,31,2],[32,1,32,2],[33,1,33,2],[30,5,30,6],[31,5,31,6],[32,5,32,6],[33,5,33,6],[30,13,30,14],[31,13,31,14],[32,13,32,14],[33,13,33,14],[30,9,30,10],[31,9,31,10],[32,9,32,10],[33,9,33,10],[30,19,30,20],[28,1,28,2],[24,9,24,10],[19,1,19,2],[20,1,20,2],[9,13,9,14],[10,13,10,14],[9,9,9,10],[10,9,10,10],[11,13,11,14],[11,19,11,20],[12,19,12,20],[16,17,16,18],[28,19,28,20],[20,17,20,18],[21,13,21,14],[22,13,22,14],[12,9,12,10],[15,17,15,18],[17,17,17,18],[25,9,25,10],[26,9,26,10],[27,9,27,10],[23,17,23,18],[11,0,12,0],[11,1,11,2],[12,1,12,2],[9,0,10,0],[9,1,9,2],[10,1,10,2],[11,5,11,6],[12,5,12,6],[9,5,9,6],[10,5,10,6],[1,1,1,2],[23,5,23,6],[24,5,24,6],[25,5,25,6],[26,5,26,6],[27,5,27,6],[21,1,21,2],[22,1,22,2],[23,1,23,2],[8,1,8,2],[24,1,24,2],[25,1,25,2],[26,1,26,2],[27,1,27,2],[18,1,18,2],[5,1,5,4],[12,17,12,18],[12,13,12,14],[11,9,11,10],[14,17,14,18],[23,19,23,20],[19,17,19,18],[19,19,19,20],[25,19,25,20],[26,19,26,20],[19,9,19,10],[19,13,19,14],[24,19,24,20],[20,19,20,20],[30,17,30,18],[33,17,33,18],[28,13,28,14],[28,5,28,6],[28,9,28,10],[23,9,23,10],[20,5,20,6],[21,5,21,6],[22,5,22,6],[20,9,20,10],[21,9,21,10],[23,13,23,14],[22,9,22,10],[20,13,20,14],[21,17,21,18],[25,17,25,18],[26,17,26,18],[27,17,27,18],[28,17,28,18],[29,1,29,2],[8,19,8,20],[18,19,18,20],[29,19,29,20],[29,5,29,6],[29,9,29,10],[29,13,29,14],[18,9,18,10],[18,5,18,6],[8,5,8,6],[21,19,21,20],[22,17,22,18],[22,19,22,20],[27,19,27,20],[24,13,24,14],[25,13,25,14],[26,13,26,14],[27,13,27,14],[19,5,19,6],[9,19,9,20],[10,19,10,20],[9,17,9,18],[10,17,10,18],[11,17,11,18]]}
[{"$f":"\"Product \"&i_ProductName","v":"Product "},{"$f":"\"Formulation = \"&i_FormVal","v":"Formulation = "}]
["Scenario",{"$f":"i_CropType & \" \"& IF(i_Season<>\"not relevant\",i_Season,\"\") & \" / \" &'Data entry'!D8&\" / \"&i_AppMeth&\" / \"&i_AppEquip","v":"  /  /  / "},null,{"$f":"\"Buffer strip = \"&i_Buffer&\" m\"&\n\"     Drift reduction = \"&Driftreduction*100&\"%\"","v":"Buffer strip =  m     Drift reduction = 0%"},{"$f":"\"Number applications = \"&i_AppNo&\", Application interval = \"&i_AppInt&\" d\"","v":"Number applications = 1, Application interval = 365 d"}]
["Substance",{"$f":"i_SubstName1","v":0},{"$f":"\"Application rate = \"&i_AppRateAS1&\" kg a.s./ha\"","v":"Application rate = 0 kg a.s./ha"},{"$f":"IF(i_FormVal=\"Granules, fine granules\",\"N/A\",\"Spray dilution = \"&d_ConcAs1&\" g a.s./L\")","v":{"$error":"#DIV/0!"}},{"$f":"\"Vapour pressure = \"&i_VP1&\" Pa\"","v":"Vapour pressure =  Pa"},{"$f":"i_SubstName2","v":0},{"$f":"\"Application rate = \"&i_AppRateAS2&\" kg a.s./ha\"","v":"Application rate = 0 kg a.s./ha"},{"$f":"IF(i_FormVal=\"Granules, fine granules\",\"N/A\",\"Spray dilution = \"&d_ConcAs2&\" g a.s./L\")","v":{"$error":"#DIV/0!"}},{"$f":"\"Vapour pressure = \"&i_VP2&\" Pa\"","v":"Vapour pressure =  Pa"},{"$f":"i_SubstName3","v":0},{"$f":"\"Application rate = \"&i_AppRateAS3&\" kg a.s./ha\"","v":"Application rate = 0 kg a.s./ha"},{"$f":"IF(i_FormVal=\"Granules, fine granules\",\"N/A\",\"Spray dilution = \"&d_ConcAs3&\" g a.s./L\")","v":{"$error":"#DIV/0!"}},{"$f":"\"Vapour pressure = \"&i_VP3&\" Pa\"","v":"Vapour pressure =  Pa"},{"$f":"i_SubstName4","v":0},{"$f":"\"Application rate = \"&i_AppRateAS4&\" kg a.s./ha\"","v":"Application rate = 0 kg a.s./ha"},{"$f":"IF(i_FormVal=\"Granules, fine granules\",\"N/A\",\"Spray dilution = \"&d_ConcAs4&\" g a.s./L\")","v":{"$error":"#DIV/0!"}},{"$f":"\"Vapour pressure = \"&i_VP4&\" Pa\"","v":"Vapour pressure =  Pa"}]
["Percentage Absorption",{"$f":"\"Dermal for product = \"&i_AbsorpProduct1*100","v":"Dermal for product = 0"},{"$f":"\"Dermal for in-use dilution = \"&i_AbsorpInuse1*100","v":"Dermal for in-use dilution = 0"},{"$f":"\"Oral = \"&i_AbsorpOralInuse1*100","v":"Oral = 100"},{"$f":"\"Inhalation = \"&i_AbsorpInhalation1*100","v":"Inhalation = 100"},{"$f":"\"Dermal for product = \"&i_AbsorpProduct2*100","v":"Dermal for product = 0"},{"$f":"\"Dermal for in-use dilution = \"&i_AbsorpInuse2*100","v":"Dermal for in-use dilution = 0"},{"$f":"\"Oral = \"&i_AbsorpOralInuse2*100","v":"Oral = 100"},{"$f":"\"Inhalation = \"&i_AbsorpInhalation2*100","v":"Inhalation = 100"},{"$f":"\"Dermal for product = \"&i_AbsorpProduct3*100","v":"Dermal for product = 0"},{"$f":"\"Dermal for in-use dilution = \"&i_AbsorpInuse3*100","v":"Dermal for in-use dilution = 0"},{"$f":"\"Oral = \"&i_AbsorpOralInuse3*100","v":"Oral = 100"},{"$f":"\"Inhalation = \"&i_AbsorpInhalation3*100","v":"Inhalation = 100"},{"$f":"\"Dermal for product = \"&i_AbsorpProduct4*100","v":"Dermal for product = 0"},{"$f":"\"Dermal for in-use dilution = \"&i_AbsorpInuse4*100","v":"Dermal for in-use dilution = 0"},{"$f":"\"Oral = \"&i_AbsorpOralInuse4*100","v":"Oral = 100"},{"$f":"\"Inhalation = \"&i_AbsorpInhalation4*100","v":"Inhalation = 100"}]
[null,{"$f":"\"AOEL = \"&i_AOEL1&\" mg/kg bw/d\"","v":"AOEL =  mg/kg bw/d"},{"$f":"\"AAOEL = \"&i_AAOEL1&\" mg/kg bw/d\"","v":"AAOEL =  mg/kg bw/d"},{"$f":"\"DFR = \"&i_DFR1&\" μg a.s./cm² per kg a.s./ha\"","v":"DFR = 3 μg a.s./cm² per kg a.s./ha"},{"$f":"\"DT50 = \"&d_HalflifeAS1&\" d\"","v":"DT50 = 30 d"},{"$f":"\"AOEL = \"&i_AOEL2&\" mg/kg bw/d\"","v":"AOEL =  mg/kg bw/d"},{"$f":"\"AAOEL = \"&i_AAOEL2&\" mg/kg bw/d\"","v":"AAOEL =  mg/kg bw/d"},{"$f":"\"DFR = \"&i_DFR2&\" μg a.s./cm² per kg a.s./ha\"","v":"DFR = 3 μg a.s./cm² per kg a.s./ha"},{"$f":"\"DT50 = \"&d_HalflifeAS2&\" d\"","v":"DT50 = 30 d"},{"$f":"\"AOEL = \"&i_AOEL3&\" mg/kg bw/d\"","v":"AOEL =  mg/kg bw/d"},{"$f":"\"AAOEL = \"&i_AAOEL3","v":"AAOEL = "},{"$f":"\"DFR = \"&i_DFR3&\" μg a.s./cm² per kg a.s./ha\"","v":"DFR = 3 μg a.s./cm² per kg a.s./ha"},{"$f":"\"DT50 = \"&d_HalflifeAS3&\" d\"","v":"DT50 = 30 d"},{"$f":"\"AOEL = \"&i_AOEL4&\" mg/kg bw/d\"","v":"AOEL =  mg/kg bw/d"},{"$f":"\"AAOEL = \"&i_AAOEL4&\" mg/kg bw/d\"","v":"AAOEL =  mg/kg bw/d"},{"$f":"\"DFR = \"&i_DFR4&\" μg a.s./cm² per kg a.s./ha\"","v":"DFR = 3 μg a.s./cm² per kg a.s./ha"},{"$f":"\"DT50 = \"&d_HalflifeAS4&\" d\"","v":"DT50 = 30 d"}]
["Operator Model ",{"$f":"IF(sys_OperatorModel=1,\"Mixing/loading and application AOEM\",\"Loading and application PHED\")","v":"Mixing/loading and application AOEM"}]
["Mixing and Loading",{"$f":"\"Gloves = \"&IF(sys_OperatorModel=1,'Operator Spray'!D25,IF(sys_OperatorModel=3,#REF!,IF(sys_OperatorModel=2,'Operator Granules'!C18,\"\")))","v":"Gloves = No"},{"$f":"\"Clothing = \"&IF(sys_OperatorModel=1,'Operator Spray'!D26,IF(sys_OperatorModel=2,'Operator Granules'!C19,\"\"))","v":"Clothing = Work wear - arms, body and legs covered"},{"$f":"\"Head and respiratory PPE = \"&IF(sys_OperatorModel=1,'Operator Spray'!D27,IF(sys_OperatorModel=2,'Operator Granules'!C20,\"\"))","v":"Head and respiratory PPE = None"},{"$f":"IF(sys_OperatorModel=2,\"\",\"Soluble bags = \"&'Operator Spray'!D28)","v":"Soluble bags = No"}]
["Application",{"$f":"\"Gloves = \"&IF(sys_OperatorModel=1,'Operator Spray'!D39,IF(sys_OperatorModel=3,#REF!,IF(sys_OperatorModel=2,'Operator Granules'!C27,\"\")))","v":"Gloves = No"},{"$f":"\"Clothing = \"&IF(sys_OperatorModel=1,'Operator Spray'!D40,IF(sys_OperatorModel=2,'Operator Granules'!C28,\"\"))","v":"Clothing = Work wear - arms, body and legs covered"},{"$f":"\"Head and respiratory PPE = \"&IF(sys_OperatorModel=1,'Operator Spray'!D41,IF(sys_OperatorModel=2,'Operator Granules'!C29,\"\"))","v":"Head and respiratory PPE = None"},{"$f":"\"Closed cabin = \"&IF(sys_OperatorModel=1,'Operator Spray'!D42,\"NA\")","v":"Closed cabin = Not relevant"}]
["Operator - M&L + Application",{"$f":"i_SubstName1","v":0},null,"Exposure (mg/kg bw/d)","%(A)AOEL",{"$f":"i_SubstName2","v":0},null,"Exposure (mg/kg bw/d)","%(A)AOEL",{"$f":"i_SubstName3","v":0},null,"Exposure (mg/kg bw/d)","%(A)AOEL",{"$f":"i_SubstName4","v":0},null,"Exposure (mg/kg bw/d)","%(A)AOEL","Combined",null,"Hazard Index"]
["Potential exposure","Longer term systemic exposure",null,{"$f":"IF(OR(sys_OperatorModel=1,sys_OperatorModel=3),'Operator Spray'!D48,IF(sys_OperatorModel=2,'Operator Granules'!C36,\"\"))","v":{"$error":"#N/A"}},{"$f":"IF(OR(sys_OperatorModel=1,sys_OperatorModel=3),'Operator Spray'!D49,IF(sys_OperatorModel=2,'Operator Granules'!C37,\"\"))","v":0},"Longer term systemic exposure",null,{"$f":"IF(OR(sys_OperatorModel=1,sys_OperatorModel=3),'Operator Spray'!F48,IF(sys_OperatorModel=2,'Operator Granules'!E36,\"\"))","v":{"$error":"#N/A"}},{"$f":"IF(OR(sys_OperatorModel=1,sys_OperatorModel=3),'Operator Spray'!F49,IF(sys_OperatorModel=2,'Operator Granules'!E37,\"\"))","v":0},"Longer term systemic exposure",null,{"$f":"IF(OR(sys_OperatorModel=1,sys_OperatorModel=3),'Operator Spray'!H48,IF(sys_OperatorModel=2,'Operator Granules'!G36,\"\"))","v":{"$error":"#N/A"}},{"$f":"IF(OR(sys_OperatorModel=1,sys_OperatorModel=3),'Operator Spray'!H49,IF(sys_OperatorModel=2,'Operator Granules'!G37,\"\"))","v":0},"Longer term systemic exposure",null,{"$f":"IF(OR(sys_OperatorModel=1,sys_OperatorModel=3),'Operator Spray'!J48,IF(sys_OperatorModel=2,'Operator Granules'!I36,\"\"))","v":{"$error":"#N/A"}},{"$f":"IF(OR(sys_OperatorModel=1,sys_OperatorModel=3),'Operator Spray'!J49,IF(sys_OperatorModel=2,'Operator Granules'!I37,\"\"))","v":0},"Longer term systemic exposure",null,{"$f":"IF(sys_OperatorModel=1,'Operator Spray'!L49,'Operator Granules'!K37)","v":"N/A"}]
[null,"Acute systemic exposure",null,{"$f":"IF(OR(sys_OperatorModel=1,sys_OperatorModel=3),'Operator Spray'!D52,IF(sys_OperatorModel=2,'Operator Granules'!C40,\"\"))","v":{"$error":"#N/A"}},{"$f":"IF(i_AAOEL1>0,IF(OR(sys_OperatorModel=1,sys_OperatorModel=3),'Operator Spray'!D53,IF(sys_OperatorModel=2,'Operator Granules'!C41,\"\")),\"\")","v":""},"Acute systemic exposure",null,{"$f":"IF(OR(sys_OperatorModel=1,sys_OperatorModel=3),'Operator Spray'!F52,IF(sys_OperatorModel=2,'Operator Granules'!E40,\"\"))","v":{"$error":"#N/A"}},{"$f":"IF(OR(sys_OperatorModel=1,sys_OperatorModel=3),'Operator Spray'!F53,IF(sys_OperatorModel=2,'Operator Granules'!E41,\"\"))","v":0},"Acute systemic exposure",null,{"$f":"IF(OR(sys_OperatorModel=1,sys_OperatorModel=3),'Operator Spray'!H52,IF(sys_OperatorModel=2,'Operator Granules'!G40,\"\"))","v":{"$error":"#N/A"}},{"$f":"IF(OR(sys_OperatorModel=1,sys_OperatorModel=3),'Operator Spray'!H53,IF(sys_OperatorModel=2,'Operator Granules'!G41,\"\"))","v":0},"Acute systemic exposure",null,{"$f":"IF(OR(sys_OperatorModel=1,sys_OperatorModel=3),'Operator Spray'!J52,IF(sys_OperatorModel=2,'Operator Granules'!I40,\"\"))","v":{"$error":"#N/A"}},{"$f":"IF(OR(sys_OperatorModel=1,sys_OperatorModel=3),'Operator Spray'!J53,IF(sys_OperatorModel=2,'Operator Granules'!I41,\"\"))","v":0},"Acute systemic exposure",null,{"$f":"IF(sys_OperatorModel=1,'Operator Spray'!L53,'Operator Granules'!K41)","v":"N/A"}]
["Exposure (including PPE options shown above)","Longer term systemic exposure",null,{"$f":"IF(OR(sys_OperatorModel=1,sys_OperatorModel=3),'Operator Spray'!E48,IF(sys_OperatorModel=2,'Operator Granules'!D36,\"\"))","v":{"$error":"#N/A"}},{"$f":"IF(OR(sys_OperatorModel=1,sys_OperatorModel=3),'Operator Spray'!E49,IF(sys_OperatorModel=2,'Operator Granules'!D37,\"\"))","v":0},"Longer term systemic exposure",null,{"$f":"IF(OR(sys_OperatorModel=1,sys_OperatorModel=3),'Operator Spray'!G48,IF(sys_OperatorModel=2,'Operator Granules'!F36,\"\"))","v":{"$error":"#N/A"}},{"$f":"IF(OR(sys_OperatorModel=1,sys_OperatorModel=3),'Operator Spray'!G49,IF(sys_OperatorModel=2,'Operator Granules'!F37,\"\"))","v":0},"Longer term systemic exposure",null,{"$f":"IF(OR(sys_OperatorModel=1,sys_OperatorModel=3),'Operator Spray'!I48,IF(sys_OperatorModel=2,'Operator Granules'!H36,\"\"))","v":{"$error":"#N/A"}},{"$f":"IF(OR(sys_OperatorModel=1,sys_OperatorModel=3),'Operator Spray'!I49,IF(sys_OperatorModel=2,'Operator Granules'!H37,\"\"))","v":0},"Longer term systemic exposure",null,{"$f":"IF(OR(sys_OperatorModel=1,sys_OperatorModel=3),'Operator Spray'!K48,IF(sys_OperatorModel=2,'Operator Granules'!J36,\"\"))","v":{"$error":"#N/A"}},{"$f":"IF(OR(sys_OperatorModel=1,sys_OperatorModel=3),'Operator Spray'!K49,IF(sys_OperatorModel=2,'Operator Granules'!J37,\"\"))","v":0},"Longer term systemic exposure",null,{"$f":"IF(sys_OperatorModel=1,'Operator Spray'!M49,'Operator Granules'!L37)","v":"N/A"}]
[null,"Acute systemic exposure",null,{"$f":"IF(OR(sys_OperatorModel=1,sys_OperatorModel=3),'Operator Spray'!E52,IF(sys_OperatorModel=2,'Operator Granules'!D40,\"\"))","v":{"$error":"#N/A"}},{"$f":"IF(i_AAOEL1>0,IF(OR(sys_OperatorModel=1,sys_OperatorModel=3),'Operator Spray'!E53,IF(sys_OperatorModel=2,'Operator Granules'!D41,\"\")),\"\")","v":""},"Acute systemic exposure",null,{"$f":"IF(OR(sys_OperatorModel=1,sys_OperatorModel=3),'Operator Spray'!G52,IF(sys_OperatorModel=2,'Operator Granules'!F40,\"\"))","v":{"$error":"#N/A"}},{"$f":"IF(OR(sys_OperatorModel=1,sys_OperatorModel=3),'Operator Spray'!G53,IF(sys_OperatorModel=2,'Operator Granules'!F41,\"\"))","v":0},"Acute systemic exposure",null,{"$f":"IF(OR(sys_OperatorModel=1,sys_OperatorModel=3),'Operator Spray'!I52,IF(sys_OperatorModel=2,'Operator Granules'!H40,\"\"))","v":{"$error":"#N/A"}},{"$f":"IF(OR(sys_OperatorModel=1,sys_OperatorModel=3),'Operator Spray'!I53,IF(sys_OperatorModel=2,'Operator Granules'!H41,\"\"))","v":0},"Acute systemic exposure",null,{"$f":"IF(OR(sys_OperatorModel=1,sys_OperatorModel=3),'Operator Spray'!K52,IF(sys_OperatorModel=2,'Operator Granules'!J40,\"\"))","v":{"$error":"#N/A"}},{"$f":"IF(sys_OperatorModel=1,'Operator Spray'!K53,'Operator Granules'!J41)","v":0},"Acute systemic exposure",null,{"$f":"IF(sys_OperatorModel=1,'Operator Spray'!M53,'Operator Granules'!L41)","v":"N/A"}]
[{"$f":"\"Worker - \" & Worker!C6","v":"Worker - 0"},{"$f":"i_SubstName1","v":0},"Exposure (mg/kg bw/d)","%AOEL","Safe re-entry (d)",{"$f":"i_SubstName2","v":0},"Exposure (mg/kg bw/d)","%AOEL","Safe re-entry (d)",{"$f":"i_SubstName3","v":0},"Exposure (mg/kg bw/d)","%AOEL","Safe re-entry (d)",{"$f":"i_SubstName4","v":0},"Exposure (mg/kg bw/d)","%AOEL","Safe re-entry (d)","Combined",null,"Hazard Index","Safe re-entry (d)"]
[null,"Potential exposure",{"$f":"IFERROR(Worker!B$32,\"N/A\")","v":"N/A"},{"$f":"IFERROR(Worker!B$33,\"N/A\")","v":0},{"$f":"Worker!B50","v":0},"Potential exposure",{"$f":"IFERROR(Worker!F$32,\"N/A\")","v":"N/A"},{"$f":"IFERROR(Worker!F$33,\"N/A\")","v":0},{"$f":"Worker!F50","v":0},"Potential exposure",{"$f":"IFERROR(Worker!J$32,\"N/A\")","v":"N/A"},{"$f":"IFERROR(Worker!J$33,\"N/A\")","v":0},{"$f":"Worker!J50","v":0},"Potential exposure",{"$f":"IFERROR(Worker!N$32,\"N/A\")","v":"N/A"},{"$f":"IFERROR(Worker!N$33,\"N/A\")","v":0},{"$f":"Worker!N50","v":0},"Potential exposure",null,{"$f":"Worker!R$33","v":"N/A"},{"$f":"Worker!R50","v":0}]
[null,"Work wear",{"$f":"IFERROR(Worker!C$32,\"N/A\")","v":"N/A"},{"$f":"IFERROR(Worker!C$33,\"N/A\")","v":0},{"$f":"Worker!C50","v":0},"Work wear",{"$f":"IFERROR(Worker!G$32,\"N/A\")","v":"N/A"},{"$f":"IFERROR(Worker!G$33,\"N/A\")","v":0},{"$f":"Worker!G50","v":0},"Work wear",{"$f":"IFERROR(Worker!K$32,\"N/A\")","v":"N/A"},{"$f":"IFERROR(Worker!K$33,\"N/A\")","v":0},{"$f":"Worker!K50","v":0},"Work wear",{"$f":"IFERROR(Worker!O$32,\"N/A\")","v":"N/A"},{"$f":"IFERROR(Worker!O$33,\"N/A\")","v":0},{"$f":"Worker!O50","v":0},"Work wear",null,{"$f":"Worker!S$33","v":"N/A"},{"$f":"Worker!S50","v":0}]
[null,"Work wear and gloves",{"$f":"IFERROR(Worker!D$32,\"N/A\")","v":"N/A"},{"$f":"IFERROR(Worker!D$33,\"N/A\")","v":0},{"$f":"Worker!D50","v":0},"Work wear and gloves",{"$f":"IFERROR(Worker!H$32,\"N/A\")","v":"N/A"},{"$f":"IFERROR(Worker!H$33,\"N/A\")","v":0},{"$f":"Worker!H50","v":0},"Work wear and gloves",{"$f":"IFERROR(Worker!L$32,\"N/A\")","v":"N/A"},{"$f":"IFERROR(Worker!L$33,\"N/A\")","v":0},{"$f":"Worker!L50","v":0},"Work wear and gloves",{"$f":"IFERROR(Worker!P$32,\"N/A\")","v":"N/A"},{"$f":"IFERROR(Worker!P$33,\"N/A\")","v":0},{"$f":"Worker!P50","v":0},"Work wear and gloves",null,{"$f":"Worker!T33","v":"N/A"},{"$f":"Worker!T50","v":0}]
[null,"Gloves, no work wear",{"$f":"IFERROR(FIXED(Worker!E$32,3),\"N/A\")","v":"N/A"},{"$f":"IFERROR(Worker!E$33,\"N/A\")","v":0},{"$f":"Worker!E50","v":0},"Gloves, no work wear",{"$f":"IFERROR(FIXED(Worker!I$32,3),\"N/A\")","v":"N/A"},{"$f":"IFERROR(Worker!I$33,\"N/A\")","v":0},{"$f":"Worker!I50","v":0},"Gloves, no work wear",{"$f":"IFERROR(FIXED(Worker!M$32,3),\"N/A\")","v":"N/A"},{"$f":"IFERROR(Worker!M$33,\"N/A\")","v":0},{"$f":"Worker!M50","v":0},"Gloves, no work wear",{"$f":"IFERROR(FIXED(Worker!Q$32,3),\"N/A\")","v":"N/A"},{"$f":"IFERROR(Worker!Q$33,\"N/A\")","v":0},{"$f":"Worker!Q50","v":0},"Gloves, no work wear",null,{"$f":"Worker!U33","v":"N/A"},{"$f":"Worker!U50","v":0}]
["Resident - adult",{"$f":"i_SubstName1","v":0},null,"Exposure (mg/kg bw/d)","%AOEL",{"$f":"i_SubstName2","v":0},null,"Exposure (mg/kg bw/d)","%AOEL",{"$f":"i_SubstName3","v":0},null,"Exposure (mg/kg bw/d)","%AOEL",{"$f":"i_SubstName4","v":0},null,"Exposure (mg/kg bw/d)","%AOEL","Combined",null,"Hazard Index"]
[null,"Spray drift (75th percentile)",null,{"$f":"IFERROR(Resident!B$34,\"N/A\")","v":0},{"$f":"Resident!B$35","v":0},"Spray drift (75th percentile)",null,{"$f":"IFERROR(Resident!G$34,\"N/A\")","v":0},{"$f":"Resident!G$35","v":0},"Spray drift (75th percentile)",null,{"$f":"IFERROR(Resident!L$34,\"N/A\")","v":0},{"$f":"Resident!L$35","v":0},"Spray drift (75th percentile)",null,{"$f":"IFERROR(Resident!Q$34,\"N/A\")","v":0},{"$f":"Resident!Q$35","v":0},"Spray drift (75th percentile)",null,{"$f":"Resident!V$35","v":"N/A"}]
[null,"Vapour (75th percentile)",null,{"$f":"IFERROR(Resident!C$34,\"N/A\")","v":2.7E-4},{"$f":"Resident!C$35","v":0},"Vapour (75th percentile)",null,{"$f":"IFERROR(Resident!H$34,\"N/A\")","v":2.7E-4},{"$f":"Resident!H$35","v":0},"Vapour (75th percentile)",null,{"$f":"IFERROR(Resident!M$34,\"N/A\")","v":2.7E-4},{"$f":"Resident!M$35","v":0},"Vapour (75th percentile)",null,{"$f":"IFERROR(Resident!R$34,\"N/A\")","v":2.7E-4},{"$f":"Resident!R$35","v":0},"Vapour (75th percentile)",null,{"$f":"Resident!W$35","v":"N/A"}]
[null,"Surface deposits (75th percentile)",null,{"$f":"IFERROR(Resident!D$34,\"N/A\")","v":""},{"$f":"Resident!D$35","v":0},"Surface deposits (75th percentile)",null,{"$f":"IFERROR(Resident!I$34,\"N/A\")","v":""},{"$f":"Resident!I$35","v":0},"Surface deposits (75th percentile)",null,{"$f":"IFERROR(Resident!N$34,\"N/A\")","v":""},{"$f":"Resident!N$35","v":0},"Surface deposits (75th percentile)",null,{"$f":"IFERROR(Resident!S$34,\"N/A\")","v":""},{"$f":"Resident!S$35","v":0},"Surface deposits (75th percentile)",null,{"$f":"Resident!X$35","v":"N/A"}]
[null,"Entry into treated crops (75th percentile)",null,{"$f":"IFERROR(Resident!E$34,\"N/A\")","v":0},{"$f":"Resident!E$35","v":0},"Entry into treated crops (75th percentile)",null,{"$f":"IFERROR(Resident!J$34,\"N/A\")","v":0},{"$f":"Resident!J$35","v":0},"Entry into treated crops (75th percentile)",null,{"$f":"IFERROR(Resident!O$34,\"N/A\")","v":""},{"$f":"Resident!O$35","v":0},"Entry into treated crops (75th percentile)",null,{"$f":"IFERROR(Resident!T$34,\"N/A\")","v":""},{"$f":"Resident!T$35","v":0},"Entry into treated crops (75th percentile)",null,{"$f":"Resident!Y$35","v":"N/A"}]
[null,"All pathways (mean)",null,{"$f":"IFERROR(Resident!F$34,\"N/A\")","v":"N/A"},{"$f":"Resident!F$35","v":0},"All pathways (mean)",null,{"$f":"IFERROR(Resident!K$34,\"N/A\")","v":"N/A"},{"$f":"Resident!K$35","v":0},"All pathways (mean)",null,{"$f":"IFERROR(Resident!P$34,\"N/A\")","v":2.7E-4},{"$f":"Resident!P$35","v":0},"All pathways (mean)",null,{"$f":"IFERROR(Resident!U$34,\"N/A\")","v":"N/A"},{"$f":"Resident!U$35","v":0},"All pathways (mean)",null,{"$f":"Resident!Z$35","v":"N/A"}]
["Resident - child","Spray drift (75th percentile)",null,{"$f":"IFERROR(Resident!B$38,\"N/A\")","v":"N/A"},{"$f":"Resident!B$39","v":0},"Spray drift (75th percentile)",null,{"$f":"IFERROR(Resident!G$38,\"N/A\")","v":"N/A"},{"$f":"Resident!G$39","v":0},"Spray drift (75th percentile)",null,{"$f":"IFERROR(Resident!L$38,\"N/A\")","v":""},{"$f":"Resident!L$39","v":0},"Spray drift (75th percentile)",null,{"$f":"IFERROR(Resident!Q$38,\"N/A\")","v":""},{"$f":"Resident!Q$39","v":0},"Spray drift (75th percentile)",null,{"$f":"Resident!V$39","v":"N/A"}]
[null,"Vapour (75th percentile)",null,{"$f":"IFERROR(Resident!C$38,\"N/A\")","v":8.0000000000000004E-4},{"$f":"Resident!C$39","v":0},"Vapour (75th percentile)",null,{"$f":"IFERROR(Resident!H$38,\"N/A\")","v":8.0000000000000004E-4},{"$f":"Resident!H$39","v":0},"Vapour (75th percentile)",null,{"$f":"IFERROR(Resident!M$38,\"N/A\")","v":8.0000000000000004E-4},{"$f":"Resident!M$39","v":0},"Vapour (75th percentile)",null,{"$f":"IFERROR(Resident!Q$38,\"N/A\")","v":""},{"$f":"Resident!R$39","v":0},"Vapour (75th percentile)",null,{"$f":"Resident!W$39","v":"N/A"}]
[null,"Surface deposits (75th percentile)",null,{"$f":"IFERROR(Resident!D$38,\"N/A\")","v":"N/A"},{"$f":"Resident!D$39","v":0},"Surface deposits (75th percentile)",null,{"$f":"IFERROR(Resident!I$38,\"N/A\")","v":"N/A"},{"$f":"Resident!I$39","v":0},"Surface deposits (75th percentile)",null,{"$f":"IFERROR(Resident!N$38,\"N/A\")","v":"N/A"},{"$f":"Resident!N$39","v":0},"Surface deposits (75th percentile)",null,{"$f":"IFERROR(Resident!S$38,\"N/A\")","v":"N/A"},{"$f":"Resident!S$39","v":0},"Surface deposits (75th percentile)",null,{"$f":"Resident!X$39","v":"N/A"}]
[null,"Entry into treated crops (75th percentile)",null,{"$f":"IFERROR(Resident!E$38,\"N/A\")","v":0},{"$f":"Resident!E$39","v":0},"Entry into treated crops (75th percentile)",null,{"$f":"IFERROR(Resident!J$38,\"N/A\")","v":0},{"$f":"Resident!J$39","v":0},"Entry into treated crops (75th percentile)",null,{"$f":"IFERROR(Resident!O$38,\"N/A\")","v":0},{"$f":"Resident!O$39","v":0},"Entry into treated crops (75th percentile)",null,{"$f":"IFERROR(Resident!T$38,\"N/A\")","v":0},{"$f":"Resident!T$39","v":0},"Entry into treated crops (75th percentile)",null,{"$f":"Resident!Y$39","v":"N/A"}]
[null,"All pathways (mean)",null,{"$f":"IFERROR(Resident!F$38,\"N/A\")","v":"N/A"},{"$f":"Resident!F$39","v":0},"All pathways (mean)",null,{"$f":"IFERROR(Resident!K$38,\"N/A\")","v":"N/A"},{"$f":"Resident!K$39","v":0},"All pathways (mean)",null,{"$f":"IFERROR(Resident!P$38,\"N/A\")","v":"N/A"},{"$f":"Resident!P$39","v":0},"All pathways (mean)",null,{"$f":"IFERROR(Resident!U$38,\"N/A\")","v":"N/A"},{"$f":"Resident!U$39","v":0},"All pathways (mean)",null,{"$f":"Resident!Z$39","v":"N/A"}]
["Bystander - adult",{"$f":"i_SubstName1","v":0},null,"Exposure (mg/kg bw/d)","%AAOEL",{"$f":"i_SubstName2","v":0},null,"Exposure (mg/kg bw/d)","%AAOEL",{"$f":"i_SubstName3","v":0},null,"Exposure (mg/kg bw/d)","%AAOEL",{"$f":"i_SubstName4","v":0},null,"Exposure (mg/kg bw/d)","%AAOEL","Combined",null,"Hazard Index"]
[null,"Spray drift (95th percentile)",null,{"$f":"Bystander!B$28","v":0},{"$f":"Bystander!B29","v":0},"Spray drift (95th percentile)",null,{"$f":"Bystander!F$28","v":0},{"$f":"Bystander!F29","v":0},"Spray drift (95th percentile)",null,{"$f":"Bystander!J$28","v":0},{"$f":"Bystander!J29","v":0},"Spray drift (95th percentile)",null,{"$f":"Bystander!N$28","v":0},{"$f":"Bystander!N29","v":0},"Spray drift (95th percentile)",null,{"$f":"Bystander!R$29","v":"N/A"}]
[null,"Vapour (95th percentile)",null,{"$f":"Bystander!C$28","v":2.7E-4},{"$f":"Bystander!C29","v":0},"Vapour (95th percentile)",null,{"$f":"Bystander!G$28","v":2.7E-4},{"$f":"Bystander!G29","v":0},"Vapour (95th percentile)",null,{"$f":"Bystander!K$28","v":2.7E-4},{"$f":"Bystander!K29","v":0},"Vapour (95th percentile)",null,{"$f":"Bystander!O$28","v":2.7E-4},{"$f":"Bystander!O29","v":0},"Vapour (95th percentile)",null,{"$f":"Bystander!S$29","v":"N/A"}]
[null,"Surface deposits (95th percentile)",null,{"$f":"Bystander!D$28","v":""},{"$f":"Bystander!D29","v":0},"Surface deposits (95th percentile)",null,{"$f":"Bystander!H$28","v":""},{"$f":"Bystander!H29","v":0},"Surface deposits (95th percentile)",null,{"$f":"Bystander!L$28","v":""},{"$f":"Bystander!L29","v":0},"Surface deposits (95th percentile)",null,{"$f":"Bystander!P$28","v":""},{"$f":"Bystander!P29","v":0},"Surface deposits (95th percentile)",null,{"$f":"Bystander!T$29","v":"N/A"}]
[null,"Entry into treated crops (95th percentile)",null,{"$f":"Bystander!E$28","v":0},{"$f":"Bystander!E29","v":0},"Entry into treated crops (95th percentile)",null,{"$f":"Bystander!I$28","v":0},{"$f":"Bystander!I29","v":0},"Entry into treated crops (95th percentile)",null,{"$f":"Bystander!M$28","v":0},{"$f":"Bystander!M29","v":0},"Entry into treated crops (95th percentile)",null,{"$f":"Bystander!Q$28","v":0},{"$f":"Bystander!Q29","v":0},"Entry into treated crops (95th percentile)",null,{"$f":"Bystander!U$29","v":"N/A"}]
["Bystander - child","Spray drift (95th percentile)",null,{"$f":"Bystander!B$32","v":0},{"$f":"Bystander!B33","v":0},"Spray drift (95th percentile)",null,{"$f":"Bystander!F$32","v":0},{"$f":"Bystander!F33","v":0},"Spray drift (95th percentile)",null,{"$f":"Bystander!J$32","v":0},{"$f":"Bystander!J33","v":0},"Spray drift (95th percentile)",null,{"$f":"Bystander!N$32","v":0},{"$f":"Bystander!N33","v":0},"Spray drift (95th percentile)",null,{"$f":"Bystander!R$33","v":"N/A"}]
[null,"Vapour (95th percentile)",null,{"$f":"Bystander!C$32","v":8.0000000000000004E-4},{"$f":"Bystander!C33","v":0},"Vapour (95th percentile)",null,{"$f":"Bystander!G$32","v":8.0000000000000004E-4},{"$f":"Bystander!G33","v":0},"Vapour (95th percentile)",null,{"$f":"Bystander!K$32","v":8.0000000000000004E-4},{"$f":"Bystander!K33","v":0},"Vapour (95th percentile)",null,{"$f":"Bystander!O$32","v":8.0000000000000004E-4},{"$f":"Bystander!O33","v":0},"Vapour (95th percentile)",null,{"$f":"Bystander!S$33","v":"N/A"}]
[null,"Surface deposits (95th percentile)",null,{"$f":"Bystander!D$32","v":{"$error":"#VALUE!"}},{"$f":"Bystander!D33","v":0},"Surface deposits (95th percentile)",null,{"$f":"Bystander!H$32","v":{"$error":"#VALUE!"}},{"$f":"Bystander!H33","v":0},"Surface deposits (95th percentile)",null,{"$f":"Bystander!L$32","v":{"$error":"#VALUE!"}},{"$f":"Bystander!L33","v":0},"Surface deposits (95th percentile)",null,{"$f":"Bystander!P$32","v":{"$error":"#VALUE!"}},{"$f":"Bystander!P33","v":0},"Surface deposits (95th percentile)",null,{"$f":"Bystander!T$33","v":"N/A"}]
[null,"Entry into treated crops (95th percentile)",null,{"$f":"Bystander!E$32","v":0},{"$f":"Bystander!E33","v":0},"Entry into treated crops (95th percentile)",null,{"$f":"Bystander!I$32","v":0},{"$f":"Bystander!I33","v":0},"Entry into treated crops (95th percentile)",null,{"$f":"Bystander!M$32","v":0},{"$f":"Bystander!M33","v":0},"Entry into treated crops (95th percentile)",null,{"$f":"Bystander!Q$32","v":0},{"$f":"Bystander!Q33","v":0},"Entry into treated crops (95th percentile)",null,{"$f":"Bystander!U$33","v":"N/A"}]
["Recreational Exposure",{"$f":"i_SubstName1","v":0},null,null,null,{"$f":"i_SubstName2","v":0},null,null,null,{"$f":"i_SubstName3","v":0},null,null,null,{"$f":"i_SubstName4","v":0},null,null,null,"Combined"]
[null,"Child (%AOEL):",{"$f":"IFERROR('Recreational Exposure'!C32,\"N/A\")","v":0},"Adult (%AOEL):",{"$f":"IFERROR('Recreational Exposure'!C35,\"N/A\")","v":0},"Child (%AOEL):",{"$f":"IFERROR('Recreational Exposure'!E32,\"N/A\")","v":0},"Adult (%AOEL):",{"$f":"IFERROR('Recreational Exposure'!E35,\"N/A\")","v":0},"Child (%AOEL):",{"$f":"IFERROR('Recreational Exposure'!G32,\"N/A\")","v":0},"Adult (%AOEL):",{"$f":"IFERROR('Recreational Exposure'!G35,\"N/A\")","v":0},"Child (%AOEL):",{"$f":"IFERROR('Recreational Exposure'!I32,\"N/A\")","v":0},"Adult (%AOEL):",{"$f":"IFERROR('Recreational Exposure'!I35,\"N/A\")","v":0},"Child (HI): ",{"$f":"IFERROR('Recreational Exposure'!J32,\"N/A\")","v":""},"Adult (HI):",{"$f":"IFERROR('Recreational Exposure'!J35,\"N/A\")","v":""}]
[{"$f":"Instructions!A14","v":"Latest offline calculator update: 02 August 2023"}]

{"sheet":"Trolley","index":8,"n_rows":117,"n_cols":13,"rows_kept":117,"cut":false,"hidden":true,"merged":[[115,1,115,2],[116,1,116,2],[109,1,109,2],[110,1,110,2],[111,1,111,2],[112,1,112,2],[113,1,113,2],[114,1,114,2],[103,9,103,10],[104,1,104,2],[105,1,105,2],[106,1,106,2],[107,1,107,2],[108,1,108,2],[99,1,99,2],[100,1,100,2],[101,1,101,2],[103,3,103,4],[103,5,103,6],[103,7,103,8],[93,1,93,2],[94,1,94,2],[95,1,95,2],[96,1,96,2],[97,1,97,2],[98,1,98,2],[87,9,87,10],[88,1,88,2],[89,1,89,2],[90,1,90,2],[91,1,91,2],[92,1,92,2],[82,1,82,2],[83,1,83,2],[84,1,84,2],[87,3,87,4],[87,5,87,6],[87,7,87,8],[76,1,76,2],[77,1,77,2],[78,1,78,2],[79,1,79,2],[80,1,80,2],[81,1,81,2],[71,7,71,8],[71,9,71,10],[72,1,72,2],[73,1,73,2],[74,1,74,2],[75,1,75,2],[67,1,67,2],[68,1,68,2],[69,1,69,2],[71,1,71,2],[71,3,71,4],[71,5,71,6],[61,1,61,2],[62,1,62,2],[63,1,63,2],[64,1,64,2],[65,1,65,2],[66,1,66,2],[55,9,55,10],[56,1,56,2],[57,1,57,2],[58,1,58,2],[59,1,59,2],[60,1,60,2],[51,1,51,2],[53,4,53,5],[54,4,54,5],[55,3,55,4],[55,5,55,6],[55,7,55,8],[45,1,45,12],[46,1,46,2],[47,1,47,2],[48,1,48,2],[49,1,49,12],[50,1,50,2],[39,3,39,4],[39,11,39,12],[40,3,40,4],[41,3,41,4],[41,11,41,12],[43,3,43,4],[43,5,43,6],[43,7,43,8],[43,9,43,10],[43,11,43,12],[29,11,30,11],[29,12,30,12],[31,12,36,12],[37,3,37,4],[38,3,38,4],[38,11,38,12],[28,1,41,1],[28,3,28,4],[28,5,28,6],[28,7,28,8],[28,9,28,10],[29,2,30,2],[29,3,29,4],[29,5,29,6],[29,7,29,8],[29,9,29,10],[14,11,15,11],[14,12,15,12],[23,3,23,4],[24,3,24,4],[25,3,25,4],[26,3,26,4],[14,1,27,1],[14,2,15,2],[14,3,14,4],[14,5,14,6],[14,7,14,8],[14,9,14,10],[27,3,27,4],[8,3,8,10],[9,3,9,10],[10,3,10,10],[11,3,11,10],[12,1,12,12],[13,3,13,4],[13,5,13,6],[13,7,13,8],[13,9,13,10],[6,3,6,10],[7,3,7,10],[3,3,3,4],[3,5,3,6],[3,7,3,8],[3,9,3,10],[4,3,4,4],[4,5,4,6],[4,7,4,8],[4,9,4,10],[1,3,1,4],[1,5,1,6],[1,7,1,8],[1,9,1,10],[2,3,2,4],[2,5,2,6],[2,7,2,8],[2,9,2,10],[5,3,5,4],[5,5,5,6],[5,7,5,8],[5,9,5,10]]}
[null,{"$f":"\"Operator exposure for \"&i_ProductName & \" spray applications\"","v":"Operator exposure for  spray applications"},null,null,null,{"$f":"IF(i_FormVal <> \"Granules, fine granules\",\"\",\"This sheet is only to be used for spray applications\")","v":""}]
[null,null,null,{"$f":"i_SubstName1","v":0},null,{"$f":"i_SubstName2","v":0},null,{"$f":"i_SubstName3","v":0},null,{"$f":"i_SubstName4","v":0}]
[null,"Application rate of active substance",null,{"$f":"i_AppRateAS1*0.9","v":0},null,{"$f":"i_AppRateAS2*0.9","v":0},null,{"$f":"i_AppRateAS3*0.9","v":0},null,{"$f":"i_AppRateAS4*0.9","v":0},null,"kg a.s./ha","i_AppRateAS"]
[null,"Amount of active substance applied",null,{"$f":"d_AreaTreated*i_AppRateAS1","v":0},null,{"$f":"d_AreaTreated*i_AppRateAS2","v":0},null,{"$f":"d_AreaTreated*i_AppRateAS3","v":0},null,{"$f":"d_AreaTreated*i_AppRateAS4","v":0},null,"kg a.s./day","i_AmountAS"]
[null,"Dermal absorption of the product",null,{"$f":"i_AbsorpProduct1","v":0},null,{"$f":"i_AbsorpProduct2","v":0},null,{"$f":"i_AbsorpProduct3","v":0},null,{"$f":"i_AbsorpProduct4","v":0},null,null,"i_AbsorpProduct"]
[null,"Dermal absorption of in-use dilution",null,{"$f":"i_AbsorpInuse1","v":0},null,{"$f":"i_AbsorpInuse2","v":0},null,{"$f":"i_AbsorpInuse3","v":0},null,{"$f":"i_AbsorpInuse4","v":0},null,null,"i_AbsorInuse"]
[null,"Formulation type",null,{"$f":"i_FormVal","v":0}]
[null,"Indoor or Outdoor application",null,{"$f":"'Data entry'!D8","v":0}]
[null,"Application method",null,{"$f":"i_AppMeth","v":0}]
[null,"Application equipment",null,{"$f":"i_AppEquip","v":0}]
[null,"Assumed area treated",null,{"$f":"d_AreaTreated","v":1},null,null,null,null,null,null,null,"ha/day","d_AreaTreated"]
[null,"Season",null,{"$f":"i_Season","v":"not relevant"}]
[null,{"$f":"i_IndoorOutdoor&i_FormVal&i_AppMeth&\"Manual-Trolley\"","v":"Manual-Trolley"}]
[null,null,null,{"$f":"i_SubstName1","v":0},null,{"$f":"i_SubstName2","v":0},null,{"$f":"i_SubstName3","v":0},null,{"$f":"i_SubstName4","v":0}]
[null,"Mixing and loading","Exposure values ","µg exposure/day mixed and loaded",null,"µg exposure/day mixed and loaded",null,"µg exposure/day mixed and loaded",null,"µg exposure/day mixed and loaded",null,"Reference ","Comment"]
[null,null,null,"75th percentile","95th percentile ","75th percentile","95th percentile ","75th percentile","95th percentile ","75th percentile","95th percentile "]
[null,null,"Hands",{"$f":"IF(ISBLANK(INDEX(ay_OpExAOEM,MATCH(sys_KeyOperator&\"Hands\",key_AOEM,0),10)),10^(INDEX(ay_OpExAOEM,MATCH(sys_KeyOperator&\"Hands\",key_AOEM,0),7)+(LOG(i_AmountAS1)*INDEX(ay_OpExAOEM,MATCH(sys_KeyOperator&\"Hands\",key_AOEM,0),8))+INDEX(ay_OpExAOEM,MATCH(sys_KeyOperator&\"Hands\",key_AOEM,0),9)),MAX(INDEX(ay_OpExAOEM,MATCH(sys_KeyOperator&\"Hands\",key_AOEM,0),10),(INDEX(ay_OpExAOEM,MATCH(sys_KeyOperator&\"Hands\",key_AOEM,0),10)/1.5)*i_AmountAS1))","v":{"$error":"#N/A"}},{"$f":"IF(ISBLANK(INDEX(ay_OpExAOEM,MATCH(sys_KeyOperator&\"Hands\",key_AOEM,0),14)),10^(INDEX(ay_OpExAOEM,MATCH(sys_KeyOperator&\"Hands\",key_AOEM,0),11)+(LOG(i_AmountAS1)*INDEX(ay_OpExAOEM,MATCH(sys_KeyOperator&\"Hands\",key_AOEM,0),12))+INDEX(ay_OpExAOEM,MATCH(sys_KeyOperator&\"Hands\",key_AOEM,0),13)),MAX(INDEX(ay_OpExAOEM,MATCH(sys_KeyOperator&\"Hands\",key_AOEM,0),14),(INDEX(ay_OpExAOEM,MATCH(sys_KeyOperator&\"Hands\",key_AOEM,0),14)/1.5)*i_AmountAS1))","v":{"$error":"#N/A"}},{"$f":"IF(ISBLANK(INDEX(ay_OpExAOEM,MATCH(sys_KeyOperator&\"Hands\",key_AOEM,0),10)),10^(INDEX(ay_OpExAOEM,MATCH(sys_KeyOperator&\"Hands\",key_AOEM,0),7)+(LOG(i_AmountAS2)*INDEX(ay_OpExAOEM,MATCH(sys_KeyOperator&\"Hands\",key_AOEM,0),8))+INDEX(ay_OpExAOEM,MATCH(sys_KeyOperator&\"Hands\",key_AOEM,0),9)),MAX(INDEX(ay_OpExAOEM,MATCH(sys_KeyOperator&\"Hands\",key_AOEM,0),10),(INDEX(ay_OpExAOEM,MATCH(sys_KeyOperator&\"Hands\",key_AOEM,0),10)/1.5)*i_AmountAS2))","v":{"$error":"#N/A"}},{"$f":"IF(ISBLANK(INDEX(ay_OpExAOEM,MATCH(sys_KeyOperator&\"Hands\",key_AOEM,0),14)),10^(INDEX(ay_OpExAOEM,MATCH(sys_KeyOperator&\"Hands\",key_AOEM,0),11)+(LOG(i_AmountAS2)*INDEX(ay_OpExAOEM,MATCH(sys_KeyOperator&\"Hands\",key_AOEM,0),12))+INDEX(ay_OpExAOEM,MATCH(sys_KeyOperator&\"Hands\",key_AOEM,0),13)),MAX(INDEX(ay_OpExAOEM,MATCH(sys_KeyOperator&\"Hands\",key_AOEM,0),14),(INDEX(ay_OpExAOEM,MATCH(sys_KeyOperator&\"Hands\",key_AOEM,0),14)/1.5)*i_AmountAS2))","v":{"$error":"#N/A"}},{"$f":"IF(ISBLANK(INDEX(ay_OpExAOEM,MATCH(sys_KeyOperator&\"Hands\",key_AOEM,0),10)),10^(INDEX(ay_OpExAOEM,MATCH(sys_KeyOperator&\"Hands\",key_AOEM,0),7)+(LOG(i_AmountAS3)*INDEX(ay_OpExAOEM,MATCH(sys_KeyOperator&\"Hands\",key_AOEM,0),8))+INDEX(ay_OpExAOEM,MATCH(sys_KeyOperator&\"Hands\",key_AOEM,0),9)),MAX(INDEX(ay_OpExAOEM,MATCH(sys_KeyOperator&\"Hands\",key_AOEM,0),10),(INDEX(ay_OpExAOEM,MATCH(sys_KeyOperator&\"Hands\",key_AOEM,0),10)/1.5)*i_AmountAS3))","v":{"$error":"#N/A"}},{"$f":"IF(ISBLANK(INDEX(ay_OpExAOEM,MATCH(sys_KeyOperator&\"Hands\",key_AOEM,0),14)),10^(INDEX(ay_OpExAOEM,MATCH(sys_KeyOperator&\"Hands\",key_AOEM,0),11)+(LOG(i_AmountAS3)*INDEX(ay_OpExAOEM,MATCH(sys_KeyOperator&\"Hands\",key_AOEM,0),12))+INDEX(ay_OpExAOEM,MATCH(sys_KeyOperator&\"Hands\",key_AOEM,0),13)),MAX(INDEX(ay_OpExAOEM,MATCH(sys_KeyOperator&\"Hands\",key_AOEM,0),14),(INDEX(ay_OpExAOEM,MATCH(sys_KeyOperator&\"Hands\",key_AOEM,0),14)/1.5)*i_AmountAS3))","v":{"$error":"#N/A"}},{"$f":"IF(ISBLANK(INDEX(ay_OpExAOEM,MATCH(sys_KeyOperator&\"Hands\",key_AOEM,0),10)),10^(INDEX(ay_OpExAOEM,MATCH(sys_KeyOperator&\"Hands\",key_AOEM,0),7)+(LOG(i_AmountAS4)*INDEX(ay_OpExAOEM,MATCH(sys_KeyOperator&\"Hands\",key_AOEM,0),8))+INDEX(ay_OpExAOEM,MATCH(sys_KeyOperator&\"Hands\",key_AOEM,0),9)),MAX(INDEX(ay_OpExAOEM,MATCH(sys_KeyOperator&\"Hands\",key_AOEM,0),10),(INDEX(ay_OpExAOEM,MATCH(sys_KeyOperator&\"Hands\",key_AOEM,0),10)/1.5)*i_AmountAS4))","v":{"$error":"#N/A"}},{"$f":"IF(ISBLANK(INDEX(ay_OpExAOEM,MATCH(sys_KeyOperator&\"Hands\",key_AOEM,0),14)),10^(INDEX(ay_OpExAOEM,MATCH(sys_KeyOperator&\"Hands\",key_AOEM,0),11)+(LOG(i_AmountAS4)*INDEX(ay_OpExAOEM,MATCH(sys_KeyOperator&\"Hands\",key_AOEM,0),12))+INDEX(ay_OpExAOEM,MATCH(sys_KeyOperator&\"Hands\",key_AOEM,0),13)),MAX(INDEX(ay_OpExAOEM,MATCH(sys_KeyOperator&\"Hands\",key_AOEM,0),14),(INDEX(ay_OpExAOEM,MATCH(sys_KeyOperator&\"Hands\",key_AOEM,0),14)/1.5)*i_AmountAS4))","v":{"$error":"#N/A"}},"AOEM"]
[null,null,"Body",{"$f":"IF(ISBLANK(INDEX(ay_OpExAOEM,MATCH(sys_KeyOperator&\"Body\",key_AOEM,0),10)),10^(INDEX(ay_OpExAOEM,MATCH(sys_KeyOperator&\"Body\",key_AOEM,0),7)+(LOG(i_AmountAS1)*INDEX(ay_OpExAOEM,MATCH(sys_KeyOperator&\"Body\",key_AOEM,0),8))+INDEX(ay_OpExAOEM,MATCH(sys_KeyOperator&\"Body\",key_AOEM,0),9)),MAX(INDEX(ay_OpExAOEM,MATCH(sys_KeyOperator&\"Body\",key_AOEM,0),10),(INDEX(ay_OpExAOEM,MATCH(sys_KeyOperator&\"Body\",key_AOEM,0),10)/1.5)*i_AmountAS1))","v":{"$error":"#N/A"}},{"$f":"IF(ISBLANK(INDEX(ay_OpExAOEM,MATCH(sys_KeyOperator&\"Body\",key_AOEM,0),14)), 10^(INDEX(ay_OpExAOEM,MATCH(sys_KeyOperator&\"Body\",key_AOEM,0),11) +(LOG(i_AmountAS1)*INDEX(ay_OpExAOEM,MATCH(sys_KeyOperator&\"Body\",key_AOEM,0),12)) +INDEX(ay_OpExAOEM,MATCH(sys_KeyOperator&\"Body\",key_AOEM,0),13)),MAX(INDEX(ay_OpExAOEM,MATCH(sys_KeyOperator&\"Body\",key_AOEM,0),14),(INDEX(ay_OpExAOEM,MATCH(sys_KeyOperator&\"Body\",key_AOEM,0),14) /1.5)*i_AmountAS1))","v":{"$error":"#N/A"}},{"$f":"IF(ISBLANK(INDEX(ay_OpExAOEM,MATCH(sys_KeyOperator&\"Body\",key_AOEM,0),10)),10^(INDEX(ay_OpExAOEM,MATCH(sys_KeyOperator&\"Body\",key_AOEM,0),7)+(LOG(i_AmountAS2)*INDEX(ay_OpExAOEM,MATCH(sys_KeyOperator&\"Body\",key_AOEM,0),8))+INDEX(ay_OpExAOEM,MATCH(sys_KeyOperator&\"Body\",key_AOEM,0),9)),MAX(INDEX(ay_OpExAOEM,MATCH(sys_KeyOperator&\"Body\",key_AOEM,0),10),(INDEX(ay_OpExAOEM,MATCH(sys_KeyOperator&\"Body\",key_AOEM,0),10)/1.5)*i_AmountAS2))","v":{"$error":"#N/A"}},{"$f":"IF(ISBLANK(INDEX(ay_OpExAOEM,MATCH(sys_KeyOperator&\"Body\",key_AOEM,0),14)), 10^(INDEX(ay_OpExAOEM,MATCH(sys_KeyOperator&\"Body\",key_AOEM,0),11) +(LOG(i_AmountAS2)*INDEX(ay_OpExAOEM,MATCH(sys_KeyOperator&\"Body\",key_AOEM,0),12)) +INDEX(ay_OpExAOEM,MATCH(sys_KeyOperator&\"Body\",key_AOEM,0),13)),MAX(INDEX(ay_OpExAOEM,MATCH(sys_KeyOperator&\"Body\",key_AOEM,0),14),(INDEX(ay_OpExAOEM,MATCH(sys_KeyOperator&\"Body\",key_AOEM,0),14) /1.5)*i_AmountAS2))","v":{"$error":"#N/A"}},{"$f":"IF(ISBLANK(INDEX(ay_OpExAOEM,MATCH(sys_KeyOperator&\"Body\",key_AOEM,0),10)),10^(INDEX(ay_OpExAOEM,MATCH(sys_KeyOperator&\"Body\",key_AOEM,0),7)+(LOG(i_AmountAS3)*INDEX(ay_OpExAOEM,MATCH(sys_KeyOperator&\"Body\",key_AOEM,0),8))+INDEX(ay_OpExAOEM,MATCH(sys_KeyOperator&\"Body\",key_AOEM,0),9)),MAX(INDEX(ay_OpExAOEM,MATCH(sys_KeyOperator&\"Body\",key_AOEM,0),10),(INDEX(ay_OpExAOEM,MATCH(sys_KeyOperator&\"Body\",key_AOEM,0),10)/1.5)*i_AmountAS3))","v":{"$error":"#N/A"}},{"$f":"IF(ISBLANK(INDEX(ay_OpExAOEM,MATCH(sys_KeyOperator&\"Body\",key_AOEM,0),14)), 10^(INDEX(ay_OpExAOEM,MATCH(sys_KeyOperator&\"Body\",key_AOEM,0),11) +(LOG(i_AmountAS3)*INDEX(ay_OpExAOEM,MATCH(sys_KeyOperator&\"Body\",key_AOEM,0),12)) +INDEX(ay_OpExAOEM,MATCH(sys_KeyOperator&\"Body\",key_AOEM,0),13)),MAX(INDEX(ay_OpExAOEM,MATCH(sys_KeyOperator&\"Body\",key_AOEM,0),14),(INDEX(ay_OpExAOEM,MATCH(sys_KeyOperator&\"Body\",key_AOEM,0),14) /1.5)*i_AmountAS3))","v":{"$error":"#N/A"}},{"$f":"IF(ISBLANK(INDEX(ay_OpExAOEM,MATCH(sys_KeyOperator&\"Body\",key_AOEM,0),10)),10^(INDEX(ay_OpExAOEM,MATCH(sys_KeyOperator&\"Body\",key_AOEM,0),7)+(LOG(i_AmountAS4)*INDEX(ay_OpExAOEM,MATCH(sys_KeyOperator&\"Body\",key_AOEM,0),8))+INDEX(ay_OpExAOEM,MATCH(sys_KeyOperator&\"Body\",key_AOEM,0),9)),MAX(INDEX(ay_OpExAOEM,MATCH(sys_KeyOperator&\"Body\",key_AOEM,0),10),(INDEX(ay_OpExAOEM,MATCH(sys_KeyOperator&\"Body\",key_AOEM,0),10)/1.5)*i_AmountAS4))","v":{"$error":"#N/A"}},{"$f":"IF(ISBLANK(INDEX(ay_OpExAOEM,MATCH(sys_KeyOperator&\"Body\",key_AOEM,0),14)), 10^(INDEX(ay_OpExAOEM,MATCH(sys_KeyOperator&\"Body\",key_AOEM,0),11) +(LOG(i_AmountAS4)*INDEX(ay_OpExAOEM,MATCH(sys_KeyOperator&\"Body\",key_AOEM,0),12)) +INDEX(ay_OpExAOEM,MATCH(sys_KeyOperator&\"Body\",key_AOEM,0),13)),MAX(INDEX(ay_OpExAOEM,MATCH(sys_KeyOperator&\"Body\",key_AOEM,0),14),(INDEX(ay_OpExAOEM,MATCH(sys_KeyOperator&\"Body\",key_AOEM,0),14) /1.5)*i_AmountAS4))","v":{"$error":"#N/A"}},"AOEM"]
[null,null,"Head",{"$f":"IF(ISBLANK(INDEX(ay_OpExAOEM,MATCH(sys_KeyOperator&\"Head\",key_AOEM,0),10)),10^(INDEX(ay_OpExAOEM,MATCH(sys_KeyOperator&\"Head\",key_AOEM,0),7)+(LOG(i_AmountAS1)*INDEX(ay_OpExAOEM,MATCH(sys_KeyOperator&\"Head\",key_AOEM,0),8))+INDEX(ay_OpExAOEM,MATCH(sys_KeyOperator&\"Head\",key_AOEM,0),9)),MAX(INDEX(ay_OpExAOEM,MATCH(sys_KeyOperator&\"Head\",key_AOEM,0),10),(INDEX(ay_OpExAOEM,MATCH(sys_KeyOperator&\"Head\",key_AOEM,0),10)/1.5)*i_AmountAS1))","v":{"$error":"#N/A"}},{"$f":"IF(ISBLANK(INDEX(ay_OpExAOEM,MATCH(sys_KeyOperator&\"Head\",key_AOEM,0),14)), 10^(INDEX(ay_OpExAOEM,MATCH(sys_KeyOperator&\"Head\",key_AOEM,0),11) +(LOG(i_AmountAS1)*INDEX(ay_OpExAOEM,MATCH(sys_KeyOperator&\"Head\",key_AOEM,0),12)) +INDEX(ay_OpExAOEM,MATCH(sys_KeyOperator&\"Head\",key_AOEM,0),13)),MAX(INDEX(ay_OpExAOEM,MATCH(sys_KeyOperator&\"Head\",key_AOEM,0),14),(INDEX(ay_OpExAOEM,MATCH(sys_KeyOperator&\"Head\",key_AOEM,0),14) /1.5)*i_AmountAS1))","v":{"$error":"#N/A"}},{"$f":"IF(ISBLANK(INDEX(ay_OpExAOEM,MATCH(sys_KeyOperator&\"Head\",key_AOEM,0),10)),10^(INDEX(ay_OpExAOEM,MATCH(sys_KeyOperator&\"Head\",key_AOEM,0),7)+(LOG(i_AmountAS2)*INDEX(ay_OpExAOEM,MATCH(sys_KeyOperator&\"Head\",key_AOEM,0),8))+INDEX(ay_OpExAOEM,MATCH(sys_KeyOperator&\"Head\",key_AOEM,0),9)),MAX(INDEX(ay_OpExAOEM,MATCH(sys_KeyOperator&\"Head\",key_AOEM,0),10),(INDEX(ay_OpExAOEM,MATCH(sys_KeyOperator&\"Head\",key_AOEM,0),10)/1.5)*i_AmountAS2))","v":{"$error":"#N/A"}},{"$f":"IF(ISBLANK(INDEX(ay_OpExAOEM,MATCH(sys_KeyOperator&\"Head\",key_AOEM,0),14)), 10^(INDEX(ay_OpExAOEM,MATCH(sys_KeyOperator&\"Head\",key_AOEM,0),11) +(LOG(i_AmountAS2)*INDEX(ay_OpExAOEM,MATCH(sys_KeyOperator&\"Head\",key_AOEM,0),12)) +INDEX(ay_OpExAOEM,MATCH(sys_KeyOperator&\"Head\",key_AOEM,0),13)),MAX(INDEX(ay_OpExAOEM,MATCH(sys_KeyOperator&\"Head\",key_AOEM,0),14),(INDEX(ay_OpExAOEM,MATCH(sys_KeyOperator&\"Head\",key_AOEM,0),14) /1.5)*i_AmountAS2))","v":{"$error":"#N/A"}},{"$f":"IF(ISBLANK(INDEX(ay_OpExAOEM,MATCH(sys_KeyOperator&\"Head\",key_AOEM,0),10)),10^(INDEX(ay_OpExAOEM,MATCH(sys_KeyOperator&\"Head\",key_AOEM,0),7)+(LOG(i_AmountAS3)*INDEX(ay_OpExAOEM,MATCH(sys_KeyOperator&\"Head\",key_AOEM,0),8))+INDEX(ay_OpExAOEM,MATCH(sys_KeyOperator&\"Head\",key_AOEM,0),9)),MAX(INDEX(ay_OpExAOEM,MATCH(sys_KeyOperator&\"Head\",key_AOEM,0),10),(INDEX(ay_OpExAOEM,MATCH(sys_KeyOperator&\"Head\",key_AOEM,0),10)/1.5)*i_AmountAS3))","v":{"$error":"#N/A"}},{"$f":"IF(ISBLANK(INDEX(ay_OpExAOEM,MATCH(sys_KeyOperator&\"Head\",key_AOEM,0),14)), 10^(INDEX(ay_OpExAOEM,MATCH(sys_KeyOperator&\"Head\",key_AOEM,0),11) +(LOG(i_AmountAS3)*INDEX(ay_OpExAOEM,MATCH(sys_KeyOperator&\"Head\",key_AOEM,0),12)) +INDEX(ay_OpExAOEM,MATCH(sys_KeyOperator&\"Head\",key_AOEM,0),13)),MAX(INDEX(ay_OpExAOEM,MATCH(sys_KeyOperator&\"Head\",key_AOEM,0),14),(INDEX(ay_OpExAOEM,MATCH(sys_KeyOperator&\"Head\",key_AOEM,0),14) /1.5)*i_AmountAS3))","v":{"$error":"#N/A"}},{"$f":"IF(ISBLANK(INDEX(ay_OpExAOEM,MATCH(sys_KeyOperator&\"Head\",key_AOEM,0),10)),10^(INDEX(ay_OpExAOEM,MATCH(sys_KeyOperator&\"Head\",key_AOEM,0),7)+(LOG(i_AmountAS4)*INDEX(ay_OpExAOEM,MATCH(sys_KeyOperator&\"Head\",key_AOEM,0),8))+INDEX(ay_OpExAOEM,MATCH(sys_KeyOperator&\"Head\",key_AOEM,0),9)),MAX(INDEX(ay_OpExAOEM,MATCH(sys_KeyOperator&\"Head\",key_AOEM,0),10),(INDEX(ay_OpExAOEM,MATCH(sys_KeyOperator&\"Head\",key_AOEM,0),10)/1.5)*i_AmountAS4))","v":{"$error":"#N/A"}},{"$f":"IF(ISBLANK(INDEX(ay_OpExAOEM,MATCH(sys_KeyOperator&\"Head\",key_AOEM,0),14)), 10^(INDEX(ay_OpExAOEM,MATCH(sys_KeyOperator&\"Head\",key_AOEM,0),11) +(LOG(i_AmountAS4)*INDEX(ay_OpExAOEM,MATCH(sys_KeyOperator&\"Head\",key_AOEM,0),12)) +INDEX(ay_OpExAOEM,MATCH(sys_KeyOperator&\"Head\",key_AOEM,0),13)),MAX(INDEX(ay_OpExAOEM,MATCH(sys_KeyOperator&\"Head\",key_AOEM,0),14),(INDEX(ay_OpExAOEM,MATCH(sys_KeyOperator&\"Head\",key_AOEM,0),14) /1.5)*i_AmountAS4))","v":{"$error":"#N/A"}},"AOEM"]
[null,null,"Protected hands (gloves)",{"$f":"IF(ISBLANK(INDEX(ay_OpExAOEM,MATCH(sys_KeyOperator&\"Protected hands\",key_AOEM,0),10)),10^(INDEX(ay_OpExAOEM,MATCH(sys_KeyOperator&\"Protected hands\",key_AOEM,0),7)+(LOG(i_AmountAS1)*INDEX(ay_OpExAOEM,MATCH(sys_KeyOperator&\"Protected hands\",key_AOEM,0),8))+INDEX(ay_OpExAOEM,MATCH(sys_KeyOperator&\"Protected hands\",key_AOEM,0),9)),MAX(INDEX(ay_OpExAOEM,MATCH(sys_KeyOperator&\"Protected hands\",key_AOEM,0),10),(INDEX(ay_OpExAOEM,MATCH(sys_KeyOperator&\"Protected hands\",key_AOEM,0),10)/1.5)*i_AmountAS1))","v":{"$error":"#N/A"}},{"$f":"IF(ISBLANK(INDEX(ay_OpExAOEM,MATCH(sys_KeyOperator&\"Protected Hands\",key_AOEM,0),14)), 10^(INDEX(ay_OpExAOEM,MATCH(sys_KeyOperator&\"Protected Hands\",key_AOEM,0),11) +(LOG(i_AmountAS1)*INDEX(ay_OpExAOEM,MATCH(sys_KeyOperator&\"Protected Hands\",key_AOEM,0),12)) +INDEX(ay_OpExAOEM,MATCH(sys_KeyOperator&\"Protected Hands\",key_AOEM,0),13)),MAX(INDEX(ay_OpExAOEM,MATCH(sys_KeyOperator&\"Protected Hands\",key_AOEM,0),14),(INDEX(ay_OpExAOEM,MATCH(sys_KeyOperator&\"Protected Hands\",key_AOEM,0),14) /1.5)*i_AmountAS1))","v":{"$error":"#N/A"}},{"$f":"IF(ISBLANK(INDEX(ay_OpExAOEM,MATCH(sys_KeyOperator&\"Protected hands\",key_AOEM,0),10)),10^(INDEX(ay_OpExAOEM,MATCH(sys_KeyOperator&\"Protected hands\",key_AOEM,0),7)+(LOG(i_AmountAS2)*INDEX(ay_OpExAOEM,MATCH(sys_KeyOperator&\"Protected hands\",key_AOEM,0),8))+INDEX(ay_OpExAOEM,MATCH(sys_KeyOperator&\"Protected hands\",key_AOEM,0),9)),MAX(INDEX(ay_OpExAOEM,MATCH(sys_KeyOperator&\"Protected hands\",key_AOEM,0),10),(INDEX(ay_OpExAOEM,MATCH(sys_KeyOperator&\"Protected hands\",key_AOEM,0),10)/1.5)*i_AmountAS2))","v":{"$error":"#N/A"}},{"$f":"IF(ISBLANK(INDEX(ay_OpExAOEM,MATCH(sys_KeyOperator&\"Protected Hands\",key_AOEM,0),14)), 10^(INDEX(ay_OpExAOEM,MATCH(sys_KeyOperator&\"Protected Hands\",key_AOEM,0),11) +(LOG(i_AmountAS2)*INDEX(ay_OpExAOEM,MATCH(sys_KeyOperator&\"Protected Hands\",key_AOEM,0),12)) +INDEX(ay_OpExAOEM,MATCH(sys_KeyOperator&\"Protected Hands\",key_AOEM,0),13)),MAX(INDEX(ay_OpExAOEM,MATCH(sys_KeyOperator&\"Protected Hands\",key_AOEM,0),14),(INDEX(ay_OpExAOEM,MATCH(sys_KeyOperator&\"Protected Hands\",key_AOEM,0),14) /1.5)*i_AmountAS2))","v":{"$error":"#N/A"}},{"$f":"IF(ISBLANK(INDEX(ay_OpExAOEM,MATCH(sys_KeyOperator&\"Protected hands\",key_AOEM,0),10)),10^(INDEX(ay_OpExAOEM,MATCH(sys_KeyOperator&\"Protected hands\",key_AOEM,0),7)+(LOG(i_AmountAS3)*INDEX(ay_OpExAOEM,MATCH(sys_KeyOperator&\"Protected hands\",key_AOEM,0),8))+INDEX(ay_OpExAOEM,MATCH(sys_KeyOperator&\"Protected hands\",key_AOEM,0),9)),MAX(INDEX(ay_OpExAOEM,MATCH(sys_KeyOperator&\"Protected hands\",key_AOEM,0),10),(INDEX(ay_OpExAOEM,MATCH(sys_KeyOperator&\"Protected hands\",key_AOEM,0),10)/1.5)*i_AmountAS3))","v":{"$error":"#N/A"}},{"$f":"IF(ISBLANK(INDEX(ay_OpExAOEM,MATCH(sys_KeyOperator&\"Protected Hands\",key_AOEM,0),14)), 10^(INDEX(ay_OpExAOEM,MATCH(sys_KeyOperator&\"Protected Hands\",key_AOEM,0),11) +(LOG(i_AmountAS3)*INDEX(ay_OpExAOEM,MATCH(sys_KeyOperator&\"Protected Hands\",key_AOEM,0),12)) +INDEX(ay_OpExAOEM,MATCH(sys_KeyOperator&\"Protected Hands\",key_AOEM,0),13)),MAX(INDEX(ay_OpExAOEM,MATCH(sys_KeyOperator&\"Protected Hands\",key_AOEM,0),14),(INDEX(ay_OpExAOEM,MATCH(sys_KeyOperator&\"Protected Hands\",key_AOEM,0),14) /1.5)*i_AmountAS3))","v":{"$error":"#N/A"}},{"$f":"IF(ISBLANK(INDEX(ay_OpExAOEM,MATCH(sys_KeyOperator&\"Protected hands\",key_AOEM,0),10)),10^(INDEX(ay_OpExAOEM,MATCH(sys_KeyOperator&\"Protected hands\",key_AOEM,0),7)+(LOG(i_AmountAS4)*INDEX(ay_OpExAOEM,MATCH(sys_KeyOperator&\"Protected hands\",key_AOEM,0),8))+INDEX(ay_OpExAOEM,MATCH(sys_KeyOperator&\"Protected hands\",key_AOEM,0),9)),MAX(INDEX(ay_OpExAOEM,MATCH(sys_KeyOperator&\"Protected hands\",key_AOEM,0),10),(INDEX(ay_OpExAOEM,MATCH(sys_KeyOperator&\"Protected hands\",key_AOEM,0),10)/1.5)*i_AmountAS4))","v":{"$error":"#N/A"}},{"$f":"IF(ISBLANK(INDEX(ay_OpExAOEM,MATCH(sys_KeyOperator&\"Protected Hands\",key_AOEM,0),14)), 10^(INDEX(ay_OpExAOEM,MATCH(sys_KeyOperator&\"Protected Hands\",key_AOEM,0),11) +(LOG(i_AmountAS4)*INDEX(ay_OpExAOEM,MATCH(sys_KeyOperator&\"Protected Hands\",key_AOEM,0),12)) +INDEX(ay_OpExAOEM,MATCH(sys_KeyOperator&\"Protected Hands\",key_AOEM,0),13)),MAX(INDEX(ay_OpExAOEM,MATCH(sys_KeyOperator&\"Protected Hands\",key_AOEM,0),14),(INDEX(ay_OpExAOEM,MATCH(sys_KeyOperator&\"Protected Hands\",key_AOEM,0),14) /1.5)*i_AmountAS4))","v":{"$error":"#N/A"}},"AOEM"]
[null,null,"Protected body (workwear or protective garment and sturdy footwear)",{"$f":"IF(ISBLANK(INDEX(ay_OpExAOEM,MATCH(sys_KeyOperator&\"Protected Body\",key_AOEM,0),10)),10^(INDEX(ay_OpExAOEM,MATCH(sys_KeyOperator&\"Protected Body\",key_AOEM,0),7)+(LOG(i_AmountAS1)*INDEX(ay_OpExAOEM,MATCH(sys_KeyOperator&\"Protected Body\",key_AOEM,0),8))+INDEX(ay_OpExAOEM,MATCH(sys_KeyOperator&\"Protected Body\",key_AOEM,0),9)),MAX(INDEX(ay_OpExAOEM,MATCH(sys_KeyOperator&\"Protected Body\",key_AOEM,0),10),(INDEX(ay_OpExAOEM,MATCH(sys_KeyOperator&\"Protected Body\",key_AOEM,0),10)/1.5)*i_AmountAS1))","v":{"$error":"#N/A"}},{"$f":"IF(ISBLANK(INDEX(ay_OpExAOEM,MATCH(sys_KeyOperator&\"Protected Body\",key_AOEM,0),14)), 10^(INDEX(ay_OpExAOEM,MATCH(sys_KeyOperator&\"Protected Body\",key_AOEM,0),11) +(LOG(i_AmountAS1)*INDEX(ay_OpExAOEM,MATCH(sys_KeyOperator&\"Protected Body\",key_AOEM,0),12)) +INDEX(ay_OpExAOEM,MATCH(sys_KeyOperator&\"Protected Body\",key_AOEM,0),13)),MAX(INDEX(ay_OpExAOEM,MATCH(sys_KeyOperator&\"Protected Body\",key_AOEM,0),14),(INDEX(ay_OpExAOEM,MATCH(sys_KeyOperator&\"Protected Body\",key_AOEM,0),14) /1.5)*i_AmountAS1))","v":{"$error":"#N/A"}},{"$f":"IF(ISBLANK(INDEX(ay_OpExAOEM,MATCH(sys_KeyOperator&\"Protected Body\",key_AOEM,0),10)),10^(INDEX(ay_OpExAOEM,MATCH(sys_KeyOperator&\"Protected Body\",key_AOEM,0),7)+(LOG(i_AmountAS2)*INDEX(ay_OpExAOEM,MATCH(sys_KeyOperator&\"Protected Body\",key_AOEM,0),8))+INDEX(ay_OpExAOEM,MATCH(sys_KeyOperator&\"Protected Body\",key_AOEM,0),9)),MAX(INDEX(ay_OpExAOEM,MATCH(sys_KeyOperator&\"Protected Body\",key_AOEM,0),10),(INDEX(ay_OpExAOEM,MATCH(sys_KeyOperator&\"Protected Body\",key_AOEM,0),10)/1.5)*i_AmountAS2))","v":{"$error":"#N/A"}},{"$f":"IF(ISBLANK(INDEX(ay_OpExAOEM,MATCH(sys_KeyOperator&\"Protected Body\",key_AOEM,0),14)), 10^(INDEX(ay_OpExAOEM,MATCH(sys_KeyOperator&\"Protected Body\",key_AOEM,0),11) +(LOG(i_AmountAS2)*INDEX(ay_OpExAOEM,MATCH(sys_KeyOperator&\"Protected Body\",key_AOEM,0),12)) +INDEX(ay_OpExAOEM,MATCH(sys_KeyOperator&\"Protected Body\",key_AOEM,0),13)),MAX(INDEX(ay_OpExAOEM,MATCH(sys_KeyOperator&\"Protected Body\",key_AOEM,0),14),(INDEX(ay_OpExAOEM,MATCH(sys_KeyOperator&\"Protected Body\",key_AOEM,0),14) /1.5)*i_AmountAS2))","v":{"$error":"#N/A"}},{"$f":"IF(ISBLANK(INDEX(ay_OpExAOEM,MATCH(sys_KeyOperator&\"Protected Body\",key_AOEM,0),10)),10^(INDEX(ay_OpExAOEM,MATCH(sys_KeyOperator&\"Protected Body\",key_AOEM,0),7)+(LOG(i_AmountAS3)*INDEX(ay_OpExAOEM,MATCH(sys_KeyOperator&\"Protected Body\",key_AOEM,0),8))+INDEX(ay_OpExAOEM,MATCH(sys_KeyOperator&\"Protected Body\",key_AOEM,0),9)),MAX(INDEX(ay_OpExAOEM,MATCH(sys_KeyOperator&\"Protected Body\",key_AOEM,0),10),(INDEX(ay_OpExAOEM,MATCH(sys_KeyOperator&\"Protected Body\",key_AOEM,0),10)/1.5)*i_AmountAS3))","v":{"$error":"#N/A"}},{"$f":"IF(ISBLANK(INDEX(ay_OpExAOEM,MATCH(sys_KeyOperator&\"Protected Body\",key_AOEM,0),14)), 10^(INDEX(ay_OpExAOEM,MATCH(sys_KeyOperator&\"Protected Body\",key_AOEM,0),11) +(LOG(i_AmountAS3)*INDEX(ay_OpExAOEM,MATCH(sys_KeyOperator&\"Protected Body\",key_AOEM,0),12)) +INDEX(ay_OpExAOEM,MATCH(sys_KeyOperator&\"Protected Body\",key_AOEM,0),13)),MAX(INDEX(ay_OpExAOEM,MATCH(sys_KeyOperator&\"Protected Body\",key_AOEM,0),14),(INDEX(ay_OpExAOEM,MATCH(sys_KeyOperator&\"Protected Body\",key_AOEM,0),14) /1.5)*i_AmountAS3))","v":{"$error":"#N/A"}},{"$f":"IF(ISBLANK(INDEX(ay_OpExAOEM,MATCH(sys_KeyOperator&\"Protected Body\",key_AOEM,0),10)),10^(INDEX(ay_OpExAOEM,MATCH(sys_KeyOperator&\"Protected Body\",key_AOEM,0),7)+(LOG(i_AmountAS4)*INDEX(ay_OpExAOEM,MATCH(sys_KeyOperator&\"Protected Body\",key_AOEM,0),8))+INDEX(ay_OpExAOEM,MATCH(sys_KeyOperator&\"Protected Body\",key_AOEM,0),9)),MAX(INDEX(ay_OpExAOEM,MATCH(sys_KeyOperator&\"Protected Body\",key_AOEM,0),10),(INDEX(ay_OpExAOEM,MATCH(sys_KeyOperator&\"Protected Body\",key_AOEM,0),10)/1.5)*i_AmountAS4))","v":{"$error":"#N/A"}},{"$f":"IF(ISBLANK(INDEX(ay_OpExAOEM,MATCH(sys_KeyOperator&\"Protected Body\",key_AOEM,0),14)), 10^(INDEX(ay_OpExAOEM,MATCH(sys_KeyOperator&\"Protected Body\",key_AOEM,0),11) +(LOG(i_AmountAS4)*INDEX(ay_OpExAOEM,MATCH(sys_KeyOperator&\"Protected Body\",key_AOEM,0),12)) +INDEX(ay_OpExAOEM,MATCH(sys_KeyOperator&\"Protected Body\",key_AOEM,0),13)),MAX(INDEX(ay_OpExAOEM,MATCH(sys_KeyOperator&\"Protected Body\",key_AOEM,0),14),(INDEX(ay_OpExAOEM,MATCH(sys_KeyOperator&\"Protected Body\",key_AOEM,0),14) /1.5)*i_AmountAS4))","v":{"$error":"#N/A"}},"AOEM"]
[null,null,"Protected head (hood +/- face shield)",{"$f":"IF(ISBLANK(INDEX(ay_OpExAOEM,MATCH(sys_KeyOperator&\"Head\",key_AOEM,0),10)),10^(INDEX(ay_OpExAOEM,MATCH(sys_KeyOperator&\"Head\",key_AOEM,0),7)+(LOG(i_AmountAS1)*INDEX(ay_OpExAOEM,MATCH(sys_KeyOperator&\"Head\",key_AOEM,0),8))+INDEX(ay_OpExAOEM,MATCH(sys_KeyOperator&\"Head\",key_AOEM,0),9)+ d_head75ProtectionFactor),MAX(INDEX(ay_OpExAOEM,MATCH(sys_KeyOperator&\"Head\",key_AOEM,0),10),(INDEX(ay_OpExAOEM,MATCH(sys_KeyOperator&\"Head\",key_AOEM,0),10)/1.5)*i_AmountAS1))*IF(ISNUMBER(Hole_F25),Hole_F25,1)","v":{"$error":"#N/A"}},{"$f":"IF(ISBLANK(INDEX(ay_OpExAOEM,MATCH(sys_KeyOperator&\"Head\",key_AOEM,0),14)), 10^(INDEX(ay_OpExAOEM,MATCH(sys_KeyOperator&\"Head\",key_AOEM,0),11) +(LOG(i_AmountAS1)*INDEX(ay_OpExAOEM,MATCH(sys_KeyOperator&\"Head\",key_AOEM,0),12)) +INDEX(ay_OpExAOEM,MATCH(sys_KeyOperator&\"Head\",key_AOEM,0),13)+ d_head95ProtectionFactor),MAX(INDEX(ay_OpExAOEM,MATCH(sys_KeyOperator&\"Head\",key_AOEM,0),14),(INDEX(ay_OpExAOEM,MATCH(sys_KeyOperator&\"Head\",key_AOEM,0),14) /1.5)*i_AmountAS1))*IF(ISNUMBER(Hole_F25),Hole_F25,1)","v":{"$error":"#N/A"}},{"$f":"IF(ISBLANK(INDEX(ay_OpExAOEM,MATCH(sys_KeyOperator&\"Head\",key_AOEM,0),10)),10^(INDEX(ay_OpExAOEM,MATCH(sys_KeyOperator&\"Head\",key_AOEM,0),7)+(LOG(i_AmountAS2)*INDEX(ay_OpExAOEM,MATCH(sys_KeyOperator&\"Head\",key_AOEM,0),8))+INDEX(ay_OpExAOEM,MATCH(sys_KeyOperator&\"Head\",key_AOEM,0),9)  + d_head75ProtectionFactor  ),MAX(INDEX(ay_OpExAOEM,MATCH(sys_KeyOperator&\"Head\",key_AOEM,0),10),(INDEX(ay_OpExAOEM,MATCH(sys_KeyOperator&\"Head\",key_AOEM,0),10)/1.5)*i_AmountAS2))*IF(ISNUMBER(Hole_F25),Hole_F25,1)","v":{"$error":"#N/A"}},{"$f":"IF(ISBLANK(INDEX(ay_OpExAOEM,MATCH(sys_KeyOperator&\"Head\",key_AOEM,0),14)), 10^(INDEX(ay_OpExAOEM,MATCH(sys_KeyOperator&\"Head\",key_AOEM,0),11) +(LOG(i_AmountAS2)*INDEX(ay_OpExAOEM,MATCH(sys_KeyOperator&\"Head\",key_AOEM,0),12)) +INDEX(ay_OpExAOEM,MATCH(sys_KeyOperator&\"Head\",key_AOEM,0),13)+ d_head95ProtectionFactor),MAX(INDEX(ay_OpExAOEM,MATCH(sys_KeyOperator&\"Head\",key_AOEM,0),14),(INDEX(ay_OpExAOEM,MATCH(sys_KeyOperator&\"Head\",key_AOEM,0),14) /1.5)*i_AmountAS2))*IF(ISNUMBER(Hole_F25),Hole_F25,1)","v":{"$error":"#N/A"}},{"$f":"IF(ISBLANK(INDEX(ay_OpExAOEM,MATCH(sys_KeyOperator&\"Head\",key_AOEM,0),10)),10^(INDEX(ay_OpExAOEM,MATCH(sys_KeyOperator&\"Head\",key_AOEM,0),7)+(LOG(i_AmountAS3)*INDEX(ay_OpExAOEM,MATCH(sys_KeyOperator&\"Head\",key_AOEM,0),8))+INDEX(ay_OpExAOEM,MATCH(sys_KeyOperator&\"Head\",key_AOEM,0),9)  + d_head75ProtectionFactor  ),MAX(INDEX(ay_OpExAOEM,MATCH(sys_KeyOperator&\"Head\",key_AOEM,0),10),(INDEX(ay_OpExAOEM,MATCH(sys_KeyOperator&\"Head\",key_AOEM,0),10)/1.5)*i_AmountAS3))*IF(ISNUMBER(Hole_F25),Hole_F25,1)","v":{"$error":"#N/A"}},{"$f":"IF(ISBLANK(INDEX(ay_OpExAOEM,MATCH(sys_KeyOperator&\"Head\",key_AOEM,0),14)), 10^(INDEX(ay_OpExAOEM,MATCH(sys_KeyOperator&\"Head\",key_AOEM,0),11) +(LOG(i_AmountAS3)*INDEX(ay_OpExAOEM,MATCH(sys_KeyOperator&\"Head\",key_AOEM,0),12)) +INDEX(ay_OpExAOEM,MATCH(sys_KeyOperator&\"Head\",key_AOEM,0),13)+ d_head95ProtectionFactor),MAX(INDEX(ay_OpExAOEM,MATCH(sys_KeyOperator&\"Head\",key_AOEM,0),14),(INDEX(ay_OpExAOEM,MATCH(sys_KeyOperator&\"Head\",key_AOEM,0),14) /1.5)*i_AmountAS3))*IF(ISNUMBER(Hole_F25),Hole_F25,1)","v":{"$error":"#N/A"}},{"$f":"IF(ISBLANK(INDEX(ay_OpExAOEM,MATCH(sys_KeyOperator&\"Head\",key_AOEM,0),10)),10^(INDEX(ay_OpExAOEM,MATCH(sys_KeyOperator&\"Head\",key_AOEM,0),7)+(LOG(i_AmountAS4)*INDEX(ay_OpExAOEM,MATCH(sys_KeyOperator&\"Head\",key_AOEM,0),8))+INDEX(ay_OpExAOEM,MATCH(sys_KeyOperator&\"Head\",key_AOEM,0),9)  + d_head75ProtectionFactor  ),MAX(INDEX(ay_OpExAOEM,MATCH(sys_KeyOperator&\"Head\",key_AOEM,0),10),(INDEX(ay_OpExAOEM,MATCH(sys_KeyOperator&\"Head\",key_AOEM,0),10)/1.5)*i_AmountAS4))*IF(ISNUMBER(Hole_F25),Hole_F25,1)","v":{"$error":"#N/A"}},{"$f":"IF(ISBLANK(INDEX(ay_OpExAOEM,MATCH(sys_KeyOperator&\"Head\",key_AOEM,0),14)), 10^(INDEX(ay_OpExAOEM,MATCH(sys_KeyOperator&\"Head\",key_AOEM,0),11) +(LOG(i_AmountAS4)*INDEX(ay_OpExAOEM,MATCH(sys_KeyOperator&\"Head\",key_AOEM,0),12)) +INDEX(ay_OpExAOEM,MATCH(sys_KeyOperator&\"Head\",key_AOEM,0),13)+ d_head95ProtectionFactor),MAX(INDEX(ay_OpExAOEM,MATCH(sys_KeyOperator&\"Head\",key_AOEM,0),14),(INDEX(ay_OpExAOEM,MATCH(sys_KeyOperator&\"Head\",key_AOEM,0),14) /1.5)*i_AmountAS4))*IF(ISNUMBER(Hole_F25),Hole_F25,1)","v":{"$error":"#N/A"}},"AOEM"]
[null,null,"Inhalation",{"$f":"IF(ISBLANK(INDEX(ay_OpExAOEM,MATCH(sys_KeyOperator&\"Inhalation\",key_AOEM,0),10)),10^(INDEX(ay_OpExAOEM,MATCH(sys_KeyOperator&\"Inhalation\",key_AOEM,0),7)+(LOG(i_AmountAS1)*INDEX(ay_OpExAOEM,MATCH(sys_KeyOperator&\"Inhalation\",key_AOEM,0),8))+INDEX(ay_OpExAOEM,MATCH(sys_KeyOperator&\"Inhalation\",key_AOEM,0),9)),MAX(INDEX(ay_OpExAOEM,MATCH(sys_KeyOperator&\"Inhalation\",key_AOEM,0),10),(INDEX(ay_OpExAOEM,MATCH(sys_KeyOperator&\"Inhalation\",key_AOEM,0),10)/1.5)*i_AmountAS1))","v":{"$error":"#N/A"}},{"$f":"IF(ISBLANK(INDEX(ay_OpExAOEM,MATCH(sys_KeyOperator&\"Inhalation\",key_AOEM,0),14)), 10^(INDEX(ay_OpExAOEM,MATCH(sys_KeyOperator&\"Inhalation\",key_AOEM,0),11) +(LOG(i_AmountAS1)*INDEX(ay_OpExAOEM,MATCH(sys_KeyOperator&\"Inhalation\",key_AOEM,0),12)) +INDEX(ay_OpExAOEM,MATCH(sys_KeyOperator&\"Inhalation\",key_AOEM,0),13)),MAX(INDEX(ay_OpExAOEM,MATCH(sys_KeyOperator&\"Inhalation\",key_AOEM,0),14),(INDEX(ay_OpExAOEM,MATCH(sys_KeyOperator&\"Inhalation\",key_AOEM,0),14) /1.5)*i_AmountAS1))","v":{"$error":"#N/A"}},{"$f":"IF(ISBLANK(INDEX(ay_OpExAOEM,MATCH(sys_KeyOperator&\"Inhalation\",key_AOEM,0),10)),10^(INDEX(ay_OpExAOEM,MATCH(sys_KeyOperator&\"Inhalation\",key_AOEM,0),7)+(LOG(i_AmountAS2)*INDEX(ay_OpExAOEM,MATCH(sys_KeyOperator&\"Inhalation\",key_AOEM,0),8))+INDEX(ay_OpExAOEM,MATCH(sys_KeyOperator&\"Inhalation\",key_AOEM,0),9)),MAX(INDEX(ay_OpExAOEM,MATCH(sys_KeyOperator&\"Inhalation\",key_AOEM,0),10),(INDEX(ay_OpExAOEM,MATCH(sys_KeyOperator&\"Inhalation\",key_AOEM,0),10)/1.5)*i_AmountAS2))","v":{"$error":"#N/A"}},{"$f":"IF(ISBLANK(INDEX(ay_OpExAOEM,MATCH(sys_KeyOperator&\"Inhalation\",key_AOEM,0),14)), 10^(INDEX(ay_OpExAOEM,MATCH(sys_KeyOperator&\"Inhalation\",key_AOEM,0),11) +(LOG(i_AmountAS2)*INDEX(ay_OpExAOEM,MATCH(sys_KeyOperator&\"Inhalation\",key_AOEM,0),12)) +INDEX(ay_OpExAOEM,MATCH(sys_KeyOperator&\"Inhalation\",key_AOEM,0),13)),MAX(INDEX(ay_OpExAOEM,MATCH(sys_KeyOperator&\"Inhalation\",key_AOEM,0),14),(INDEX(ay_OpExAOEM,MATCH(sys_KeyOperator&\"Inhalation\",key_AOEM,0),14) /1.5)*i_AmountAS2))","v":{"$error":"#N/A"}},{"$f":"IF(ISBLANK(INDEX(ay_OpExAOEM,MATCH(sys_KeyOperator&\"Inhalation\",key_AOEM,0),10)),10^(INDEX(ay_OpExAOEM,MATCH(sys_KeyOperator&\"Inhalation\",key_AOEM,0),7)+(LOG(i_AmountAS3)*INDEX(ay_OpExAOEM,MATCH(sys_KeyOperator&\"Inhalation\",key_AOEM,0),8))+INDEX(ay_OpExAOEM,MATCH(sys_KeyOperator&\"Inhalation\",key_AOEM,0),9)),MAX(INDEX(ay_OpExAOEM,MATCH(sys_KeyOperator&\"Inhalation\",key_AOEM,0),10),(INDEX(ay_OpExAOEM,MATCH(sys_KeyOperator&\"Inhalation\",key_AOEM,0),10)/1.5)*i_AmountAS3))","v":{"$error":"#N/A"}},{"$f":"IF(ISBLANK(INDEX(ay_OpExAOEM,MATCH(sys_KeyOperator&\"Inhalation\",key_AOEM,0),14)), 10^(INDEX(ay_OpExAOEM,MATCH(sys_KeyOperator&\"Inhalation\",key_AOEM,0),11) +(LOG(i_AmountAS3)*INDEX(ay_OpExAOEM,MATCH(sys_KeyOperator&\"Inhalation\",key_AOEM,0),12)) +INDEX(ay_OpExAOEM,MATCH(sys_KeyOperator&\"Inhalation\",key_AOEM,0),13)),MAX(INDEX(ay_OpExAOEM,MATCH(sys_KeyOperator&\"Inhalation\",key_AOEM,0),14),(INDEX(ay_OpExAOEM,MATCH(sys_KeyOperator&\"Inhalation\",key_AOEM,0),14) /1.5)*i_AmountAS3))","v":{"$error":"#N/A"}},{"$f":"IF(ISBLANK(INDEX(ay_OpExAOEM,MATCH(sys_KeyOperator&\"Inhalation\",key_AOEM,0),10)),10^(INDEX(ay_OpExAOEM,MATCH(sys_KeyOperator&\"Inhalation\",key_AOEM,0),7)+(LOG(i_AmountAS4)*INDEX(ay_OpExAOEM,MATCH(sys_KeyOperator&\"Inhalation\",key_AOEM,0),8))+INDEX(ay_OpExAOEM,MATCH(sys_KeyOperator&\"Inhalation\",key_AOEM,0),9)),MAX(INDEX(ay_OpExAOEM,MATCH(sys_KeyOperator&\"Inhalation\",key_AOEM,0),10),(INDEX(ay_OpExAOEM,MATCH(sys_KeyOperator&\"Inhalation\",key_AOEM,0),10)/1.5)*i_AmountAS4))","v":{"$error":"#N/A"}},{"$f":"IF(ISBLANK(INDEX(ay_OpExAOEM,MATCH(sys_KeyOperator&\"Inhalation\",key_AOEM,0),14)), 10^(INDEX(ay_OpExAOEM,MATCH(sys_KeyOperator&\"Inhalation\",key_AOEM,0),11) +(LOG(i_AmountAS4)*INDEX(ay_OpExAOEM,MATCH(sys_KeyOperator&\"Inhalation\",key_AOEM,0),12)) +INDEX(ay_OpExAOEM,MATCH(sys_KeyOperator&\"Inhalation\",key_AOEM,0),13)),MAX(INDEX(ay_OpExAOEM,MATCH(sys_KeyOperator&\"Inhalation\",key_AOEM,0),14),(INDEX(ay_OpExAOEM,MATCH(sys_KeyOperator&\"Inhalation\",key_AOEM,0),14) /1.5)*i_AmountAS4))","v":{"$error":"#N/A"}},"AOEM"]
[null,null,"Protective Equipment","Select for inclusion",null,null,null,null,null,null,null,"Penetration factor","Inhalation Protection factor"]
[null,null,"Gloves",{"$f":"'Operator Spray'!D25","v":"No"},null,null,null,null,null,null,null,{"$f":"IF(D25=\"Yes\",\"Incl. in AOEM model\",\"\")","v":""}]
[null,null,"Clothing",{"$f":"'Operator Spray'!D26","v":"Work wear - arms, body and legs covered"},null,null,null,null,null,null,null,"Incl. in AOEM model"]
[null,null,"Head and respiratory PPE",{"$f":"'Operator Spray'!D27","v":"None"},null,null,null,null,null,null,null,{"$f":"IF(AND(i_AppEquip=\"Manual-Hand held\",D27=\"Hood and visor\"),\"Incl. in AOEM model\",INDEX(ay_MixPPEHead,MATCH(D27,key_MixPPEHead,0),2))","v":1},{"$f":"IF(OR(D27=\"Hood and visor\",D27=\"Hood\"),1,INDEX(ay_MixRPE,MATCH(D27,key_MixRPE,0),2))","v":1}]
[null,null,"Water soluble bag",{"$f":"'Operator Spray'!D28","v":"No"},null,null,null,null,null,null,null,{"$f":"IF(AND(D28=\"Yes\"),0.1,1)","v":1}]
[null,"Application",null,{"$f":"i_SubstName1","v":0},null,{"$f":"i_SubstName2","v":0},null,{"$f":"i_SubstName3","v":0},null,{"$f":"i_SubstName4","v":0}]
[null,null,"Exposure values ","µg exposure/day applied",null,"µg exposure/day applied",null,"µg exposure/day applied",null,"µg exposure/day applied",null,"Reference ","Comment"]
[null,null,null,"75th percentile","95th percentile ","75th percentile","95th percentile ","75th percentile","95th percentile ","75th percentile","95th percentile "]
[null,null,"Hands",{"$f":"IF(ISBLANK(INDEX(ay_OpExAOEM,MATCH(sys_KeyOperator&\"Hands\",key_AOEM,0),18)),10^(INDEX(ay_OpExAOEM,MATCH(sys_KeyOperator&\"Hands\",key_AOEM,0),15)+(LOG(0.9*i_AmountAS1)*INDEX(ay_OpExAOEM,MATCH(sys_KeyOperator&\"Hands\",key_AOEM,0),16))+  IF(AND(i_AppMeth=\"Upward spraying\",LEFT(i_AppEquip,15)=\"Vehicle-mounted\",d_AppPfCaBfR = \"Yes\"),0,IF(AND(i_Season = \"late (dense foliage)\",i_AppMeth=\"Upward spraying\",OR(i_AppEquip=\"Manual-Hand held\",i_AppEquip=\"Manual-Knapsack\")),0,INDEX(ay_OpExAOEM,MATCH(sys_KeyOperator&\"Hands\",key_AOEM,0),17)))   ),MAX(INDEX(ay_OpExAOEM,MATCH(sys_KeyOperator&\"Hands\",key_AOEM,0),18),(INDEX(ay_OpExAOEM,MATCH(sys_KeyOperator&\"Hands\",key_AOEM,0),18)/d_PctExtrapolation)*0.9*i_AmountAS1))","v":{"$error":"#N/A"}},{"$f":"IF(ISBLANK(INDEX(ay_OpExAOEM,MATCH(sys_KeyOperator&\"Hands\",key_AOEM,0),22)),10^(INDEX(ay_OpExAOEM,MATCH(sys_KeyOperator&\"Hands\",key_AOEM,0),19)+(LOG(0.9*i_AmountAS1)*INDEX(ay_OpExAOEM,MATCH(sys_KeyOperator&\"Hands\",key_AOEM,0),20))+  IF(AND(i_AppMeth=\"Upward spraying\",LEFT(i_AppEquip,15)=\"Vehicle-mounted\",d_AppPfCaBfR = \"Yes\"),0,IF(AND(i_Season = \"late (dense foliage)\",i_AppMeth=\"Upward spraying\",OR(i_AppEquip=\"Manual-Hand held\",i_AppEquip=\"Manual-Knapsack\")),0,INDEX(ay_OpExAOEM,MATCH(sys_KeyOperator&\"Hands\",key_AOEM,0),21)))   ),MAX(INDEX(ay_OpExAOEM,MATCH(sys_KeyOperator&\"Hands\",key_AOEM,0),22),(INDEX(ay_OpExAOEM,MATCH(sys_KeyOperator&\"Hands\",key_AOEM,0),22)/d_PctExtrapolation)*0.9*i_AmountAS1))","v":{"$error":"#N/A"}},{"$f":"IF(ISBLANK(INDEX(ay_OpExAOEM,MATCH(sys_KeyOperator&\"Hands\",key_AOEM,0),18)),10^(INDEX(ay_OpExAOEM,MATCH(sys_KeyOperator&\"Hands\",key_AOEM,0),15)+(LOG(0.9*i_AmountAS2)*INDEX(ay_OpExAOEM,MATCH(sys_KeyOperator&\"Hands\",key_AOEM,0),16))+  IF(AND(i_AppMeth=\"Upward spraying\",LEFT(i_AppEquip,15)=\"Vehicle-mounted\",d_AppPfCaBfR = \"Yes\"),0,IF(AND(i_Season = \"late (dense foliage)\",i_AppMeth=\"Upward spraying\",OR(i_AppEquip=\"Manual-Hand held\",i_AppEquip=\"Manual-Knapsack\")),0,INDEX(ay_OpExAOEM,MATCH(sys_KeyOperator&\"Hands\",key_AOEM,0),17)))   ),MAX(INDEX(ay_OpExAOEM,MATCH(sys_KeyOperator&\"Hands\",key_AOEM,0),18),(INDEX(ay_OpExAOEM,MATCH(sys_KeyOperator&\"Hands\",key_AOEM,0),18)/d_PctExtrapolation)*0.9*i_AmountAS2))","v":{"$error":"#N/A"}},{"$f":"IF(ISBLANK(INDEX(ay_OpExAOEM,MATCH(sys_KeyOperator&\"Hands\",key_AOEM,0),22)),10^(INDEX(ay_OpExAOEM,MATCH(sys_KeyOperator&\"Hands\",key_AOEM,0),19)+(LOG(0.9*i_AmountAS2)*INDEX(ay_OpExAOEM,MATCH(sys_KeyOperator&\"Hands\",key_AOEM,0),20))+  IF(AND(i_AppMeth=\"Upward spraying\",LEFT(i_AppEquip,15)=\"Vehicle-mounted\",d_AppPfCaBfR = \"Yes\"),0,IF(AND(i_Season = \"late (dense foliage)\",i_AppMeth=\"Upward spraying\",OR(i_AppEquip=\"Manual-Hand held\",i_AppEquip=\"Manual-Knapsack\")),0,INDEX(ay_OpExAOEM,MATCH(sys_KeyOperator&\"Hands\",key_AOEM,0),21)))   ),MAX(INDEX(ay_OpExAOEM,MATCH(sys_KeyOperator&\"Hands\",key_AOEM,0),22),(INDEX(ay_OpExAOEM,MATCH(sys_KeyOperator&\"Hands\",key_AOEM,0),22)/d_PctExtrapolation)*0.9*i_AmountAS2))","v":{"$error":"#N/A"}},{"$f":"IF(ISBLANK(INDEX(ay_OpExAOEM,MATCH(sys_KeyOperator&\"Hands\",key_AOEM,0),18)),10^(INDEX(ay_OpExAOEM,MATCH(sys_KeyOperator&\"Hands\",key_AOEM,0),15)+(LOG(0.9*i_AmountAS3)*INDEX(ay_OpExAOEM,MATCH(sys_KeyOperator&\"Hands\",key_AOEM,0),16))+  IF(AND(i_AppMeth=\"Upward spraying\",LEFT(i_AppEquip,15)=\"Vehicle-mounted\",d_AppPfCaBfR = \"Yes\"),0,IF(AND(i_Season = \"late (dense foliage)\",i_AppMeth=\"Upward spraying\",OR(i_AppEquip=\"Manual-Hand held\",i_AppEquip=\"Manual-Knapsack\")),0,INDEX(ay_OpExAOEM,MATCH(sys_KeyOperator&\"Hands\",key_AOEM,0),17)))   ),MAX(INDEX(ay_OpExAOEM,MATCH(sys_KeyOperator&\"Hands\",key_AOEM,0),18),(INDEX(ay_OpExAOEM,MATCH(sys_KeyOperator&\"Hands\",key_AOEM,0),18)/d_PctExtrapolation)*0.9*i_AmountAS3))","v":{"$error":"#N/A"}},{"$f":"IF(ISBLANK(INDEX(ay_OpExAOEM,MATCH(sys_KeyOperator&\"Hands\",key_AOEM,0),22)),10^(INDEX(ay_OpExAOEM,MATCH(sys_KeyOperator&\"Hands\",key_AOEM,0),19)+(LOG(0.9*i_AmountAS3)*INDEX(ay_OpExAOEM,MATCH(sys_KeyOperator&\"Hands\",key_AOEM,0),20))+  IF(AND(i_AppMeth=\"Upward spraying\",LEFT(i_AppEquip,15)=\"Vehicle-mounted\",d_AppPfCaBfR = \"Yes\"),0,IF(AND(i_Season = \"late (dense foliage)\",i_AppMeth=\"Upward spraying\",OR(i_AppEquip=\"Manual-Hand held\",i_AppEquip=\"Manual-Knapsack\")),0,INDEX(ay_OpExAOEM,MATCH(sys_KeyOperator&\"Hands\",key_AOEM,0),21)))   ),MAX(INDEX(ay_OpExAOEM,MATCH(sys_KeyOperator&\"Hands\",key_AOEM,0),22),(INDEX(ay_OpExAOEM,MATCH(sys_KeyOperator&\"Hands\",key_AOEM,0),22)/d_PctExtrapolation)*0.9*i_AmountAS3))","v":{"$error":"#N/A"}},{"$f":"IF(ISBLANK(INDEX(ay_OpExAOEM,MATCH(sys_KeyOperator&\"Hands\",key_AOEM,0),18)),10^(INDEX(ay_OpExAOEM,MATCH(sys_KeyOperator&\"Hands\",key_AOEM,0),15)+(LOG(0.9*i_AmountAS4)*INDEX(ay_OpExAOEM,MATCH(sys_KeyOperator&\"Hands\",key_AOEM,0),16))+  IF(AND(i_AppMeth=\"Upward spraying\",LEFT(i_AppEquip,15)=\"Vehicle-mounted\",d_AppPfCaBfR = \"Yes\"),0,IF(AND(i_Season = \"late (dense foliage)\",i_AppMeth=\"Upward spraying\",OR(i_AppEquip=\"Manual-Hand held\",i_AppEquip=\"Manual-Knapsack\")),0,INDEX(ay_OpExAOEM,MATCH(sys_KeyOperator&\"Hands\",key_AOEM,0),17)))   ),MAX(INDEX(ay_OpExAOEM,MATCH(sys_KeyOperator&\"Hands\",key_AOEM,0),18),(INDEX(ay_OpExAOEM,MATCH(sys_KeyOperator&\"Hands\",key_AOEM,0),18)/d_PctExtrapolation)*0.9*i_AmountAS4))","v":{"$error":"#N/A"}},{"$f":"IF(ISBLANK(INDEX(ay_OpExAOEM,MATCH(sys_KeyOperator&\"Hands\",key_AOEM,0),22)),10^(INDEX(ay_OpExAOEM,MATCH(sys_KeyOperator&\"Hands\",key_AOEM,0),19)+(LOG(0.9*i_AmountAS4)*INDEX(ay_OpExAOEM,MATCH(sys_KeyOperator&\"Hands\",key_AOEM,0),20))+  IF(AND(i_AppMeth=\"Upward spraying\",LEFT(i_AppEquip,15)=\"Vehicle-mounted\",d_AppPfCaBfR = \"Yes\"),0,IF(AND(i_Season = \"late (dense foliage)\",i_AppMeth=\"Upward spraying\",OR(i_AppEquip=\"Manual-Hand held\",i_AppEquip=\"Manual-Knapsack\")),0,INDEX(ay_OpExAOEM,MATCH(sys_KeyOperator&\"Hands\",key_AOEM,0),21)))   ),MAX(INDEX(ay_OpExAOEM,MATCH(sys_KeyOperator&\"Hands\",key_AOEM,0),22),(INDEX(ay_OpExAOEM,MATCH(sys_KeyOperator&\"Hands\",key_AOEM,0),22)/d_PctExtrapolation)*0.9*i_AmountAS4))","v":{"$error":"#N/A"}},"AOEM",{"$f":"IF(AND(d_AreaTreated=10,i_AppMeth=\"Downward spraying\"),IF(i_AppEquip=\"Vehicle-mounted-Drift Reduction\",\"Small area equipment and drift reduction cannot be selected together - drift reduction has not been applied\",\"This scenario assumes that small area equipment is used\"),IF(i_AppMeth=\"Upward spraying\", \"No data available for a drift reduction scenario\",\"\") )","v":""}]
[null,null,"Body",{"$f":"IF(ISBLANK(INDEX(ay_OpExAOEM,MATCH(sys_KeyOperator&\"Body\",key_AOEM,0),18)),10^(INDEX(ay_OpExAOEM,MATCH(sys_KeyOperator&\"Body\",key_AOEM,0),15)+(LOG(0.9*i_AmountAS1)*INDEX(ay_OpExAOEM,MATCH(sys_KeyOperator&\"Body\",key_AOEM,0),16))+  IF(AND(i_AppMeth=\"Upward spraying\",LEFT(i_AppEquip,15)=\"Vehicle-mounted\",d_AppPfCaBfR = \"Yes\"),0,IF(AND(i_Season = \"late (dense foliage)\",i_AppMeth=\"Upward spraying\",OR(i_AppEquip=\"Manual-Hand held\",i_AppEquip=\"Manual-Knapsack\")),0,INDEX(ay_OpExAOEM,MATCH(sys_KeyOperator&\"Body\",key_AOEM,0),17)))   ),MAX(INDEX(ay_OpExAOEM,MATCH(sys_KeyOperator&\"Body\",key_AOEM,0),18),(INDEX(ay_OpExAOEM,MATCH(sys_KeyOperator&\"Body\",key_AOEM,0),18)/d_PctExtrapolation)*0.9*i_AmountAS1))","v":{"$error":"#N/A"}},{"$f":"IF(ISBLANK(INDEX(ay_OpExAOEM,MATCH(sys_KeyOperator&\"Body\",key_AOEM,0),22)),10^(INDEX(ay_OpExAOEM,MATCH(sys_KeyOperator&\"Body\",key_AOEM,0),19)+(LOG(0.9*i_AmountAS1)*INDEX(ay_OpExAOEM,MATCH(sys_KeyOperator&\"Body\",key_AOEM,0),20))+  IF(AND(i_AppMeth=\"Upward spraying\",LEFT(i_AppEquip,15)=\"Vehicle-mounted\",d_AppPfCaBfR = \"Yes\"),0,IF(AND(i_Season = \"late (dense foliage)\",i_AppMeth=\"Upward spraying\",OR(i_AppEquip=\"Manual-Hand held\",i_AppEquip=\"Manual-Knapsack\")),0,INDEX(ay_OpExAOEM,MATCH(sys_KeyOperator&\"Body\",key_AOEM,0),21)))   ),MAX(INDEX(ay_OpExAOEM,MATCH(sys_KeyOperator&\"Body\",key_AOEM,0),22),(INDEX(ay_OpExAOEM,MATCH(sys_KeyOperator&\"Body\",key_AOEM,0),22)/d_PctExtrapolation)*0.9*i_AmountAS1))","v":{"$error":"#N/A"}},{"$f":"IF(ISBLANK(INDEX(ay_OpExAOEM,MATCH(sys_KeyOperator&\"Body\",key_AOEM,0),18)),10^(INDEX(ay_OpExAOEM,MATCH(sys_KeyOperator&\"Body\",key_AOEM,0),15)+(LOG(0.9*i_AmountAS2)*INDEX(ay_OpExAOEM,MATCH(sys_KeyOperator&\"Body\",key_AOEM,0),16))+  IF(AND(i_AppMeth=\"Upward spraying\",LEFT(i_AppEquip,15)=\"Vehicle-mounted\",d_AppPfCaBfR = \"Yes\"),0,IF(AND(i_Season = \"late (dense foliage)\",i_AppMeth=\"Upward spraying\",OR(i_AppEquip=\"Manual-Hand held\",i_AppEquip=\"Manual-Knapsack\")),0,INDEX(ay_OpExAOEM,MATCH(sys_KeyOperator&\"Body\",key_AOEM,0),17)))   ),MAX(INDEX(ay_OpExAOEM,MATCH(sys_KeyOperator&\"Body\",key_AOEM,0),18),(INDEX(ay_OpExAOEM,MATCH(sys_KeyOperator&\"Body\",key_AOEM,0),18)/d_PctExtrapolation)*0.9*i_AmountAS2))","v":{"$error":"#N/A"}},{"$f":"IF(ISBLANK(INDEX(ay_OpExAOEM,MATCH(sys_KeyOperator&\"Body\",key_AOEM,0),22)),10^(INDEX(ay_OpExAOEM,MATCH(sys_KeyOperator&\"Body\",key_AOEM,0),19)+(LOG(0.9*i_AmountAS2)*INDEX(ay_OpExAOEM,MATCH(sys_KeyOperator&\"Body\",key_AOEM,0),20))+  IF(AND(i_AppMeth=\"Upward spraying\",LEFT(i_AppEquip,15)=\"Vehicle-mounted\",d_AppPfCaBfR = \"Yes\"),0,IF(AND(i_Season = \"late (dense foliage)\",i_AppMeth=\"Upward spraying\",OR(i_AppEquip=\"Manual-Hand held\",i_AppEquip=\"Manual-Knapsack\")),0,INDEX(ay_OpExAOEM,MATCH(sys_KeyOperator&\"Body\",key_AOEM,0),21)))   ),MAX(INDEX(ay_OpExAOEM,MATCH(sys_KeyOperator&\"Body\",key_AOEM,0),22),(INDEX(ay_OpExAOEM,MATCH(sys_KeyOperator&\"Body\",key_AOEM,0),22)/d_PctExtrapolation)*0.9*i_AmountAS2))","v":{"$error":"#N/A"}},{"$f":"IF(ISBLANK(INDEX(ay_OpExAOEM,MATCH(sys_KeyOperator&\"Body\",key_AOEM,0),18)),10^(INDEX(ay_OpExAOEM,MATCH(sys_KeyOperator&\"Body\",key_AOEM,0),15)+(LOG(0.9*i_AmountAS3)*INDEX(ay_OpExAOEM,MATCH(sys_KeyOperator&\"Body\",key_AOEM,0),16))+  IF(AND(i_AppMeth=\"Upward spraying\",LEFT(i_AppEquip,15)=\"Vehicle-mounted\",d_AppPfCaBfR = \"Yes\"),0,IF(AND(i_Season = \"late (dense foliage)\",i_AppMeth=\"Upward spraying\",OR(i_AppEquip=\"Manual-Hand held\",i_AppEquip=\"Manual-Knapsack\")),0,INDEX(ay_OpExAOEM,MATCH(sys_KeyOperator&\"Body\",key_AOEM,0),17)))   ),MAX(INDEX(ay_OpExAOEM,MATCH(sys_KeyOperator&\"Body\",key_AOEM,0),18),(INDEX(ay_OpExAOEM,MATCH(sys_KeyOperator&\"Body\",key_AOEM,0),18)/d_PctExtrapolation)*0.9*i_AmountAS3))","v":{"$error":"#N/A"}},{"$f":"IF(ISBLANK(INDEX(ay_OpExAOEM,MATCH(sys_KeyOperator&\"Body\",key_AOEM,0),22)),10^(INDEX(ay_OpExAOEM,MATCH(sys_KeyOperator&\"Body\",key_AOEM,0),19)+(LOG(0.9*i_AmountAS3)*INDEX(ay_OpExAOEM,MATCH(sys_KeyOperator&\"Body\",key_AOEM,0),20))+  IF(AND(i_AppMeth=\"Upward spraying\",LEFT(i_AppEquip,15)=\"Vehicle-mounted\",d_AppPfCaBfR = \"Yes\"),0,IF(AND(i_Season = \"late (dense foliage)\",i_AppMeth=\"Upward spraying\",OR(i_AppEquip=\"Manual-Hand held\",i_AppEquip=\"Manual-Knapsack\")),0,INDEX(ay_OpExAOEM,MATCH(sys_KeyOperator&\"Body\",key_AOEM,0),21)))   ),MAX(INDEX(ay_OpExAOEM,MATCH(sys_KeyOperator&\"Body\",key_AOEM,0),22),(INDEX(ay_OpExAOEM,MATCH(sys_KeyOperator&\"Body\",key_AOEM,0),22)/d_PctExtrapolation)*0.9*i_AmountAS3))","v":{"$error":"#N/A"}},{"$f":"IF(ISBLANK(INDEX(ay_OpExAOEM,MATCH(sys_KeyOperator&\"Body\",key_AOEM,0),18)),10^(INDEX(ay_OpExAOEM,MATCH(sys_KeyOperator&\"Body\",key_AOEM,0),15)+(LOG(0.9*i_AmountAS4)*INDEX(ay_OpExAOEM,MATCH(sys_KeyOperator&\"Body\",key_AOEM,0),16))+  IF(AND(i_AppMeth=\"Upward spraying\",LEFT(i_AppEquip,15)=\"Vehicle-mounted\",d_AppPfCaBfR = \"Yes\"),0,IF(AND(i_Season = \"late (dense foliage)\",i_AppMeth=\"Upward spraying\",OR(i_AppEquip=\"Manual-Hand held\",i_AppEquip=\"Manual-Knapsack\")),0,INDEX(ay_OpExAOEM,MATCH(sys_KeyOperator&\"Body\",key_AOEM,0),17)))   ),MAX(INDEX(ay_OpExAOEM,MATCH(sys_KeyOperator&\"Body\",key_AOEM,0),18),(INDEX(ay_OpExAOEM,MATCH(sys_KeyOperator&\"Body\",key_AOEM,0),18)/d_PctExtrapolation)*0.9*i_AmountAS4))","v":{"$error":"#N/A"}},{"$f":"IF(ISBLANK(INDEX(ay_OpExAOEM,MATCH(sys_KeyOperator&\"Body\",key_AOEM,0),22)),10^(INDEX(ay_OpExAOEM,MATCH(sys_KeyOperator&\"Body\",key_AOEM,0),19)+(LOG(0.9*i_AmountAS4)*INDEX(ay_OpExAOEM,MATCH(sys_KeyOperator&\"Body\",key_AOEM,0),20))+  IF(AND(i_AppMeth=\"Upward spraying\",LEFT(i_AppEquip,15)=\"Vehicle-mounted\",d_AppPfCaBfR = \"Yes\"),0,IF(AND(i_Season = \"late (dense foliage)\",i_AppMeth=\"Upward spraying\",OR(i_AppEquip=\"Manual-Hand held\",i_AppEquip=\"Manual-Knapsack\")),0,INDEX(ay_OpExAOEM,MATCH(sys_KeyOperator&\"Body\",key_AOEM,0),21)))   ),MAX(INDEX(ay_OpExAOEM,MATCH(sys_KeyOperator&\"Body\",key_AOEM,0),22),(INDEX(ay_OpExAOEM,MATCH(sys_KeyOperator&\"Body\",key_AOEM,0),22)/d_PctExtrapolation)*0.9*i_AmountAS4))","v":{"$error":"#N/A"}},"AOEM"]
[null,null,"Head",{"$f":"IF(ISBLANK(INDEX(ay_OpExAOEM,MATCH(sys_KeyOperator&\"Head\",key_AOEM,0),18)),10^(INDEX(ay_OpExAOEM,MATCH(sys_KeyOperator&\"Head\",key_AOEM,0),15)+(LOG(0.9*i_AmountAS1)*INDEX(ay_OpExAOEM,MATCH(sys_KeyOperator&\"Head\",key_AOEM,0),16))+  IF(AND(i_AppMeth=\"Upward spraying\",LEFT(i_AppEquip,15)=\"Vehicle-mounted\",d_AppPfCaBfR = \"Yes\"),0,IF(AND(i_Season = \"late (dense foliage)\",i_AppMeth=\"Upward spraying\",OR(i_AppEquip=\"Manual-Hand held\",i_AppEquip=\"Manual-Knapsack\")),0,INDEX(ay_OpExAOEM,MATCH(sys_KeyOperator&\"Head\",key_AOEM,0),17)))   ),MAX(INDEX(ay_OpExAOEM,MATCH(sys_KeyOperator&\"Head\",key_AOEM,0),18),(INDEX(ay_OpExAOEM,MATCH(sys_KeyOperator&\"Head\",key_AOEM,0),18)/d_PctExtrapolation)*0.9*i_AmountAS1))","v":{"$error":"#N/A"}},{"$f":"IF(ISBLANK(INDEX(ay_OpExAOEM,MATCH(sys_KeyOperator&\"Head\",key_AOEM,0),22)),10^(INDEX(ay_OpExAOEM,MATCH(sys_KeyOperator&\"Head\",key_AOEM,0),19)+(LOG(0.9*i_AmountAS1)*INDEX(ay_OpExAOEM,MATCH(sys_KeyOperator&\"Head\",key_AOEM,0),20))+  IF(AND(i_AppMeth=\"Upward spraying\",LEFT(i_AppEquip,15)=\"Vehicle-mounted\",d_AppPfCaBfR = \"Yes\"),0,IF(AND(i_Season = \"late (dense foliage)\",i_AppMeth=\"Upward spraying\",OR(i_AppEquip=\"Manual-Hand held\",i_AppEquip=\"Manual-Knapsack\")),0,INDEX(ay_OpExAOEM,MATCH(sys_KeyOperator&\"Head\",key_AOEM,0),21)))   ),MAX(INDEX(ay_OpExAOEM,MATCH(sys_KeyOperator&\"Head\",key_AOEM,0),22),(INDEX(ay_OpExAOEM,MATCH(sys_KeyOperator&\"Head\",key_AOEM,0),22)/d_PctExtrapolation)*0.9*i_AmountAS1))","v":{"$error":"#N/A"}},{"$f":"IF(ISBLANK(INDEX(ay_OpExAOEM,MATCH(sys_KeyOperator&\"Head\",key_AOEM,0),18)),10^(INDEX(ay_OpExAOEM,MATCH(sys_KeyOperator&\"Head\",key_AOEM,0),15)+(LOG(0.9*i_AmountAS2)*INDEX(ay_OpExAOEM,MATCH(sys_KeyOperator&\"Head\",key_AOEM,0),16))+  IF(AND(i_AppMeth=\"Upward spraying\",LEFT(i_AppEquip,15)=\"Vehicle-mounted\",d_AppPfCaBfR = \"Yes\"),0,IF(AND(i_Season = \"late (dense foliage)\",i_AppMeth=\"Upward spraying\",OR(i_AppEquip=\"Manual-Hand held\",i_AppEquip=\"Manual-Knapsack\")),0,INDEX(ay_OpExAOEM,MATCH(sys_KeyOperator&\"Head\",key_AOEM,0),17)))   ),MAX(INDEX(ay_OpExAOEM,MATCH(sys_KeyOperator&\"Head\",key_AOEM,0),18),(INDEX(ay_OpExAOEM,MATCH(sys_KeyOperator&\"Head\",key_AOEM,0),18)/d_PctExtrapolation)*0.9*i_AmountAS2))","v":{"$error":"#N/A"}},{"$f":"IF(ISBLANK(INDEX(ay_OpExAOEM,MATCH(sys_KeyOperator&\"Head\",key_AOEM,0),22)),10^(INDEX(ay_OpExAOEM,MATCH(sys_KeyOperator&\"Head\",key_AOEM,0),19)+(LOG(0.9*i_AmountAS2)*INDEX(ay_OpExAOEM,MATCH(sys_KeyOperator&\"Head\",key_AOEM,0),20))+  IF(AND(i_AppMeth=\"Upward spraying\",LEFT(i_AppEquip,15)=\"Vehicle-mounted\",d_AppPfCaBfR = \"Yes\"),0,IF(AND(i_Season = \"late (dense foliage)\",i_AppMeth=\"Upward spraying\",OR(i_AppEquip=\"Manual-Hand held\",i_AppEquip=\"Manual-Knapsack\")),0,INDEX(ay_OpExAOEM,MATCH(sys_KeyOperator&\"Head\",key_AOEM,0),21)))   ),MAX(INDEX(ay_OpExAOEM,MATCH(sys_KeyOperator&\"Head\",key_AOEM,0),22),(INDEX(ay_OpExAOEM,MATCH(sys_KeyOperator&\"Head\",key_AOEM,0),22)/d_PctExtrapolation)*0.9*i_AmountAS2))","v":{"$error":"#N/A"}},{"$f":"IF(ISBLANK(INDEX(ay_OpExAOEM,MATCH(sys_KeyOperator&\"Head\",key_AOEM,0),18)),10^(INDEX(ay_OpExAOEM,MATCH(sys_KeyOperator&\"Head\",key_AOEM,0),15)+(LOG(0.9*i_AmountAS3)*INDEX(ay_OpExAOEM,MATCH(sys_KeyOperator&\"Head\",key_AOEM,0),16))+  IF(AND(i_AppMeth=\"Upward spraying\",LEFT(i_AppEquip,15)=\"Vehicle-mounted\",d_AppPfCaBfR = \"Yes\"),0,IF(AND(i_Season = \"late (dense foliage)\",i_AppMeth=\"Upward spraying\",OR(i_AppEquip=\"Manual-Hand held\",i_AppEquip=\"Manual-Knapsack\")),0,INDEX(ay_OpExAOEM,MATCH(sys_KeyOperator&\"Head\",key_AOEM,0),17)))   ),MAX(INDEX(ay_OpExAOEM,MATCH(sys_KeyOperator&\"Head\",key_AOEM,0),18),(INDEX(ay_OpExAOEM,MATCH(sys_KeyOperator&\"Head\",key_AOEM,0),18)/d_PctExtrapolation)*0.9*i_AmountAS3))","v":{"$error":"#N/A"}},{"$f":"IF(ISBLANK(INDEX(ay_OpExAOEM,MATCH(sys_KeyOperator&\"Head\",key_AOEM,0),22)),10^(INDEX(ay_OpExAOEM,MATCH(sys_KeyOperator&\"Head\",key_AOEM,0),19)+(LOG(0.9*i_AmountAS3)*INDEX(ay_OpExAOEM,MATCH(sys_KeyOperator&\"Head\",key_AOEM,0),20))+  IF(AND(i_AppMeth=\"Upward spraying\",LEFT(i_AppEquip,15)=\"Vehicle-mounted\",d_AppPfCaBfR = \"Yes\"),0,IF(AND(i_Season = \"late (dense foliage)\",i_AppMeth=\"Upward spraying\",OR(i_AppEquip=\"Manual-Hand held\",i_AppEquip=\"Manual-Knapsack\")),0,INDEX(ay_OpExAOEM,MATCH(sys_KeyOperator&\"Head\",key_AOEM,0),21)))   ),MAX(INDEX(ay_OpExAOEM,MATCH(sys_KeyOperator&\"Head\",key_AOEM,0),22),(INDEX(ay_OpExAOEM,MATCH(sys_KeyOperator&\"Head\",key_AOEM,0),22)/d_PctExtrapolation)*0.9*i_AmountAS3))","v":{"$error":"#N/A"}},{"$f":"IF(ISBLANK(INDEX(ay_OpExAOEM,MATCH(sys_KeyOperator&\"Head\",key_AOEM,0),18)),10^(INDEX(ay_OpExAOEM,MATCH(sys_KeyOperator&\"Head\",key_AOEM,0),15)+(LOG(0.9*i_AmountAS4)*INDEX(ay_OpExAOEM,MATCH(sys_KeyOperator&\"Head\",key_AOEM,0),16))+  IF(AND(i_AppMeth=\"Upward spraying\",LEFT(i_AppEquip,15)=\"Vehicle-mounted\",d_AppPfCaBfR = \"Yes\"),0,IF(AND(i_Season = \"late (dense foliage)\",i_AppMeth=\"Upward spraying\",OR(i_AppEquip=\"Manual-Hand held\",i_AppEquip=\"Manual-Knapsack\")),0,INDEX(ay_OpExAOEM,MATCH(sys_KeyOperator&\"Head\",key_AOEM,0),17)))   ),MAX(INDEX(ay_OpExAOEM,MATCH(sys_KeyOperator&\"Head\",key_AOEM,0),18),(INDEX(ay_OpExAOEM,MATCH(sys_KeyOperator&\"Head\",key_AOEM,0),18)/d_PctExtrapolation)*0.9*i_AmountAS4))","v":{"$error":"#N/A"}},{"$f":"IF(ISBLANK(INDEX(ay_OpExAOEM,MATCH(sys_KeyOperator&\"Head\",key_AOEM,0),22)),10^(INDEX(ay_OpExAOEM,MATCH(sys_KeyOperator&\"Head\",key_AOEM,0),19)+(LOG(0.9*i_AmountAS4)*INDEX(ay_OpExAOEM,MATCH(sys_KeyOperator&\"Head\",key_AOEM,0),20))+  IF(AND(i_AppMeth=\"Upward spraying\",LEFT(i_AppEquip,15)=\"Vehicle-mounted\",d_AppPfCaBfR = \"Yes\"),0,IF(AND(i_Season = \"late (dense foliage)\",i_AppMeth=\"Upward spraying\",OR(i_AppEquip=\"Manual-Hand held\",i_AppEquip=\"Manual-Knapsack\")),0,INDEX(ay_OpExAOEM,MATCH(sys_KeyOperator&\"Head\",key_AOEM,0),21)))   ),MAX(INDEX(ay_OpExAOEM,MATCH(sys_KeyOperator&\"Head\",key_AOEM,0),22),(INDEX(ay_OpExAOEM,MATCH(sys_KeyOperator&\"Head\",key_AOEM,0),22)/d_PctExtrapolation)*0.9*i_AmountAS4))","v":{"$error":"#N/A"}},"AOEM"]
[null,null,"Protected hands (gloves)",{"$f":"IF(ISBLANK(INDEX(ay_OpExAOEM,MATCH(sys_KeyOperator&\"Protected Hands\",key_AOEM,0),18)),10^(INDEX(ay_OpExAOEM,MATCH(sys_KeyOperator&\"Protected Hands\",key_AOEM,0),15)+(LOG(0.9*i_AmountAS1)*INDEX(ay_OpExAOEM,MATCH(sys_KeyOperator&\"Protected Hands\",key_AOEM,0),16))+  IF(AND(i_AppMeth=\"Upward spraying\",LEFT(i_AppEquip,15)=\"Vehicle-mounted\",d_AppPfCaBfR = \"Yes\"),0,IF(AND(i_Season = \"late (dense foliage)\",i_AppMeth=\"Upward spraying\",OR(i_AppEquip=\"Manual-Hand held\",i_AppEquip=\"Manual-Knapsack\")),0,INDEX(ay_OpExAOEM,MATCH(sys_KeyOperator&\"Protected Hands\",key_AOEM,0),17)))   ),MAX(INDEX(ay_OpExAOEM,MATCH(sys_KeyOperator&\"Protected Hands\",key_AOEM,0),18),(INDEX(ay_OpExAOEM,MATCH(sys_KeyOperator&\"Protected Hands\",key_AOEM,0),18)/d_PctExtrapolation)*0.9*i_AmountAS1))","v":{"$error":"#N/A"}},{"$f":"IF(ISBLANK(INDEX(ay_OpExAOEM,MATCH(sys_KeyOperator&\"Protected Hands\",key_AOEM,0),22)),10^(INDEX(ay_OpExAOEM,MATCH(sys_KeyOperator&\"Protected Hands\",key_AOEM,0),19)+(LOG(0.9*i_AmountAS1)*INDEX(ay_OpExAOEM,MATCH(sys_KeyOperator&\"Protected Hands\",key_AOEM,0),20))+  IF(AND(i_AppMeth=\"Upward spraying\",LEFT(i_AppEquip,15)=\"Vehicle-mounted\",d_AppPfCaBfR = \"Yes\"),0,IF(AND(i_Season = \"late (dense foliage)\",i_AppMeth=\"Upward spraying\",OR(i_AppEquip=\"Manual-Hand held\",i_AppEquip=\"Manual-Knapsack\")),0,INDEX(ay_OpExAOEM,MATCH(sys_KeyOperator&\"Protected Hands\",key_AOEM,0),21)))   ),MAX(INDEX(ay_OpExAOEM,MATCH(sys_KeyOperator&\"Protected Hands\",key_AOEM,0),22),(INDEX(ay_OpExAOEM,MATCH(sys_KeyOperator&\"Protected Hands\",key_AOEM,0),22)/d_PctExtrapolation)*0.9*i_AmountAS1))","v":{"$error":"#N/A"}},{"$f":"IF(ISBLANK(INDEX(ay_OpExAOEM,MATCH(sys_KeyOperator&\"Protected Hands\",key_AOEM,0),18)),10^(INDEX(ay_OpExAOEM,MATCH(sys_KeyOperator&\"Protected Hands\",key_AOEM,0),15)+(LOG(0.9*i_AmountAS2)*INDEX(ay_OpExAOEM,MATCH(sys_KeyOperator&\"Protected Hands\",key_AOEM,0),16))+  IF(AND(i_AppMeth=\"Upward spraying\",LEFT(i_AppEquip,15)=\"Vehicle-mounted\",d_AppPfCaBfR = \"Yes\"),0,IF(AND(i_Season = \"late (dense foliage)\",i_AppMeth=\"Upward spraying\",OR(i_AppEquip=\"Manual-Hand held\",i_AppEquip=\"Manual-Knapsack\")),0,INDEX(ay_OpExAOEM,MATCH(sys_KeyOperator&\"Protected Hands\",key_AOEM,0),17)))   ),MAX(INDEX(ay_OpExAOEM,MATCH(sys_KeyOperator&\"Protected Hands\",key_AOEM,0),18),(INDEX(ay_OpExAOEM,MATCH(sys_KeyOperator&\"Protected Hands\",key_AOEM,0),18)/d_PctExtrapolation)*0.9*i_AmountAS2))","v":{"$error":"#N/A"}},{"$f":"IF(ISBLANK(INDEX(ay_OpExAOEM,MATCH(sys_KeyOperator&\"Protected Hands\",key_AOEM,0),22)),10^(INDEX(ay_OpExAOEM,MATCH(sys_KeyOperator&\"Protected Hands\",key_AOEM,0),19)+(LOG(0.9*i_AmountAS2)*INDEX(ay_OpExAOEM,MATCH(sys_KeyOperator&\"Protected Hands\",key_AOEM,0),20))+  IF(AND(i_AppMeth=\"Upward spraying\",LEFT(i_AppEquip,15)=\"Vehicle-mounted\",d_AppPfCaBfR = \"Yes\"),0,IF(AND(i_Season = \"late (dense foliage)\",i_AppMeth=\"Upward spraying\",OR(i_AppEquip=\"Manual-Hand held\",i_AppEquip=\"Manual-Knapsack\")),0,INDEX(ay_OpExAOEM,MATCH(sys_KeyOperator&\"Protected Hands\",key_AOEM,0),21)))   ),MAX(INDEX(ay_OpExAOEM,MATCH(sys_KeyOperator&\"Protected Hands\",key_AOEM,0),22),(INDEX(ay_OpExAOEM,MATCH(sys_KeyOperator&\"Protected Hands\",key_AOEM,0),22)/d_PctExtrapolation)*0.9*i_AmountAS2))","v":{"$error":"#N/A"}},{"$f":"IF(ISBLANK(INDEX(ay_OpExAOEM,MATCH(sys_KeyOperator&\"Protected Hands\",key_AOEM,0),18)),10^(INDEX(ay_OpExAOEM,MATCH(sys_KeyOperator&\"Protected Hands\",key_AOEM,0),15)+(LOG(0.9*i_AmountAS3)*INDEX(ay_OpExAOEM,MATCH(sys_KeyOperator&\"Protected Hands\",key_AOEM,0),16))+  IF(AND(i_AppMeth=\"Upward spraying\",LEFT(i_AppEquip,15)=\"Vehicle-mounted\",d_AppPfCaBfR = \"Yes\"),0,IF(AND(i_Season = \"late (dense foliage)\",i_AppMeth=\"Upward spraying\",OR(i_AppEquip=\"Manual-Hand held\",i_AppEquip=\"Manual-Knapsack\")),0,INDEX(ay_OpExAOEM,MATCH(sys_KeyOperator&\"Protected Hands\",key_AOEM,0),17)))   ),MAX(INDEX(ay_OpExAOEM,MATCH(sys_KeyOperator&\"Protected Hands\",key_AOEM,0),18),(INDEX(ay_OpExAOEM,MATCH(sys_KeyOperator&\"Protected Hands\",key_AOEM,0),18)/d_PctExtrapolation)*0.9*i_AmountAS3))","v":{"$error":"#N/A"}},{"$f":"IF(ISBLANK(INDEX(ay_OpExAOEM,MATCH(sys_KeyOperator&\"Protected Hands\",key_AOEM,0),22)),10^(INDEX(ay_OpExAOEM,MATCH(sys_KeyOperator&\"Protected Hands\",key_AOEM,0),19)+(LOG(0.9*i_AmountAS3)*INDEX(ay_OpExAOEM,MATCH(sys_KeyOperator&\"Protected Hands\",key_AOEM,0),20))+  IF(AND(i_AppMeth=\"Upward spraying\",LEFT(i_AppEquip,15)=\"Vehicle-mounted\",d_AppPfCaBfR = \"Yes\"),0,IF(AND(i_Season = \"late (dense foliage)\",i_AppMeth=\"Upward spraying\",OR(i_AppEquip=\"Manual-Hand held\",i_AppEquip=\"Manual-Knapsack\")),0,INDEX(ay_OpExAOEM,MATCH(sys_KeyOperator&\"Protected Hands\",key_AOEM,0),21)))   ),MAX(INDEX(ay_OpExAOEM,MATCH(sys_KeyOperator&\"Protected Hands\",key_AOEM,0),22),(INDEX(ay_OpExAOEM,MATCH(sys_KeyOperator&\"Protected Hands\",key_AOEM,0),22)/d_PctExtrapolation)*0.9*i_AmountAS3))","v":{"$error":"#N/A"}},{"$f":"IF(ISBLANK(INDEX(ay_OpExAOEM,MATCH(sys_KeyOperator&\"Protected Hands\",key_AOEM,0),18)),10^(INDEX(ay_OpExAOEM,MATCH(sys_KeyOperator&\"Protected Hands\",key_AOEM,0),15)+(LOG(0.9*i_AmountAS4)*INDEX(ay_OpExAOEM,MATCH(sys_KeyOperator&\"Protected Hands\",key_AOEM,0),16))+  IF(AND(i_AppMeth=\"Upward spraying\",LEFT(i_AppEquip,15)=\"Vehicle-mounted\",d_AppPfCaBfR = \"Yes\"),0,IF(AND(i_Season = \"late (dense foliage)\",i_AppMeth=\"Upward spraying\",OR(i_AppEquip=\"Manual-Hand held\",i_AppEquip=\"Manual-Knapsack\")),0,INDEX(ay_OpExAOEM,MATCH(sys_KeyOperator&\"Protected Hands\",key_AOEM,0),17)))   ),MAX(INDEX(ay_OpExAOEM,MATCH(sys_KeyOperator&\"Protected Hands\",key_AOEM,0),18),(INDEX(ay_OpExAOEM,MATCH(sys_KeyOperator&\"Protected Hands\",key_AOEM,0),18)/d_PctExtrapolation)*0.9*i_AmountAS4))","v":{"$error":"#N/A"}},{"$f":"IF(ISBLANK(INDEX(ay_OpExAOEM,MATCH(sys_KeyOperator&\"Protected Hands\",key_AOEM,0),22)),10^(INDEX(ay_OpExAOEM,MATCH(sys_KeyOperator&\"Protected Hands\",key_AOEM,0),19)+(LOG(0.9*i_AmountAS4)*INDEX(ay_OpExAOEM,MATCH(sys_KeyOperator&\"Protected Hands\",key_AOEM,0),20))+  IF(AND(i_AppMeth=\"Upward spraying\",LEFT(i_AppEquip,15)=\"Vehicle-mounted\",d_AppPfCaBfR = \"Yes\"),0,IF(AND(i_Season = \"late (dense foliage)\",i_AppMeth=\"Upward spraying\",OR(i_AppEquip=\"Manual-Hand held\",i_AppEquip=\"Manual-Knapsack\")),0,INDEX(ay_OpExAOEM,MATCH(sys_KeyOperator&\"Protected Hands\",key_AOEM,0),21)))   ),MAX(INDEX(ay_OpExAOEM,MATCH(sys_KeyOperator&\"Protected Hands\",key_AOEM,0),22),(INDEX(ay_OpExAOEM,MATCH(sys_KeyOperator&\"Protected Hands\",key_AOEM,0),22)/d_PctExtrapolation)*0.9*i_AmountAS4))","v":{"$error":"#N/A"}},"AOEM"]
[null,null,"Protected body (workwear or protective garment and sturdy footwear)",{"$f":"IF(ISBLANK(INDEX(ay_OpExAOEM,MATCH(sys_KeyOperator&\"Protected Body\",key_AOEM,0),18)),10^(INDEX(ay_OpExAOEM,MATCH(sys_KeyOperator&\"Protected Body\",key_AOEM,0),15)+(LOG(0.9*i_AmountAS1)*INDEX(ay_OpExAOEM,MATCH(sys_KeyOperator&\"Protected Body\",key_AOEM,0),16))+  IF(AND(i_AppMeth=\"Upward spraying\",LEFT(i_AppEquip,15)=\"Vehicle-mounted\",d_AppPfCaBfR = \"Yes\"),0,IF(AND(i_Season = \"late (dense foliage)\",i_AppMeth=\"Upward spraying\",OR(i_AppEquip=\"Manual-Hand held\",i_AppEquip=\"Manual-Knapsack\")),0,INDEX(ay_OpExAOEM,MATCH(sys_KeyOperator&\"Protected Body\",key_AOEM,0),17)))   ),MAX(INDEX(ay_OpExAOEM,MATCH(sys_KeyOperator&\"Protected Body\",key_AOEM,0),18),(INDEX(ay_OpExAOEM,MATCH(sys_KeyOperator&\"Protected Body\",key_AOEM,0),18)/d_PctExtrapolation)*0.9*i_AmountAS1))","v":{"$error":"#N/A"}},{"$f":"IF(ISBLANK(INDEX(ay_OpExAOEM,MATCH(sys_KeyOperator&\"Protected Body\",key_AOEM,0),22)),10^(INDEX(ay_OpExAOEM,MATCH(sys_KeyOperator&\"Protected Body\",key_AOEM,0),19)++(LOG(0.9*i_AmountAS1)*INDEX(ay_OpExAOEM,MATCH(sys_KeyOperator&\"Protected Body\",key_AOEM,0),20))+  IF(AND(i_AppMeth=\"Upward spraying\",LEFT(i_AppEquip,15)=\"Vehicle-mounted\",d_AppPfCaBfR = \"Yes\"),0,IF(AND(i_Season = \"late (dense foliage)\",i_AppMeth=\"Upward spraying\",OR(i_AppEquip=\"Manual-Hand held\",i_AppEquip=\"Manual-Knapsack\")),0,INDEX(ay_OpExAOEM,MATCH(sys_KeyOperator&\"Protected Body\",key_AOEM,0),21)))   ),MAX(INDEX(ay_OpExAOEM,MATCH(sys_KeyOperator&\"Protected Body\",key_AOEM,0),22),(INDEX(ay_OpExAOEM,MATCH(sys_KeyOperator&\"Protected Body\",key_AOEM,0),22)/d_PctExtrapolation)*0.9*i_AmountAS1))","v":{"$error":"#N/A"}},{"$f":"IF(ISBLANK(INDEX(ay_OpExAOEM,MATCH(sys_KeyOperator&\"Protected Body\",key_AOEM,0),18)),10^(INDEX(ay_OpExAOEM,MATCH(sys_KeyOperator&\"Protected Body\",key_AOEM,0),15)+(LOG(0.9*i_AmountAS2)*INDEX(ay_OpExAOEM,MATCH(sys_KeyOperator&\"Protected Body\",key_AOEM,0),16))+  IF(AND(i_AppMeth=\"Upward spraying\",LEFT(i_AppEquip,15)=\"Vehicle-mounted\",d_AppPfCaBfR = \"Yes\"),0,IF(AND(i_Season = \"late (dense foliage)\",i_AppMeth=\"Upward spraying\",OR(i_AppEquip=\"Manual-Hand held\",i_AppEquip=\"Manual-Knapsack\")),0,INDEX(ay_OpExAOEM,MATCH(sys_KeyOperator&\"Protected Body\",key_AOEM,0),17)))   ),MAX(INDEX(ay_OpExAOEM,MATCH(sys_KeyOperator&\"Protected Body\",key_AOEM,0),18),(INDEX(ay_OpExAOEM,MATCH(sys_KeyOperator&\"Protected Body\",key_AOEM,0),18)/d_PctExtrapolation)*0.9*i_AmountAS2))","v":{"$error":"#N/A"}},{"$f":"IF(ISBLANK(INDEX(ay_OpExAOEM,MATCH(sys_KeyOperator&\"Protected Body\",key_AOEM,0),22)),10^(INDEX(ay_OpExAOEM,MATCH(sys_KeyOperator&\"Protected Body\",key_AOEM,0),19)+(LOG(0.9*i_AmountAS2)*INDEX(ay_OpExAOEM,MATCH(sys_KeyOperator&\"Protected Body\",key_AOEM,0),20))+  IF(AND(i_AppMeth=\"Upward spraying\",LEFT(i_AppEquip,15)=\"Vehicle-mounted\",d_AppPfCaBfR = \"Yes\"),0,IF(AND(i_Season = \"late (dense foliage)\",i_AppMeth=\"Upward spraying\",OR(i_AppEquip=\"Manual-Hand held\",i_AppEquip=\"Manual-Knapsack\")),0,INDEX(ay_OpExAOEM,MATCH(sys_KeyOperator&\"Protected Body\",key_AOEM,0),21)))   ),MAX(INDEX(ay_OpExAOEM,MATCH(sys_KeyOperator&\"Protected Body\",key_AOEM,0),22),(INDEX(ay_OpExAOEM,MATCH(sys_KeyOperator&\"Protected Body\",key_AOEM,0),22)/d_PctExtrapolation)*0.9*i_AmountAS2))","v":{"$error":"#N/A"}},{"$f":"IF(ISBLANK(INDEX(ay_OpExAOEM,MATCH(sys_KeyOperator&\"Protected Body\",key_AOEM,0),18)),10^(INDEX(ay_OpExAOEM,MATCH(sys_KeyOperator&\"Protected Body\",key_AOEM,0),15)+(LOG(0.9*i_AmountAS3)*INDEX(ay_OpExAOEM,MATCH(sys_KeyOperator&\"Protected Body\",key_AOEM,0),16))+  IF(AND(i_AppMeth=\"Upward spraying\",LEFT(i_AppEquip,15)=\"Vehicle-mounted\",d_AppPfCaBfR = \"Yes\"),0,IF(AND(i_Season = \"late (dense foliage)\",i_AppMeth=\"Upward spraying\",OR(i_AppEquip=\"Manual-Hand held\",i_AppEquip=\"Manual-Knapsack\")),0,INDEX(ay_OpExAOEM,MATCH(sys_KeyOperator&\"Protected Body\",key_AOEM,0),17)))   ),MAX(INDEX(ay_OpExAOEM,MATCH(sys_KeyOperator&\"Protected Body\",key_AOEM,0),18),(INDEX(ay_OpExAOEM,MATCH(sys_KeyOperator&\"Protected Body\",key_AOEM,0),18)/d_PctExtrapolation)*0.9*i_AmountAS3))","v":{"$error":"#N/A"}},{"$f":"IF(ISBLANK(INDEX(ay_OpExAOEM,MATCH(sys_KeyOperator&\"Protected Body\",key_AOEM,0),22)),10^(INDEX(ay_OpExAOEM,MATCH(sys_KeyOperator&\"Protected Body\",key_AOEM,0),19)+(LOG(0.9*i_AmountAS3)*INDEX(ay_OpExAOEM,MATCH(sys_KeyOperator&\"Protected Body\",key_AOEM,0),20))+  IF(AND(i_AppMeth=\"Upward spraying\",LEFT(i_AppEquip,15)=\"Vehicle-mounted\",d_AppPfCaBfR = \"Yes\"),0,IF(AND(i_Season = \"late (dense foliage)\",i_AppMeth=\"Upward spraying\",OR(i_AppEquip=\"Manual-Hand held\",i_AppEquip=\"Manual-Knapsack\")),0,INDEX(ay_OpExAOEM,MATCH(sys_KeyOperator&\"Protected Body\",key_AOEM,0),21)))   ),MAX(INDEX(ay_OpExAOEM,MATCH(sys_KeyOperator&\"Protected Body\",key_AOEM,0),22),(INDEX(ay_OpExAOEM,MATCH(sys_KeyOperator&\"Protected Body\",key_AOEM,0),22)/d_PctExtrapolation)*0.9*i_AmountAS3))","v":{"$error":"#N/A"}},{"$f":"IF(ISBLANK(INDEX(ay_OpExAOEM,MATCH(sys_KeyOperator&\"Protected Body\",key_AOEM,0),18)),10^(INDEX(ay_OpExAOEM,MATCH(sys_KeyOperator&\"Protected Body\",key_AOEM,0),15)+(LOG(0.9*i_AmountAS4)*INDEX(ay_OpExAOEM,MATCH(sys_KeyOperator&\"Protected Body\",key_AOEM,0),16))+  IF(AND(i_AppMeth=\"Upward spraying\",LEFT(i_AppEquip,15)=\"Vehicle-mounted\",d_AppPfCaBfR = \"Yes\"),0,IF(AND(i_Season = \"late (dense foliage)\",i_AppMeth=\"Upward spraying\",OR(i_AppEquip=\"Manual-Hand held\",i_AppEquip=\"Manual-Knapsack\")),0,INDEX(ay_OpExAOEM,MATCH(sys_KeyOperator&\"Protected Body\",key_AOEM,0),17)))   ),MAX(INDEX(ay_OpExAOEM,MATCH(sys_KeyOperator&\"Protected Body\",key_AOEM,0),18),(INDEX(ay_OpExAOEM,MATCH(sys_KeyOperator&\"Protected Body\",key_AOEM,0),18)/d_PctExtrapolation)*0.9*i_AmountAS4))","v":{"$error":"#N/A"}},{"$f":"IF(ISBLANK(INDEX(ay_OpExAOEM,MATCH(sys_KeyOperator&\"Protected Body\",key_AOEM,0),22)),10^(INDEX(ay_OpExAOEM,MATCH(sys_KeyOperator&\"Protected Body\",key_AOEM,0),19)+(LOG(0.9*i_AmountAS4)*INDEX(ay_OpExAOEM,MATCH(sys_KeyOperator&\"Protected Body\",key_AOEM,0),20))+  IF(AND(i_AppMeth=\"Upward spraying\",LEFT(i_AppEquip,15)=\"Vehicle-mounted\",d_AppPfCaBfR = \"Yes\"),0,IF(AND(i_Season = \"late (dense foliage)\",i_AppMeth=\"Upward spraying\",OR(i_AppEquip=\"Manual-Hand held\",i_AppEquip=\"Manual-Knapsack\")),0,INDEX(ay_OpExAOEM,MATCH(sys_KeyOperator&\"Protected Body\",key_AOEM,0),21)))   ),MAX(INDEX(ay_OpExAOEM,MATCH(sys_KeyOperator&\"Protected Body\",key_AOEM,0),22),(INDEX(ay_OpExAOEM,MATCH(sys_KeyOperator&\"Protected Body\",key_AOEM,0),22)/d_PctExtrapolation)*0.9*i_AmountAS4))","v":{"$error":"#N/A"}},"AOEM"]
[null,null,"Inhalation",{"$f":"IF(ISBLANK(INDEX(ay_OpExAOEM,MATCH(sys_KeyOperator&\"Inhalation\",key_AOEM,0),18)),10^(INDEX(ay_OpExAOEM,MATCH(sys_KeyOperator&\"Inhalation\",key_AOEM,0),15)+(LOG(0.9*i_AmountAS1)*INDEX(ay_OpExAOEM,MATCH(sys_KeyOperator&\"Inhalation\",key_AOEM,0),16))+  IF(AND(i_AppMeth=\"Upward spraying\",LEFT(i_AppEquip,15)=\"Vehicle-mounted\",d_AppPfCaBfR = \"Yes\"),0,IF(AND(i_Season = \"late (dense foliage)\",i_AppMeth=\"Upward spraying\",OR(i_AppEquip=\"Manual-Hand held\",i_AppEquip=\"Manual-Knapsack\")),0,INDEX(ay_OpExAOEM,MATCH(sys_KeyOperator&\"Inhalation\",key_AOEM,0),17)))  ),MAX(INDEX(ay_OpExAOEM,MATCH(sys_KeyOperator&\"Inhalation\",key_AOEM,0),18),(INDEX(ay_OpExAOEM,MATCH(sys_KeyOperator&\"Inhalation\",key_AOEM,0),18)/d_PctExtrapolation)*0.9*i_AmountAS1))","v":{"$error":"#N/A"}},{"$f":"IF(ISBLANK(INDEX(ay_OpExAOEM,MATCH(sys_KeyOperator&\"Inhalation\",key_AOEM,0),22)),10^(INDEX(ay_OpExAOEM,MATCH(sys_KeyOperator&\"Inhalation\",key_AOEM,0),19)+(LOG(0.9*i_AmountAS1)*INDEX(ay_OpExAOEM,MATCH(sys_KeyOperator&\"Inhalation\",key_AOEM,0),20))+  IF(AND(i_AppMeth=\"Upward spraying\",LEFT(i_AppEquip,15)=\"Vehicle-mounted\",d_AppPfCaBfR = \"Yes\"),0,IF(AND(i_Season = \"late (dense foliage)\",i_AppMeth=\"Upward spraying\",OR(i_AppEquip=\"Manual-Hand held\",i_AppEquip=\"Manual-Knapsack\")),0,INDEX(ay_OpExAOEM,MATCH(sys_KeyOperator&\"Inhalation\",key_AOEM,0),21)))  ),MAX(INDEX(ay_OpExAOEM,MATCH(sys_KeyOperator&\"Inhalation\",key_AOEM,0),22),(INDEX(ay_OpExAOEM,MATCH(sys_KeyOperator&\"Inhalation\",key_AOEM,0),22)/d_PctExtrapolation)*0.9*i_AmountAS1))","v":{"$error":"#N/A"}},{"$f":"IF(ISBLANK(INDEX(ay_OpExAOEM,MATCH(sys_KeyOperator&\"Inhalation\",key_AOEM,0),18)),10^(INDEX(ay_OpExAOEM,MATCH(sys_KeyOperator&\"Inhalation\",key_AOEM,0),15)+(LOG(0.9*i_AmountAS2)*INDEX(ay_OpExAOEM,MATCH(sys_KeyOperator&\"Inhalation\",key_AOEM,0),16))+  IF(AND(i_AppMeth=\"Upward spraying\",LEFT(i_AppEquip,15)=\"Vehicle-mounted\",d_AppPfCaBfR = \"Yes\"),0,IF(AND(i_Season = \"late (dense foliage)\",i_AppMeth=\"Upward spraying\",OR(i_AppEquip=\"Manual-Hand held\",i_AppEquip=\"Manual-Knapsack\")),0,INDEX(ay_OpExAOEM,MATCH(sys_KeyOperator&\"Inhalation\",key_AOEM,0),17)))  ),MAX(INDEX(ay_OpExAOEM,MATCH(sys_KeyOperator&\"Inhalation\",key_AOEM,0),18),(INDEX(ay_OpExAOEM,MATCH(sys_KeyOperator&\"Inhalation\",key_AOEM,0),18)/d_PctExtrapolation)*0.9*i_AmountAS2))","v":{"$error":"#N/A"}},{"$f":"IF(ISBLANK(INDEX(ay_OpExAOEM,MATCH(sys_KeyOperator&\"Inhalation\",key_AOEM,0),22)),10^(INDEX(ay_OpExAOEM,MATCH(sys_KeyOperator&\"Inhalation\",key_AOEM,0),19)+(LOG(0.9*i_AmountAS2)*INDEX(ay_OpExAOEM,MATCH(sys_KeyOperator&\"Inhalation\",key_AOEM,0),20))+  IF(AND(i_AppMeth=\"Upward spraying\",LEFT(i_AppEquip,15)=\"Vehicle-mounted\",d_AppPfCaBfR = \"Yes\"),0,IF(AND(i_Season = \"late (dense foliage)\",i_AppMeth=\"Upward spraying\",OR(i_AppEquip=\"Manual-Hand held\",i_AppEquip=\"Manual-Knapsack\")),0,INDEX(ay_OpExAOEM,MATCH(sys_KeyOperator&\"Inhalation\",key_AOEM,0),21)))  ),MAX(INDEX(ay_OpExAOEM,MATCH(sys_KeyOperator&\"Inhalation\",key_AOEM,0),22),(INDEX(ay_OpExAOEM,MATCH(sys_KeyOperator&\"Inhalation\",key_AOEM,0),22)/d_PctExtrapolation)*0.9*i_AmountAS2))","v":{"$error":"#N/A"}},{"$f":"IF(ISBLANK(INDEX(ay_OpExAOEM,MATCH(sys_KeyOperator&\"Inhalation\",key_AOEM,0),18)),10^(INDEX(ay_OpExAOEM,MATCH(sys_KeyOperator&\"Inhalation\",key_AOEM,0),15)+(LOG(0.9*i_AmountAS3)*INDEX(ay_OpExAOEM,MATCH(sys_KeyOperator&\"Inhalation\",key_AOEM,0),16))+  IF(AND(i_AppMeth=\"Upward spraying\",LEFT(i_AppEquip,15)=\"Vehicle-mounted\",d_AppPfCaBfR = \"Yes\"),0,IF(AND(i_Season = \"late (dense foliage)\",i_AppMeth=\"Upward spraying\",OR(i_AppEquip=\"Manual-Hand held\",i_AppEquip=\"Manual-Knapsack\")),0,INDEX(ay_OpExAOEM,MATCH(sys_KeyOperator&\"Inhalation\",key_AOEM,0),17)))  ),MAX(INDEX(ay_OpExAOEM,MATCH(sys_KeyOperator&\"Inhalation\",key_AOEM,0),18),(INDEX(ay_OpExAOEM,MATCH(sys_KeyOperator&\"Inhalation\",key_AOEM,0),18)/d_PctExtrapolation)*0.9*i_AmountAS3))","v":{"$error":"#N/A"}},{"$f":"IF(ISBLANK(INDEX(ay_OpExAOEM,MATCH(sys_KeyOperator&\"Inhalation\",key_AOEM,0),22)),10^(INDEX(ay_OpExAOEM,MATCH(sys_KeyOperator&\"Inhalation\",key_AOEM,0),19)+(LOG(0.9*i_AmountAS3)*INDEX(ay_OpExAOEM,MATCH(sys_KeyOperator&\"Inhalation\",key_AOEM,0),20))+  IF(AND(i_AppMeth=\"Upward spraying\",LEFT(i_AppEquip,15)=\"Vehicle-mounted\",d_AppPfCaBfR = \"Yes\"),0,IF(AND(i_Season = \"late (dense foliage)\",i_AppMeth=\"Upward spraying\",OR(i_AppEquip=\"Manual-Hand held\",i_AppEquip=\"Manual-Knapsack\")),0,INDEX(ay_OpExAOEM,MATCH(sys_KeyOperator&\"Inhalation\",key_AOEM,0),21)))  ),MAX(INDEX(ay_OpExAOEM,MATCH(sys_KeyOperator&\"Inhalation\",key_AOEM,0),22),(INDEX(ay_OpExAOEM,MATCH(sys_KeyOperator&\"Inhalation\",key_AOEM,0),22)/d_PctExtrapolation)*0.9*i_AmountAS3))","v":{"$error":"#N/A"}},{"$f":"IF(ISBLANK(INDEX(ay_OpExAOEM,MATCH(sys_KeyOperator&\"Inhalation\",key_AOEM,0),18)),10^(INDEX(ay_OpExAOEM,MATCH(sys_KeyOperator&\"Inhalation\",key_AOEM,0),15)+(LOG(0.9*i_AmountAS4)*INDEX(ay_OpExAOEM,MATCH(sys_KeyOperator&\"Inhalation\",key_AOEM,0),16))+  IF(AND(i_AppMeth=\"Upward spraying\",LEFT(i_AppEquip,15)=\"Vehicle-mounted\",d_AppPfCaBfR = \"Yes\"),0,IF(AND(i_Season = \"late (dense foliage)\",i_AppMeth=\"Upward spraying\",OR(i_AppEquip=\"Manual-Hand held\",i_AppEquip=\"Manual-Knapsack\")),0,INDEX(ay_OpExAOEM,MATCH(sys_KeyOperator&\"Inhalation\",key_AOEM,0),17)))  ),MAX(INDEX(ay_OpExAOEM,MATCH(sys_KeyOperator&\"Inhalation\",key_AOEM,0),18),(INDEX(ay_OpExAOEM,MATCH(sys_KeyOperator&\"Inhalation\",key_AOEM,0),18)/d_PctExtrapolation)*0.9*i_AmountAS4))","v":{"$error":"#N/A"}},{"$f":"IF(ISBLANK(INDEX(ay_OpExAOEM,MATCH(sys_KeyOperator&\"Inhalation\",key_AOEM,0),22)),10^(INDEX(ay_OpExAOEM,MATCH(sys_KeyOperator&\"Inhalation\",key_AOEM,0),19)+(LOG(0.9*i_AmountAS4)*INDEX(ay_OpExAOEM,MATCH(sys_KeyOperator&\"Inhalation\",key_AOEM,0),20))+  IF(AND(i_AppMeth=\"Upward spraying\",LEFT(i_AppEquip,15)=\"Vehicle-mounted\",d_AppPfCaBfR = \"Yes\"),0,IF(AND(i_Season = \"late (dense foliage)\",i_AppMeth=\"Upward spraying\",OR(i_AppEquip=\"Manual-Hand held\",i_AppEquip=\"Manual-Knapsack\")),0,INDEX(ay_OpExAOEM,MATCH(sys_KeyOperator&\"Inhalation\",key_AOEM,0),21)))  ),MAX(INDEX(ay_OpExAOEM,MATCH(sys_KeyOperator&\"Inhalation\",key_AOEM,0),22),(INDEX(ay_OpExAOEM,MATCH(sys_KeyOperator&\"Inhalation\",key_AOEM,0),22)/d_PctExtrapolation)*0.9*i_AmountAS4))","v":{"$error":"#N/A"}},"AOEM"]
[null,null,"Protective Equipment",null,null,null,null,null,null,null,null,"Penetration factor","Inhalation Protection factor"]
[null,null,"Gloves",{"$f":"'Operator Spray'!D39","v":"No"},null,null,null,null,null,null,null,{"$f":"IF(D39=\"Yes\",\"Incl. in AOEM model\",\"\")","v":""}]
[null,null,"Clothing",{"$f":"'Operator Spray'!D40","v":"Work wear - arms, body and legs covered"},null,null,null,null,null,null,null,"Incl. in AOEM model"]
[null,null,"Head and respiratory PPE",{"$f":"'Operator Spray'!D41","v":"None"},null,null,null,null,null,null,null,{"$f":"INDEX(ay_MixPPEHead,MATCH(D41,key_MixPPEHead,0),2)","v":1},{"$f":"IF(OR(D41=\"Hood and visor\",D41=\"Hood\"),1,INDEX(ay_MixRPE,MATCH(D41,key_MixRPE,0),2))","v":1}]
[null,null,"Cabin",{"$f":"'Operator Spray'!D42","v":"Not relevant"},null,null,null,null,null,null,null,"vehicle mounted upward spraying only"]
[]
[null,"1. Total",null,{"$f":"i_SubstName1","v":0},null,{"$f":"i_SubstName2","v":0},null,{"$f":"i_SubstName3","v":0},null,{"$f":"i_SubstName4","v":0},null,"Combined"]
[null,null,null,"Without RPE/PPE","With RPE/PPE ","Without RPE/PPE","With RPE/PPE ","Without RPE/PPE","With RPE/PPE ","Without RPE/PPE","With RPE/PPE ","Without RPE/PPE","With RPE/PPE "]
[null,"Short-term"]
[null,"Total systemic exposure from mixing, loading and application (mg a.s./day)",null,{"$f":"(D63+D79)","v":{"$error":"#N/A"}},{"$f":"(D70+D85)","v":{"$error":"#N/A"}},{"$f":"(F63+F79)","v":{"$error":"#N/A"}},{"$f":"(F70+F85)","v":{"$error":"#N/A"}},{"$f":"(H63+H79)","v":{"$error":"#N/A"}},{"$f":"(H70+H85)","v":{"$error":"#N/A"}},{"$f":"(J63+J79)","v":{"$error":"#N/A"}},{"$f":"(J70+J85)","v":{"$error":"#N/A"}}]
[null,"Total systemic dose from mixing, loading and application per kg body weight (mg/kg bw/day)",null,{"$f":"D47/d_BwAdult","v":{"$error":"#N/A"}},{"$error":"#N/A"},{"$error":"#N/A"},{"$error":"#N/A"},{"$error":"#N/A"},{"$error":"#N/A"},{"$error":"#N/A"},{"$error":"#N/A"}]
[null,"% of AOEL",null,{"$f":"IFERROR(D48/i_AOEL1,0)","v":0},{"$f":"IFERROR(E48/i_AOEL1,0)","v":0},{"$f":"IFERROR(F48/i_AOEL2,0)","v":0},{"$f":"IFERROR(G48/i_AOEL2,0)","v":0},{"$f":"IFERROR(H48/i_AOEL3,0)","v":0},{"$f":"IFERROR(I48/i_AOEL3,0)","v":0},{"$f":"IFERROR(J48/i_AOEL4,0)","v":0},{"$f":"IFERROR(K48/i_AOEL4,0)","v":0},{"$f":"\"Hazard index = \"&FIXED(D49+F49+H49+J49,3)","v":"Hazard index = 0.000"},{"$f":"\"Hazard index = \"&FIXED(E49+G49+I49+K49,3)","v":"Hazard index = 0.000"}]
[null,"Acute "]
[null,"Total systemic exposure from mixing, loading and application (mg a.s./day)",null,{"$f":"(D95+D111)","v":{"$error":"#N/A"}},{"$f":"(D102+D117)","v":{"$error":"#N/A"}},{"$f":"(F95+F111)","v":{"$error":"#N/A"}},{"$f":"(F102+F117)","v":{"$error":"#N/A"}},{"$f":"(H95+H111)","v":{"$error":"#N/A"}},{"$f":"(H102+H117)","v":{"$error":"#N/A"}},{"$f":"(J95+J111)","v":{"$error":"#N/A"}},{"$f":"(J102+J117)","v":{"$error":"#N/A"}}]
[null,"Total systemic dose from mixing, loading and application per kg body weight (mg/kg bw/day)",null,{"$f":"D51/d_BwAdult","v":{"$error":"#N/A"}},{"$error":"#N/A"},{"$error":"#N/A"},{"$error":"#N/A"},{"$error":"#N/A"},{"$error":"#N/A"},{"$error":"#N/A"},{"$error":"#N/A"}]
[null,"% of AAOEL",null,{"$f":"IFERROR(D52/i_AAOEL1,0)","v":0},{"$f":"IFERROR(E52/i_AAOEL1,0)","v":0},{"$f":"IFERROR(F52/i_AAOEL2,0)","v":0},{"$f":"IFERROR(G52/i_AAOEL2,0)","v":0},{"$f":"IFERROR(H52/i_AAOEL3,0)","v":0},{"$f":"IFERROR(I52/i_AAOEL3,0)","v":0},{"$f":"IFERROR(J52/i_AAOEL4,0)","v":0},{"$f":"IFERROR(K52/i_AAOEL4,0)","v":0},{"$f":"\"Hazard index = \"&FIXED(D53+F53+H53+J53,3)","v":"Hazard index = 0.000"},{"$f":"\"Hazard index = \"&FIXED(E53+G53+I53+K53,3)","v":"Hazard index = 0.000"}]
[]
[null,"2. Short-term exposure"]
[null,"2.1 Mixing and loading",null,{"$f":"i_SubstName1","v":0},null,{"$f":"i_SubstName2","v":0},null,{"$f":"i_SubstName3","v":0},null,{"$f":"i_SubstName4","v":0}]
[null,null,null,"Systemic exposure [mg a.s. /day]","Systemic dose [mg a.s./kg bw/day]","Systemic exposure [mg a.s. /day]","Systemic dose [mg a.s./kg bw/day]","Systemic exposure [mg a.s. /day]","Systemic dose [mg a.s./kg bw/day]","Systemic exposure [mg a.s. /day]","Systemic dose [mg a.s./kg bw/day]"]
[null,"Without RPE/PPE"]
[null,"Hands",null,{"$f":"D17*i_AbsorpProduct1/1000","v":{"$error":"#N/A"}},{"$f":"D59/d_BwAdult","v":{"$error":"#N/A"}},{"$f":"F17*i_AbsorpProduct2/1000","v":{"$error":"#N/A"}},{"$f":"F59/d_BwAdult","v":{"$error":"#N/A"}},{"$f":"H17*i_AbsorpProduct3/1000","v":{"$error":"#N/A"}},{"$f":"H59/d_BwAdult","v":{"$error":"#N/A"}},{"$f":"J17*i_AbsorpProduct4/1000","v":{"$error":"#N/A"}},{"$f":"J59/d_BwAdult","v":{"$error":"#N/A"}}]
[null,"Body",null,{"$f":"D18*i_AbsorpProduct1/1000","v":{"$error":"#N/A"}},{"$f":"D60/d_BwAdult","v":{"$error":"#N/A"}},{"$f":"F18*i_AbsorpProduct2/1000","v":{"$error":"#N/A"}},{"$f":"F60/d_BwAdult","v":{"$error":"#N/A"}},{"$f":"H18*i_AbsorpProduct3/1000","v":{"$error":"#N/A"}},{"$f":"H60/d_BwAdult","v":{"$error":"#N/A"}},{"$f":"J18*i_AbsorpProduct4/1000","v":{"$error":"#N/A"}},{"$f":"J60/d_BwAdult","v":{"$error":"#N/A"}}]
[null,"Head",null,{"$f":"D19*i_AbsorpProduct1/1000","v":{"$error":"#N/A"}},{"$f":"D61/d_BwAdult","v":{"$error":"#N/A"}},{"$f":"F19*i_AbsorpProduct2/1000","v":{"$error":"#N/A"}},{"$f":"F61/d_BwAdult","v":{"$error":"#N/A"}},{"$f":"H19*i_AbsorpProduct3/1000","v":{"$error":"#N/A"}},{"$f":"H61/d_BwAdult","v":{"$error":"#N/A"}},{"$f":"J19*i_AbsorpProduct4/1000","v":{"$error":"#N/A"}},{"$f":"J61/d_BwAdult","v":{"$error":"#N/A"}}]
[null,"Inhalation",null,{"$f":"D23*i_AbsorpInhalation1/1000","v":{"$error":"#N/A"}},{"$f":"D62/d_BwAdult","v":{"$error":"#N/A"}},{"$f":"F23*i_AbsorpInhalation1/1000","v":{"$error":"#N/A"}},{"$f":"F62/d_BwAdult","v":{"$error":"#N/A"}},{"$f":"H23*i_AbsorpInhalation1/1000","v":{"$error":"#N/A"}},{"$f":"H62/d_BwAdult","v":{"$error":"#N/A"}},{"$f":"J23*i_AbsorpInhalation1/1000","v":{"$error":"#N/A"}},{"$f":"J62/d_BwAdult","v":{"$error":"#N/A"}}]
[null,"Sum ",null,{"$f":"D59+D60+D61+D62","v":{"$error":"#N/A"}},{"$f":"D63/d_BwAdult","v":{"$error":"#N/A"}},{"$f":"F59+F60+F61+F62","v":{"$error":"#N/A"}},{"$f":"F63/d_BwAdult","v":{"$error":"#N/A"}},{"$f":"H59+H60+H61+H62","v":{"$error":"#N/A"}},{"$f":"H63/d_BwAdult","v":{"$error":"#N/A"}},{"$f":"J59+J60+J61+J62","v":{"$error":"#N/A"}},{"$f":"J63/d_BwAdult","v":{"$error":"#N/A"}}]
[null,"With RPE/PPE (as selected above)"]
[null,"Hands",null,{"$f":"IF(D25=\"Yes\", D20,D17)*i_AbsorpProduct1/1000","v":{"$error":"#N/A"}},{"$f":"D65/d_BwAdult","v":{"$error":"#N/A"}},{"$f":"IF(D25=\"Yes\", F20,F17)*i_AbsorpProduct2/1000","v":{"$error":"#N/A"}},{"$f":"F65/d_BwAdult","v":{"$error":"#N/A"}},{"$f":"IF(D25=\"Yes\", H20,H17)*i_AbsorpProduct3/1000","v":{"$error":"#N/A"}},{"$f":"H65/d_BwAdult","v":{"$error":"#N/A"}},{"$f":"IF(D25=\"Yes\", J20,J17)*i_AbsorpProduct4/1000","v":{"$error":"#N/A"}},{"$f":"J65/d_BwAdult","v":{"$error":"#N/A"}}]
[null,"Body",null,{"$f":"IF(D26<>\"Potential exposure\",D21,D18)*i_AbsorpProduct1/1000","v":{"$error":"#N/A"}},{"$error":"#N/A"},{"$f":"IF(D26<>\"Potential exposure\",F21,F18)*i_AbsorpProduct2/1000","v":{"$error":"#N/A"}},{"$error":"#N/A"},{"$f":"IF(D26<>\"Potential exposure\",H21,H18)*i_AbsorpProduct3/1000","v":{"$error":"#N/A"}},{"$error":"#N/A"},{"$f":"IF(D26<>\"Potential exposure\",J21,J18)*i_AbsorpProduct4/1000","v":{"$error":"#N/A"}},{"$error":"#N/A"}]
[null,"Head",null,{"$f":"IF($D27<>\"None\",D22*i_AbsorpProduct1,D19*i_AbsorpProduct1)/1000","v":{"$error":"#N/A"}},{"$error":"#N/A"},{"$f":"IF($D27<>\"None\",F22*i_AbsorpProduct2,F19*i_AbsorpProduct2)/1000","v":{"$error":"#N/A"}},{"$error":"#N/A"},{"$f":"IF($D27<>\"None\",H22*i_AbsorpProduct3,H19*i_AbsorpProduct3)/1000","v":{"$error":"#N/A"}},{"$error":"#N/A"},{"$f":"IF($D27<>\"None\",J22*i_AbsorpProduct4,J19*i_AbsorpProduct4)/1000","v":{"$error":"#N/A"}},{"$error":"#N/A"}]
[null,"Inhalation",null,{"$f":"D23*i_AbsorpInhalation1*$M27/1000","v":{"$error":"#N/A"}},{"$error":"#N/A"},{"$f":"F23*i_AbsorpInhalation2*$M27/1000","v":{"$error":"#N/A"}},{"$error":"#N/A"},{"$f":"H23*i_AbsorpInhalation3*$M27/1000","v":{"$error":"#N/A"}},{"$error":"#N/A"},{"$f":"J23*i_AbsorpInhalation4*$M27/1000","v":{"$error":"#N/A"}},{"$error":"#N/A"}]
[null,"Sum ",null,{"$f":"SUM(D65:D68)","v":{"$error":"#N/A"}},{"$error":"#N/A"},{"$f":"SUM(F65:F68)","v":{"$error":"#N/A"}},{"$error":"#N/A"},{"$f":"SUM(H65:H68)","v":{"$error":"#N/A"}},{"$error":"#N/A"},{"$f":"SUM(J65:J68)","v":{"$error":"#N/A"}},{"$error":"#N/A"}]
[null,"Water soluble bag",null,{"$f":"D69*$L28","v":{"$error":"#N/A"}},{"$error":"#N/A"},{"$f":"F69*$L28","v":{"$error":"#N/A"}},{"$error":"#N/A"},{"$f":"H69*$L28","v":{"$error":"#N/A"}},{"$error":"#N/A"},{"$f":"J69*$L28","v":{"$error":"#N/A"}},{"$error":"#N/A"}]
[]
[null,"2.2 Application",null,{"$f":"i_SubstName1","v":0},null,{"$f":"i_SubstName2","v":0},null,{"$f":"i_SubstName3","v":0},null,{"$f":"i_SubstName4","v":0}]
[null,null,null,"Systemic exposure [mg a.s. /day]","Systemic dose [mg a.s./kg bw/day]","Systemic exposure [mg a.s. /day]","Systemic dose [mg a.s./kg bw/day]","Systemic exposure [mg a.s. /day]","Systemic dose [mg a.s./kg bw/day]","Systemic exposure [mg a.s. /day]","Systemic dose [mg a.s./kg bw/day]"]
[null,"Without RPE/PPE"]
[null,"Hands",null,{"$f":"D32*i_AbsorpInuse1/1000","v":{"$error":"#N/A"}},{"$f":"D75/d_BwAdult","v":{"$error":"#N/A"}},{"$f":"F32*i_AbsorpInuse2/1000","v":{"$error":"#N/A"}},{"$f":"F75/d_BwAdult","v":{"$error":"#N/A"}},{"$f":"H32*i_AbsorpInuse3/1000","v":{"$error":"#N/A"}},{"$f":"H75/d_BwAdult","v":{"$error":"#N/A"}},{"$f":"J32*i_AbsorpInuse4/1000","v":{"$error":"#N/A"}},{"$f":"J75/d_BwAdult","v":{"$error":"#N/A"}}]
[null,"Body",null,{"$f":"D33*i_AbsorpInuse1/1000","v":{"$error":"#N/A"}},{"$f":"D76/d_BwAdult","v":{"$error":"#N/A"}},{"$f":"F33*i_AbsorpInuse2/1000","v":{"$error":"#N/A"}},{"$f":"F76/d_BwAdult","v":{"$error":"#N/A"}},{"$f":"H33*i_AbsorpInuse3/1000","v":{"$error":"#N/A"}},{"$f":"H76/d_BwAdult","v":{"$error":"#N/A"}},{"$f":"J33*i_AbsorpInuse4/1000","v":{"$error":"#N/A"}},{"$f":"J76/d_BwAdult","v":{"$error":"#N/A"}}]
[null,"Head",null,{"$f":"D34*i_AbsorpInuse1/1000","v":{"$error":"#N/A"}},{"$f":"D77/d_BwAdult","v":{"$error":"#N/A"}},{"$f":"F34*i_AbsorpInuse2/1000","v":{"$error":"#N/A"}},{"$f":"F77/d_BwAdult","v":{"$error":"#N/A"}},{"$f":"H34*i_AbsorpInuse3/1000","v":{"$error":"#N/A"}},{"$f":"H77/d_BwAdult","v":{"$error":"#N/A"}},{"$f":"J34*i_AbsorpInuse4/1000","v":{"$error":"#N/A"}},{"$f":"J77/d_BwAdult","v":{"$error":"#N/A"}}]
[null,"Inhalation",null,{"$f":"D37*i_AbsorpInhalation1/1000","v":{"$error":"#N/A"}},{"$f":"D78/d_BwAdult","v":{"$error":"#N/A"}},{"$f":"F37*i_AbsorpInhalation1/1000","v":{"$error":"#N/A"}},{"$f":"F78/d_BwAdult","v":{"$error":"#N/A"}},{"$f":"H37*i_AbsorpInhalation1/1000","v":{"$error":"#N/A"}},{"$f":"H78/d_BwAdult","v":{"$error":"#N/A"}},{"$f":"J37*i_AbsorpInhalation1/1000","v":{"$error":"#N/A"}},{"$f":"J78/d_BwAdult","v":{"$error":"#N/A"}}]
[null,"Sum ",null,{"$f":"D75+D76+D77+D78","v":{"$error":"#N/A"}},{"$f":"D79/d_BwAdult","v":{"$error":"#N/A"}},{"$f":"F75+F76+F77+F78","v":{"$error":"#N/A"}},{"$f":"F79/d_BwAdult","v":{"$error":"#N/A"}},{"$f":"H75+H76+H77+H78","v":{"$error":"#N/A"}},{"$f":"H79/d_BwAdult","v":{"$error":"#N/A"}},{"$f":"J75+J76+J77+J78","v":{"$error":"#N/A"}},{"$f":"J79/d_BwAdult","v":{"$error":"#N/A"}}]
[null,"With RPE/PPE (as selected above)"]
[null,"Hands",null,{"$f":"IF(D39=\"Yes\", D35,D32)*i_AbsorpInuse1/1000","v":{"$error":"#N/A"}},{"$f":"D81/d_BwAdult","v":{"$error":"#N/A"}},{"$f":"IF(D39=\"Yes\", F35,F32)*i_AbsorpInuse2/1000","v":{"$error":"#N/A"}},{"$f":"F81/d_BwAdult","v":{"$error":"#N/A"}},{"$f":"IF(D39=\"Yes\", H35,H32)*i_AbsorpInuse3/1000","v":{"$error":"#N/A"}},{"$f":"H81/d_BwAdult","v":{"$error":"#N/A"}},{"$f":"IF(D39=\"Yes\", J35,J32)*i_AbsorpInuse4/1000","v":{"$error":"#N/A"}},{"$f":"J81/d_BwAdult","v":{"$error":"#N/A"}}]
[null,"Body",null,{"$f":"IF(D40<>\"Potential exposure\",D36,D33)*i_AbsorpInuse1/1000","v":{"$error":"#N/A"}},{"$f":"D82/d_BwAdult","v":{"$error":"#N/A"}},{"$f":"IF(D40<>\"Potential exposure\",F36,F33)*i_AbsorpInuse2/1000","v":{"$error":"#N/A"}},{"$f":"F82/d_BwAdult","v":{"$error":"#N/A"}},{"$f":"IF(D40<>\"Potential exposure\",H36,H33)*i_AbsorpInuse3/1000","v":{"$error":"#N/A"}},{"$f":"H82/d_BwAdult","v":{"$error":"#N/A"}},{"$f":"IF(D40<>\"Potential exposure\",J36,J33)*i_AbsorpInuse4/1000","v":{"$error":"#N/A"}},{"$f":"J82/d_BwAdult","v":{"$error":"#N/A"}}]
[null,"Head",null,{"$f":"D34*i_AbsorpInuse1*$L41/1000","v":{"$error":"#N/A"}},{"$f":"D83/d_BwAdult","v":{"$error":"#N/A"}},{"$f":"F34*i_AbsorpInuse2*L41/1000","v":{"$error":"#N/A"}},{"$f":"F83/d_BwAdult","v":{"$error":"#N/A"}},{"$f":"H34*i_AbsorpInuse3*L41/1000","v":{"$error":"#N/A"}},{"$f":"H83/d_BwAdult","v":{"$error":"#N/A"}},{"$f":"J34*i_AbsorpInuse4*L41/1000","v":{"$error":"#N/A"}},{"$f":"J83/d_BwAdult","v":{"$error":"#N/A"}}]
[null,"Inhalation",null,{"$f":"D37*i_AbsorpInhalation1*$M41/1000","v":{"$error":"#N/A"}},{"$f":"D84/d_BwAdult","v":{"$error":"#N/A"}},{"$f":"F37*i_AbsorpInhalation2*$M41/1000","v":{"$error":"#N/A"}},{"$f":"F84/d_BwAdult","v":{"$error":"#N/A"}},{"$f":"H37*i_AbsorpInhalation3*$M41/1000","v":{"$error":"#N/A"}},{"$f":"H84/d_BwAdult","v":{"$error":"#N/A"}},{"$f":"J37*i_AbsorpInhalation4*$M41/1000","v":{"$error":"#N/A"}},{"$f":"J84/d_BwAdult","v":{"$error":"#N/A"}}]
[null,"Sum ",null,{"$f":"SUM(D81:D84)","v":{"$error":"#N/A"}},{"$f":"D85/d_BwAdult","v":{"$error":"#N/A"}},{"$f":"SUM(F81:F84)","v":{"$error":"#N/A"}},{"$f":"F85/d_BwAdult","v":{"$error":"#N/A"}},{"$f":"SUM(H81:H84)","v":{"$error":"#N/A"}},{"$f":"H85/d_BwAdult","v":{"$error":"#N/A"}},{"$f":"SUM(J81:J84)","v":{"$error":"#N/A"}},{"$f":"J85/d_BwAdult","v":{"$error":"#N/A"}}]
[]
[null,"3. Acute exposure"]
[null,"3.1 Mixing and loading",null,{"$f":"i_SubstName1","v":0},null,{"$f":"i_SubstName2","v":0},null,{"$f":"i_SubstName3","v":0},null,{"$f":"i_SubstName4","v":0}]
[null,null,null,"Systemic exposure [mg a.s. /day]","Systemic dose [mg a.s./kg bw/day]","Systemic exposure [mg a.s. /day]","Systemic dose [mg a.s./kg bw/day]","Systemic exposure [mg a.s. /day]","Systemic dose [mg a.s./kg bw/day]","Systemic exposure [mg a.s. /day]","Systemic dose [mg a.s./kg bw/day]"]
[null,"Without RPE/PPE"]
[null,"Hands",null,{"$f":"E17*i_AbsorpProduct1/1000","v":{"$error":"#N/A"}},{"$f":"D91/d_BwAdult","v":{"$error":"#N/A"}},{"$f":"G17*i_AbsorpProduct2/1000","v":{"$error":"#N/A"}},{"$f":"F91/d_BwAdult","v":{"$error":"#N/A"}},{"$f":"I17*i_AbsorpProduct3/1000","v":{"$error":"#N/A"}},{"$f":"H91/d_BwAdult","v":{"$error":"#N/A"}},{"$f":"K17*i_AbsorpProduct4/1000","v":{"$error":"#N/A"}},{"$f":"J91/d_BwAdult","v":{"$error":"#N/A"}}]
[null,"Body",null,{"$f":"E18*i_AbsorpProduct1/1000","v":{"$error":"#N/A"}},{"$f":"D92/d_BwAdult","v":{"$error":"#N/A"}},{"$f":"G18*i_AbsorpProduct2/1000","v":{"$error":"#N/A"}},{"$f":"F92/d_BwAdult","v":{"$error":"#N/A"}},{"$f":"I18*i_AbsorpProduct3/1000","v":{"$error":"#N/A"}},{"$f":"H92/d_BwAdult","v":{"$error":"#N/A"}},{"$f":"K18*i_AbsorpProduct4/1000","v":{"$error":"#N/A"}},{"$f":"J92/d_BwAdult","v":{"$error":"#N/A"}}]
[null,"Head",null,{"$f":"E19*i_AbsorpProduct1/1000","v":{"$error":"#N/A"}},{"$f":"D93/d_BwAdult","v":{"$error":"#N/A"}},{"$f":"G19*i_AbsorpProduct2/1000","v":{"$error":"#N/A"}},{"$f":"F93/d_BwAdult","v":{"$error":"#N/A"}},{"$f":"I19*i_AbsorpProduct3/1000","v":{"$error":"#N/A"}},{"$f":"H93/d_BwAdult","v":{"$error":"#N/A"}},{"$f":"K19*i_AbsorpProduct4/1000","v":{"$error":"#N/A"}},{"$f":"J93/d_BwAdult","v":{"$error":"#N/A"}}]
[null,"Inhalation",null,{"$f":"E23*i_AbsorpInhalation1/1000","v":{"$error":"#N/A"}},{"$f":"D94/d_BwAdult","v":{"$error":"#N/A"}},{"$f":"G23*i_AbsorpInhalation1/1000","v":{"$error":"#N/A"}},{"$f":"F94/d_BwAdult","v":{"$error":"#N/A"}},{"$f":"I23*i_AbsorpInhalation1/1000","v":{"$error":"#N/A"}},{"$f":"H94/d_BwAdult","v":{"$error":"#N/A"}},{"$f":"K23*i_AbsorpInhalation1/1000","v":{"$error":"#N/A"}},{"$f":"J94/d_BwAdult","v":{"$error":"#N/A"}}]
[null,"Sum ",null,{"$f":"D91+D92+D93+D94","v":{"$error":"#N/A"}},{"$f":"D95/d_BwAdult","v":{"$error":"#N/A"}},{"$f":"F91+F92+F93+F94","v":{"$error":"#N/A"}},{"$f":"F95/d_BwAdult","v":{"$error":"#N/A"}},{"$f":"H91+H92+H93+H94","v":{"$error":"#N/A"}},{"$f":"H95/d_BwAdult","v":{"$error":"#N/A"}},{"$f":"J91+J92+J93+J94","v":{"$error":"#N/A"}},{"$f":"J95/d_BwAdult","v":{"$error":"#N/A"}}]
[null,"With RPE/PPE (as selected above)"]
[null,"Hands",null,{"$f":"IF(D25=\"Yes\", E20,E17)*i_AbsorpProduct1/1000","v":{"$error":"#N/A"}},{"$f":"D97/d_BwAdult","v":{"$error":"#N/A"}},{"$f":"IF(D25=\"Yes\", G20,G17)*i_AbsorpProduct2/1000","v":{"$error":"#N/A"}},{"$f":"F97/d_BwAdult","v":{"$error":"#N/A"}},{"$f":"IF(D25=\"Yes\", I20,I17)*i_AbsorpProduct3/1000","v":{"$error":"#N/A"}},{"$f":"H97/d_BwAdult","v":{"$error":"#N/A"}},{"$f":"IF(D25=\"Yes\", K20,K17)*i_AbsorpProduct4/1000","v":{"$error":"#N/A"}},{"$f":"J97/d_BwAdult","v":{"$error":"#N/A"}}]
[null,"Body",null,{"$f":"IF(D26=\"Work wear - arms, body and legs covered\",E21,E18)*i_AbsorpProduct1/1000","v":{"$error":"#N/A"}},{"$error":"#N/A"},{"$f":"IF(D26=\"Work wear - arms, body and legs covered\",G21,G18)*i_AbsorpProduct2/1000","v":{"$error":"#N/A"}},{"$error":"#N/A"},{"$f":"IF(D26=\"Work wear - arms, body and legs covered\",I21,I18)*i_AbsorpProduct3/1000","v":{"$error":"#N/A"}},{"$error":"#N/A"},{"$f":"IF(D26=\"Work wear - arms, body and legs covered\",K21,K18)*i_AbsorpProduct4/1000","v":{"$error":"#N/A"}},{"$error":"#N/A"}]
[null,"Head",null,{"$f":"IF($D27<>\"None\",E22*i_AbsorpProduct1,E19*i_AbsorpProduct1)/1000","v":{"$error":"#N/A"}},{"$error":"#N/A"},{"$f":"IF($D27<>\"None\",G22*i_AbsorpProduct2,G19*i_AbsorpProduct2)/1000","v":{"$error":"#N/A"}},{"$error":"#N/A"},{"$f":"IF($D27<>\"None\",I22*i_AbsorpProduct3,I19*i_AbsorpProduct3)/1000","v":{"$error":"#N/A"}},{"$error":"#N/A"},{"$f":"IF($D27<>\"None\",K22*i_AbsorpProduct4,K19*i_AbsorpProduct4)/1000","v":{"$error":"#N/A"}},{"$error":"#N/A"}]
[null,"Inhalation",null,{"$f":"E23*i_AbsorpInhalation1*$M27/1000","v":{"$error":"#N/A"}},{"$error":"#N/A"},{"$f":"G23*i_AbsorpInhalation2*$M27/1000","v":{"$error":"#N/A"}},{"$error":"#N/A"},{"$f":"I23*i_AbsorpInhalation3*$M27/1000","v":{"$error":"#N/A"}},{"$error":"#N/A"},{"$f":"K23*i_AbsorpInhalation4*$M27/1000","v":{"$error":"#N/A"}},{"$error":"#N/A"}]
[null,"Sum ",null,{"$f":"SUM(D97:D100)","v":{"$error":"#N/A"}},{"$error":"#N/A"},{"$f":"SUM(F97:F100)","v":{"$error":"#N/A"}},{"$error":"#N/A"},{"$f":"SUM(H97:H100)","v":{"$error":"#N/A"}},{"$error":"#N/A"},{"$f":"SUM(J97:J100)","v":{"$error":"#N/A"}},{"$error":"#N/A"}]
[null,"Water soluble bag",null,{"$f":"D101*$L28","v":{"$error":"#N/A"}},{"$error":"#N/A"},{"$f":"F101*$L28","v":{"$error":"#N/A"}},{"$error":"#N/A"},{"$f":"H101*$L28","v":{"$error":"#N/A"}},{"$error":"#N/A"},{"$f":"J101*$L28","v":{"$error":"#N/A"}},{"$error":"#N/A"}]
[]
[null,"2.2 Application",null,{"$f":"i_SubstName1","v":0},null,{"$f":"i_SubstName2","v":0},null,{"$f":"i_SubstName3","v":0},null,{"$f":"i_SubstName4","v":0}]
[null,null,null,"Systemic exposure [mg a.s. /day]","Systemic dose [mg a.s./kg bw/day]","Systemic exposure [mg a.s. /day]","Systemic dose [mg a.s./kg bw/day]","Systemic exposure [mg a.s. /day]","Systemic dose [mg a.s./kg bw/day]","Systemic exposure [mg a.s. /day]","Systemic dose [mg a.s./kg bw/day]"]
[null,"Without RPE/PPE"]
[null,"Hands",null,{"$f":"E32*i_AbsorpInuse1/1000","v":{"$error":"#N/A"}},{"$f":"D107/d_BwAdult","v":{"$error":"#N/A"}},{"$f":"G32*i_AbsorpInuse2/1000","v":{"$error":"#N/A"}},{"$f":"F107/d_BwAdult","v":{"$error":"#N/A"}},{"$f":"I32*i_AbsorpInuse3/1000","v":{"$error":"#N/A"}},{"$f":"H107/d_BwAdult","v":{"$error":"#N/A"}},{"$f":"K32*i_AbsorpInuse4/1000","v":{"$error":"#N/A"}},{"$f":"J107/d_BwAdult","v":{"$error":"#N/A"}}]
[null,"Body",null,{"$f":"E33*i_AbsorpInuse1/1000","v":{"$error":"#N/A"}},{"$f":"D108/d_BwAdult","v":{"$error":"#N/A"}},{"$f":"G33*i_AbsorpInuse2/1000","v":{"$error":"#N/A"}},{"$f":"F108/d_BwAdult","v":{"$error":"#N/A"}},{"$f":"I33*i_AbsorpInuse3/1000","v":{"$error":"#N/A"}},{"$f":"H108/d_BwAdult","v":{"$error":"#N/A"}},{"$f":"K33*i_AbsorpInuse4/1000","v":{"$error":"#N/A"}},{"$f":"J108/d_BwAdult","v":{"$error":"#N/A"}}]
[null,"Head",null,{"$f":"E34*i_AbsorpInuse1/1000","v":{"$error":"#N/A"}},{"$f":"D109/d_BwAdult","v":{"$error":"#N/A"}},{"$f":"G34*i_AbsorpInuse2/1000","v":{"$error":"#N/A"}},{"$f":"F109/d_BwAdult","v":{"$error":"#N/A"}},{"$f":"I34*i_AbsorpInuse3/1000","v":{"$error":"#N/A"}},{"$f":"H109/d_BwAdult","v":{"$error":"#N/A"}},{"$f":"K34*i_AbsorpInuse4/1000","v":{"$error":"#N/A"}},{"$f":"J109/d_BwAdult","v":{"$error":"#N/A"}}]
[null,"Inhalation",null,{"$f":"E37*i_AbsorpInhalation1/1000","v":{"$error":"#N/A"}},{"$f":"D110/d_BwAdult","v":{"$error":"#N/A"}},{"$f":"G37*i_AbsorpInhalation2/1000","v":{"$error":"#N/A"}},{"$f":"F110/d_BwAdult","v":{"$error":"#N/A"}},{"$f":"I37*i_AbsorpInhalation3/1000","v":{"$error":"#N/A"}},{"$f":"H110/d_BwAdult","v":{"$error":"#N/A"}},{"$f":"K37*i_AbsorpInhalation4/1000","v":{"$error":"#N/A"}},{"$f":"J110/d_BwAdult","v":{"$error":"#N/A"}}]
[null,"Sum ",null,{"$f":"D107+D108+D109+D110","v":{"$error":"#N/A"}},{"$f":"D111/d_BwAdult","v":{"$error":"#N/A"}},{"$f":"F107+F108+F109+F110","v":{"$error":"#N/A"}},{"$f":"F111/d_BwAdult","v":{"$error":"#N/A"}},{"$f":"H107+H108+H109+H110","v":{"$error":"#N/A"}},{"$f":"H111/d_BwAdult","v":{"$error":"#N/A"}},{"$f":"J107+J108+J109+J110","v":{"$error":"#N/A"}},{"$f":"J111/d_BwAdult","v":{"$error":"#N/A"}}]
[null,"With RPE/PPE (as selected above)"]
[null,"Hands",null,{"$f":"IF(D39=\"Yes\",E35,E32)*i_AbsorpInuse1/1000","v":{"$error":"#N/A"}},{"$f":"D113/d_BwAdult","v":{"$error":"#N/A"}},{"$f":"IF(D39=\"Yes\",G35,G32)*i_AbsorpInuse2/1000","v":{"$error":"#N/A"}},{"$f":"F113/d_BwAdult","v":{"$error":"#N/A"}},{"$f":"IF(D39=\"Yes\",I35,I32)*i_AbsorpInuse3/1000","v":{"$error":"#N/A"}},{"$f":"H113/d_BwAdult","v":{"$error":"#N/A"}},{"$f":"IF(D39=\"Yes\",K35,K32)*i_AbsorpInuse4/1000","v":{"$error":"#N/A"}},{"$f":"J113/d_BwAdult","v":{"$error":"#N/A"}}]
[null,"Body",null,{"$f":"IF(D40=\"Work wear - arms, body and legs covered\",E36,E33)*i_AbsorpInuse1/1000","v":{"$error":"#N/A"}},{"$f":"D114/d_BwAdult","v":{"$error":"#N/A"}},{"$f":"IF(D40=\"Work wear - arms, body and legs covered\",G36,G33)*i_AbsorpInuse2/1000","v":{"$error":"#N/A"}},{"$f":"F114/d_BwAdult","v":{"$error":"#N/A"}},{"$f":"IF(D40=\"Work wear - arms, body and legs covered\",I36,I33)*i_AbsorpInuse3/1000","v":{"$error":"#N/A"}},{"$f":"H114/d_BwAdult","v":{"$error":"#N/A"}},{"$f":"IF(D40=\"Work wear - arms, body and legs covered\",K36,K33)*i_AbsorpInuse4/1000","v":{"$error":"#N/A"}},{"$f":"J114/d_BwAdult","v":{"$error":"#N/A"}}]
[null,"Head",null,{"$f":"E34*i_AbsorpInuse1*$L41/1000","v":{"$error":"#N/A"}},{"$f":"D115/d_BwAdult","v":{"$error":"#N/A"}},{"$f":"G34*i_AbsorpInuse2*$L41/1000","v":{"$error":"#N/A"}},{"$f":"F115/d_BwAdult","v":{"$error":"#N/A"}},{"$f":"I34*i_AbsorpInuse3*$L41/1000","v":{"$error":"#N/A"}},{"$f":"H115/d_BwAdult","v":{"$error":"#N/A"}},{"$f":"K34*i_AbsorpInuse4*$L41/1000","v":{"$error":"#N/A"}},{"$f":"J115/d_BwAdult","v":{"$error":"#N/A"}}]
[null,"Inhalation",null,{"$f":"E37*i_AbsorpInhalation1*$M41/1000","v":{"$error":"#N/A"}},{"$f":"D116/d_BwAdult","v":{"$error":"#N/A"}},{"$f":"G37*i_AbsorpInhalation2*$M41/1000","v":{"$error":"#N/A"}},{"$f":"F116/d_BwAdult","v":{"$error":"#N/A"}},{"$f":"I37*i_AbsorpInhalation3*$M41/1000","v":{"$error":"#N/A"}},{"$f":"H116/d_BwAdult","v":{"$error":"#N/A"}},{"$f":"K37*i_AbsorpInhalation4*$M41/1000","v":{"$error":"#N/A"}},{"$f":"J116/d_BwAdult","v":{"$error":"#N/A"}}]
[null,"Sum ",null,{"$f":"SUM(D113:D116)","v":{"$error":"#N/A"}},{"$f":"D117/d_BwAdult","v":{"$error":"#N/A"}},{"$f":"SUM(F113:F116)","v":{"$error":"#N/A"}},{"$f":"F117/d_BwAdult","v":{"$error":"#N/A"}},{"$f":"SUM(H113:H116)","v":{"$error":"#N/A"}},{"$f":"H117/d_BwAdult","v":{"$error":"#N/A"}},{"$f":"SUM(J113:J116)","v":{"$error":"#N/A"}},{"$f":"J117/d_BwAdult","v":{"$error":"#N/A"}}]

{"sheet":"MHH","index":9,"n_rows":117,"n_cols":13,"rows_kept":117,"cut":false,"hidden":true,"merged":[[115,1,115,2],[116,1,116,2],[109,1,109,2],[110,1,110,2],[111,1,111,2],[112,1,112,2],[113,1,113,2],[114,1,114,2],[103,9,103,10],[104,1,104,2],[105,1,105,2],[106,1,106,2],[107,1,107,2],[108,1,108,2],[99,1,99,2],[100,1,100,2],[101,1,101,2],[103,3,103,4],[103,5,103,6],[103,7,103,8],[93,1,93,2],[94,1,94,2],[95,1,95,2],[96,1,96,2],[97,1,97,2],[98,1,98,2],[87,9,87,10],[88,1,88,2],[89,1,89,2],[90,1,90,2],[91,1,91,2],[92,1,92,2],[82,1,82,2],[83,1,83,2],[84,1,84,2],[87,3,87,4],[87,5,87,6],[87,7,87,8],[76,1,76,2],[77,1,77,2],[78,1,78,2],[79,1,79,2],[80,1,80,2],[81,1,81,2],[71,7,71,8],[71,9,71,10],[72,1,72,2],[73,1,73,2],[74,1,74,2],[75,1,75,2],[67,1,67,2],[68,1,68,2],[69,1,69,2],[71,1,71,2],[71,3,71,4],[71,5,71,6],[61,1,61,2],[62,1,62,2],[63,1,63,2],[64,1,64,2],[65,1,65,2],[66,1,66,2],[55,9,55,10],[56,1,56,2],[57,1,57,2],[58,1,58,2],[59,1,59,2],[60,1,60,2],[51,1,51,2],[53,4,53,5],[54,4,54,5],[55,3,55,4],[55,5,55,6],[55,7,55,8],[45,1,45,12],[46,1,46,2],[47,1,47,2],[48,1,48,2],[49,1,49,12],[50,1,50,2],[39,3,39,4],[39,11,39,12],[40,3,40,4],[41,3,41,4],[41,11,41,12],[43,3,43,4],[43,5,43,6],[43,7,43,8],[43,9,43,10],[43,11,43,12],[29,11,30,11],[29,12,30,12],[31,12,36,12],[37,3,37,4],[38,3,38,4],[38,11,38,12],[28,1,41,1],[28,3,28,4],[28,5,28,6],[28,7,28,8],[28,9,28,10],[29,2,30,2],[29,3,29,4],[29,5,29,6],[29,7,29,8],[29,9,29,10],[14,11,15,11],[14,12,15,12],[23,3,23,4],[24,3,24,4],[25,3,25,4],[26,3,26,4],[14,1,27,1],[14,2,15,2],[14,3,14,4],[14,5,14,6],[14,7,14,8],[14,9,14,10],[27,3,27,4],[8,3,8,10],[9,3,9,10],[10,3,10,10],[11,3,11,10],[12,1,12,12],[13,3,13,4],[13,5,13,6],[13,7,13,8],[13,9,13,10],[6,3,6,10],[7,3,7,10],[3,3,3,4],[3,5,3,6],[3,7,3,8],[3,9,3,10],[4,3,4,4],[4,5,4,6],[4,7,4,8],[4,9,4,10],[1,3,1,4],[1,5,1,6],[1,7,1,8],[1,9,1,10],[2,3,2,4],[2,5,2,6],[2,7,2,8],[2,9,2,10],[5,3,5,4],[5,5,5,6],[5,7,5,8],[5,9,5,10]]}
[null,{"$f":"\"Operator exposure for \"&i_ProductName & \" spray applications\"","v":"Operator exposure for  spray applications"},null,null,null,{"$f":"IF(i_FormVal <> \"Granules, fine granules\",\"\",\"This sheet is only to be used for spray applications\")","v":""}]
[null,null,null,{"$f":"i_SubstName1","v":0},null,{"$f":"i_SubstName2","v":0},null,{"$f":"i_SubstName3","v":0},null,{"$f":"i_SubstName4","v":0}]
[null,"Application rate of active substance",null,{"$f":"i_AppRateAS1*0.1","v":0},null,{"$f":"i_AppRateAS2*0.1","v":0},null,{"$f":"i_AppRateAS3*0.1","v":0},null,{"$f":"i_AppRateAS4*0.1","v":0},null,"kg a.s./ha","i_AppRateAS"]
[null,"Amount of active substance applied",null,{"$f":"d_AreaTreated*i_AppRateAS1","v":0},null,{"$f":"d_AreaTreated*i_AppRateAS2","v":0},null,{"$f":"d_AreaTreated*i_AppRateAS3","v":0},null,{"$f":"d_AreaTreated*i_AppRateAS4","v":0},null,"kg a.s./day","i_AmountAS"]
[null,"Dermal absorption of the product",null,{"$f":"i_AbsorpProduct1","v":0},null,{"$f":"i_AbsorpProduct2","v":0},null,{"$f":"i_AbsorpProduct3","v":0},null,{"$f":"i_AbsorpProduct4","v":0},null,null,"i_AbsorpProduct"]
[null,"Dermal absorption of in-use dilution",null,{"$f":"i_AbsorpInuse1","v":0},null,{"$f":"i_AbsorpInuse2","v":0},null,{"$f":"i_AbsorpInuse3","v":0},null,{"$f":"i_AbsorpInuse4","v":0},null,null,"i_AbsorInuse"]
[null,"Formulation type",null,{"$f":"i_FormVal","v":0}]
[null,"Indoor or Outdoor application",null,{"$f":"'Data entry'!D8","v":0}]
[null,"Application method",null,{"$f":"i_AppMeth","v":0}]
[null,"Application equipment",null,{"$f":"i_AppEquip","v":0}]
[null,"Assumed area treated",null,{"$f":"d_AreaTreated","v":1},null,null,null,null,null,null,null,"ha/day","d_AreaTreated"]
[null,"Season",null,{"$f":"i_Season","v":"not relevant"}]
[null,{"$f":"i_IndoorOutdoor&i_FormVal&i_AppMeth&\"Manual-Hand held\"","v":"Manual-Hand held"}]
[null,null,null,{"$f":"i_SubstName1","v":0},null,{"$f":"i_SubstName2","v":0},null,{"$f":"i_SubstName3","v":0},null,{"$f":"i_SubstName4","v":0}]
[null,"Mixing and loading","Exposure values ","µg exposure/day mixed and loaded",null,"µg exposure/day mixed and loaded",null,"µg exposure/day mixed and loaded",null,"µg exposure/day mixed and loaded",null,"Reference ","Comment"]
[null,null,null,"75th percentile","95th percentile ","75th percentile","95th percentile ","75th percentile","95th percentile ","75th percentile","95th percentile "]
[null,null,"Hands",{"$f":"IF(ISBLANK(INDEX(ay_OpExAOEM,MATCH(sys_KeyOperator&\"Hands\",key_AOEM,0),10)),10^(INDEX(ay_OpExAOEM,MATCH(sys_KeyOperator&\"Hands\",key_AOEM,0),7)+(LOG(i_AmountAS1)*INDEX(ay_OpExAOEM,MATCH(sys_KeyOperator&\"Hands\",key_AOEM,0),8))+INDEX(ay_OpExAOEM,MATCH(sys_KeyOperator&\"Hands\",key_AOEM,0),9)),MAX(INDEX(ay_OpExAOEM,MATCH(sys_KeyOperator&\"Hands\",key_AOEM,0),10),(INDEX(ay_OpExAOEM,MATCH(sys_KeyOperator&\"Hands\",key_AOEM,0),10)/1.5)*i_AmountAS1))","v":{"$error":"#N/A"}},{"$f":"IF(ISBLANK(INDEX(ay_OpExAOEM,MATCH(sys_KeyOperator&\"Hands\",key_AOEM,0),14)),10^(INDEX(ay_OpExAOEM,MATCH(sys_KeyOperator&\"Hands\",key_AOEM,0),11)+(LOG(i_AmountAS1)*INDEX(ay_OpExAOEM,MATCH(sys_KeyOperator&\"Hands\",key_AOEM,0),12))+INDEX(ay_OpExAOEM,MATCH(sys_KeyOperator&\"Hands\",key_AOEM,0),13)),MAX(INDEX(ay_OpExAOEM,MATCH(sys_KeyOperator&\"Hands\",key_AOEM,0),14),(INDEX(ay_OpExAOEM,MATCH(sys_KeyOperator&\"Hands\",key_AOEM,0),14)/1.5)*i_AmountAS1))","v":{"$error":"#N/A"}},{"$f":"IF(ISBLANK(INDEX(ay_OpExAOEM,MATCH(sys_KeyOperator&\"Hands\",key_AOEM,0),10)),10^(INDEX(ay_OpExAOEM,MATCH(sys_KeyOperator&\"Hands\",key_AOEM,0),7)+(LOG(i_AmountAS2)*INDEX(ay_OpExAOEM,MATCH(sys_KeyOperator&\"Hands\",key_AOEM,0),8))+INDEX(ay_OpExAOEM,MATCH(sys_KeyOperator&\"Hands\",key_AOEM,0),9)),MAX(INDEX(ay_OpExAOEM,MATCH(sys_KeyOperator&\"Hands\",key_AOEM,0),10),(INDEX(ay_OpExAOEM,MATCH(sys_KeyOperator&\"Hands\",key_AOEM,0),10)/1.5)*i_AmountAS2))","v":{"$error":"#N/A"}},{"$f":"IF(ISBLANK(INDEX(ay_OpExAOEM,MATCH(sys_KeyOperator&\"Hands\",key_AOEM,0),14)),10^(INDEX(ay_OpExAOEM,MATCH(sys_KeyOperator&\"Hands\",key_AOEM,0),11)+(LOG(i_AmountAS2)*INDEX(ay_OpExAOEM,MATCH(sys_KeyOperator&\"Hands\",key_AOEM,0),12))+INDEX(ay_OpExAOEM,MATCH(sys_KeyOperator&\"Hands\",key_AOEM,0),13)),MAX(INDEX(ay_OpExAOEM,MATCH(sys_KeyOperator&\"Hands\",key_AOEM,0),14),(INDEX(ay_OpExAOEM,MATCH(sys_KeyOperator&\"Hands\",key_AOEM,0),14)/1.5)*i_AmountAS2))","v":{"$error":"#N/A"}},{"$f":"IF(ISBLANK(INDEX(ay_OpExAOEM,MATCH(sys_KeyOperator&\"Hands\",key_AOEM,0),10)),10^(INDEX(ay_OpExAOEM,MATCH(sys_KeyOperator&\"Hands\",key_AOEM,0),7)+(LOG(i_AmountAS3)*INDEX(ay_OpExAOEM,MATCH(sys_KeyOperator&\"Hands\",key_AOEM,0),8))+INDEX(ay_OpExAOEM,MATCH(sys_KeyOperator&\"Hands\",key_AOEM,0),9)),MAX(INDEX(ay_OpExAOEM,MATCH(sys_KeyOperator&\"Hands\",key_AOEM,0),10),(INDEX(ay_OpExAOEM,MATCH(sys_KeyOperator&\"Hands\",key_AOEM,0),10)/1.5)*i_AmountAS3))","v":{"$error":"#N/A"}},{"$f":"IF(ISBLANK(INDEX(ay_OpExAOEM,MATCH(sys_KeyOperator&\"Hands\",key_AOEM,0),14)),10^(INDEX(ay_OpExAOEM,MATCH(sys_KeyOperator&\"Hands\",key_AOEM,0),11)+(LOG(i_AmountAS3)*INDEX(ay_OpExAOEM,MATCH(sys_KeyOperator&\"Hands\",key_AOEM,0),12))+INDEX(ay_OpExAOEM,MATCH(sys_KeyOperator&\"Hands\",key_AOEM,0),13)),MAX(INDEX(ay_OpExAOEM,MATCH(sys_KeyOperator&\"Hands\",key_AOEM,0),14),(INDEX(ay_OpExAOEM,MATCH(sys_KeyOperator&\"Hands\",key_AOEM,0),14)/1.5)*i_AmountAS3))","v":{"$error":"#N/A"}},{"$f":"IF(ISBLANK(INDEX(ay_OpExAOEM,MATCH(sys_KeyOperator&\"Hands\",key_AOEM,0),10)),10^(INDEX(ay_OpExAOEM,MATCH(sys_KeyOperator&\"Hands\",key_AOEM,0),7)+(LOG(i_AmountAS4)*INDEX(ay_OpExAOEM,MATCH(sys_KeyOperator&\"Hands\",key_AOEM,0),8))+INDEX(ay_OpExAOEM,MATCH(sys_KeyOperator&\"Hands\",key_AOEM,0),9)),MAX(INDEX(ay_OpExAOEM,MATCH(sys_KeyOperator&\"Hands\",key_AOEM,0),10),(INDEX(ay_OpExAOEM,MATCH(sys_KeyOperator&\"Hands\",key_AOEM,0),10)/1.5)*i_AmountAS4))","v":{"$error":"#N/A"}},{"$f":"IF(ISBLANK(INDEX(ay_OpExAOEM,MATCH(sys_KeyOperator&\"Hands\",key_AOEM,0),14)),10^(INDEX(ay_OpExAOEM,MATCH(sys_KeyOperator&\"Hands\",key_AOEM,0),11)+(LOG(i_AmountAS4)*INDEX(ay_OpExAOEM,MATCH(sys_KeyOperator&\"Hands\",key_AOEM,0),12))+INDEX(ay_OpExAOEM,MATCH(sys_KeyOperator&\"Hands\",key_AOEM,0),13)),MAX(INDEX(ay_OpExAOEM,MATCH(sys_KeyOperator&\"Hands\",key_AOEM,0),14),(INDEX(ay_OpExAOEM,MATCH(sys_KeyOperator&\"Hands\",key_AOEM,0),14)/1.5)*i_AmountAS4))","v":{"$error":"#N/A"}},"AOEM"]
[null,null,"Body",{"$f":"IF(ISBLANK(INDEX(ay_OpExAOEM,MATCH(sys_KeyOperator&\"Body\",key_AOEM,0),10)),10^(INDEX(ay_OpExAOEM,MATCH(sys_KeyOperator&\"Body\",key_AOEM,0),7)+(LOG(i_AmountAS1)*INDEX(ay_OpExAOEM,MATCH(sys_KeyOperator&\"Body\",key_AOEM,0),8))+INDEX(ay_OpExAOEM,MATCH(sys_KeyOperator&\"Body\",key_AOEM,0),9)),MAX(INDEX(ay_OpExAOEM,MATCH(sys_KeyOperator&\"Body\",key_AOEM,0),10),(INDEX(ay_OpExAOEM,MATCH(sys_KeyOperator&\"Body\",key_AOEM,0),10)/1.5)*i_AmountAS1))","v":{"$error":"#N/A"}},{"$f":"IF(ISBLANK(INDEX(ay_OpExAOEM,MATCH(sys_KeyOperator&\"Body\",key_AOEM,0),14)), 10^(INDEX(ay_OpExAOEM,MATCH(sys_KeyOperator&\"Body\",key_AOEM,0),11) +(LOG(i_AmountAS1)*INDEX(ay_OpExAOEM,MATCH(sys_KeyOperator&\"Body\",key_AOEM,0),12)) +INDEX(ay_OpExAOEM,MATCH(sys_KeyOperator&\"Body\",key_AOEM,0),13)),MAX(INDEX(ay_OpExAOEM,MATCH(sys_KeyOperator&\"Body\",key_AOEM,0),14),(INDEX(ay_OpExAOEM,MATCH(sys_KeyOperator&\"Body\",key_AOEM,0),14) /1.5)*i_AmountAS1))","v":{"$error":"#N/A"}},{"$f":"IF(ISBLANK(INDEX(ay_OpExAOEM,MATCH(sys_KeyOperator&\"Body\",key_AOEM,0),10)),10^(INDEX(ay_OpExAOEM,MATCH(sys_KeyOperator&\"Body\",key_AOEM,0),7)+(LOG(i_AmountAS2)*INDEX(ay_OpExAOEM,MATCH(sys_KeyOperator&\"Body\",key_AOEM,0),8))+INDEX(ay_OpExAOEM,MATCH(sys_KeyOperator&\"Body\",key_AOEM,0),9)),MAX(INDEX(ay_OpExAOEM,MATCH(sys_KeyOperator&\"Body\",key_AOEM,0),10),(INDEX(ay_OpExAOEM,MATCH(sys_KeyOperator&\"Body\",key_AOEM,0),10)/1.5)*i_AmountAS2))","v":{"$error":"#N/A"}},{"$f":"IF(ISBLANK(INDEX(ay_OpExAOEM,MATCH(sys_KeyOperator&\"Body\",key_AOEM,0),14)), 10^(INDEX(ay_OpExAOEM,MATCH(sys_KeyOperator&\"Body\",key_AOEM,0),11) +(LOG(i_AmountAS2)*INDEX(ay_OpExAOEM,MATCH(sys_KeyOperator&\"Body\",key_AOEM,0),12)) +INDEX(ay_OpExAOEM,MATCH(sys_KeyOperator&\"Body\",key_AOEM,0),13)),MAX(INDEX(ay_OpExAOEM,MATCH(sys_KeyOperator&\"Body\",key_AOEM,0),14),(INDEX(ay_OpExAOEM,MATCH(sys_KeyOperator&\"Body\",key_AOEM,0),14) /1.5)*i_AmountAS2))","v":{"$error":"#N/A"}},{"$f":"IF(ISBLANK(INDEX(ay_OpExAOEM,MATCH(sys_KeyOperator&\"Body\",key_AOEM,0),10)),10^(INDEX(ay_OpExAOEM,MATCH(sys_KeyOperator&\"Body\",key_AOEM,0),7)+(LOG(i_AmountAS3)*INDEX(ay_OpExAOEM,MATCH(sys_KeyOperator&\"Body\",key_AOEM,0),8))+INDEX(ay_OpExAOEM,MATCH(sys_KeyOperator&\"Body\",key_AOEM,0),9)),MAX(INDEX(ay_OpExAOEM,MATCH(sys_KeyOperator&\"Body\",key_AOEM,0),10),(INDEX(ay_OpExAOEM,MATCH(sys_KeyOperator&\"Body\",key_AOEM,0),10)/1.5)*i_AmountAS3))","v":{"$error":"#N/A"}},{"$f":"IF(ISBLANK(INDEX(ay_OpExAOEM,MATCH(sys_KeyOperator&\"Body\",key_AOEM,0),14)), 10^(INDEX(ay_OpExAOEM,MATCH(sys_KeyOperator&\"Body\",key_AOEM,0),11) +(LOG(i_AmountAS3)*INDEX(ay_OpExAOEM,MATCH(sys_KeyOperator&\"Body\",key_AOEM,0),12)) +INDEX(ay_OpExAOEM,MATCH(sys_KeyOperator&\"Body\",key_AOEM,0),13)),MAX(INDEX(ay_OpExAOEM,MATCH(sys_KeyOperator&\"Body\",key_AOEM,0),14),(INDEX(ay_OpExAOEM,MATCH(sys_KeyOperator&\"Body\",key_AOEM,0),14) /1.5)*i_AmountAS3))","v":{"$error":"#N/A"}},{"$f":"IF(ISBLANK(INDEX(ay_OpExAOEM,MATCH(sys_KeyOperator&\"Body\",key_AOEM,0),10)),10^(INDEX(ay_OpExAOEM,MATCH(sys_KeyOperator&\"Body\",key_AOEM,0),7)+(LOG(i_AmountAS4)*INDEX(ay_OpExAOEM,MATCH(sys_KeyOperator&\"Body\",key_AOEM,0),8))+INDEX(ay_OpExAOEM,MATCH(sys_KeyOperator&\"Body\",key_AOEM,0),9)),MAX(INDEX(ay_OpExAOEM,MATCH(sys_KeyOperator&\"Body\",key_AOEM,0),10),(INDEX(ay_OpExAOEM,MATCH(sys_KeyOperator&\"Body\",key_AOEM,0),10)/1.5)*i_AmountAS4))","v":{"$error":"#N/A"}},{"$f":"IF(ISBLANK(INDEX(ay_OpExAOEM,MATCH(sys_KeyOperator&\"Body\",key_AOEM,0),14)), 10^(INDEX(ay_OpExAOEM,MATCH(sys_KeyOperator&\"Body\",key_AOEM,0),11) +(LOG(i_AmountAS4)*INDEX(ay_OpExAOEM,MATCH(sys_KeyOperator&\"Body\",key_AOEM,0),12)) +INDEX(ay_OpExAOEM,MATCH(sys_KeyOperator&\"Body\",key_AOEM,0),13)),MAX(INDEX(ay_OpExAOEM,MATCH(sys_KeyOperator&\"Body\",key_AOEM,0),14),(INDEX(ay_OpExAOEM,MATCH(sys_KeyOperator&\"Body\",key_AOEM,0),14) /1.5)*i_AmountAS4))","v":{"$error":"#N/A"}},"AOEM"]
[null,null,"Head",{"$f":"IF(ISBLANK(INDEX(ay_OpExAOEM,MATCH(sys_KeyOperator&\"Head\",key_AOEM,0),10)),10^(INDEX(ay_OpExAOEM,MATCH(sys_KeyOperator&\"Head\",key_AOEM,0),7)+(LOG(i_AmountAS1)*INDEX(ay_OpExAOEM,MATCH(sys_KeyOperator&\"Head\",key_AOEM,0),8))+INDEX(ay_OpExAOEM,MATCH(sys_KeyOperator&\"Head\",key_AOEM,0),9)),MAX(INDEX(ay_OpExAOEM,MATCH(sys_KeyOperator&\"Head\",key_AOEM,0),10),(INDEX(ay_OpExAOEM,MATCH(sys_KeyOperator&\"Head\",key_AOEM,0),10)/1.5)*i_AmountAS1))","v":{"$error":"#N/A"}},{"$f":"IF(ISBLANK(INDEX(ay_OpExAOEM,MATCH(sys_KeyOperator&\"Head\",key_AOEM,0),14)), 10^(INDEX(ay_OpExAOEM,MATCH(sys_KeyOperator&\"Head\",key_AOEM,0),11) +(LOG(i_AmountAS1)*INDEX(ay_OpExAOEM,MATCH(sys_KeyOperator&\"Head\",key_AOEM,0),12)) +INDEX(ay_OpExAOEM,MATCH(sys_KeyOperator&\"Head\",key_AOEM,0),13)),MAX(INDEX(ay_OpExAOEM,MATCH(sys_KeyOperator&\"Head\",key_AOEM,0),14),(INDEX(ay_OpExAOEM,MATCH(sys_KeyOperator&\"Head\",key_AOEM,0),14) /1.5)*i_AmountAS1))","v":{"$error":"#N/A"}},{"$f":"IF(ISBLANK(INDEX(ay_OpExAOEM,MATCH(sys_KeyOperator&\"Head\",key_AOEM,0),10)),10^(INDEX(ay_OpExAOEM,MATCH(sys_KeyOperator&\"Head\",key_AOEM,0),7)+(LOG(i_AmountAS2)*INDEX(ay_OpExAOEM,MATCH(sys_KeyOperator&\"Head\",key_AOEM,0),8))+INDEX(ay_OpExAOEM,MATCH(sys_KeyOperator&\"Head\",key_AOEM,0),9)),MAX(INDEX(ay_OpExAOEM,MATCH(sys_KeyOperator&\"Head\",key_AOEM,0),10),(INDEX(ay_OpExAOEM,MATCH(sys_KeyOperator&\"Head\",key_AOEM,0),10)/1.5)*i_AmountAS2))","v":{"$error":"#N/A"}},{"$f":"IF(ISBLANK(INDEX(ay_OpExAOEM,MATCH(sys_KeyOperator&\"Head\",key_AOEM,0),14)), 10^(INDEX(ay_OpExAOEM,MATCH(sys_KeyOperator&\"Head\",key_AOEM,0),11) +(LOG(i_AmountAS2)*INDEX(ay_OpExAOEM,MATCH(sys_KeyOperator&\"Head\",key_AOEM,0),12)) +INDEX(ay_OpExAOEM,MATCH(sys_KeyOperator&\"Head\",key_AOEM,0),13)),MAX(INDEX(ay_OpExAOEM,MATCH(sys_KeyOperator&\"Head\",key_AOEM,0),14),(INDEX(ay_OpExAOEM,MATCH(sys_KeyOperator&\"Head\",key_AOEM,0),14) /1.5)*i_AmountAS2))","v":{"$error":"#N/A"}},{"$f":"IF(ISBLANK(INDEX(ay_OpExAOEM,MATCH(sys_KeyOperator&\"Head\",key_AOEM,0),10)),10^(INDEX(ay_OpExAOEM,MATCH(sys_KeyOperator&\"Head\",key_AOEM,0),7)+(LOG(i_AmountAS3)*INDEX(ay_OpExAOEM,MATCH(sys_KeyOperator&\"Head\",key_AOEM,0),8))+INDEX(ay_OpExAOEM,MATCH(sys_KeyOperator&\"Head\",key_AOEM,0),9)),MAX(INDEX(ay_OpExAOEM,MATCH(sys_KeyOperator&\"Head\",key_AOEM,0),10),(INDEX(ay_OpExAOEM,MATCH(sys_KeyOperator&\"Head\",key_AOEM,0),10)/1.5)*i_AmountAS3))","v":{"$error":"#N/A"}},{"$f":"IF(ISBLANK(INDEX(ay_OpExAOEM,MATCH(sys_KeyOperator&\"Head\",key_AOEM,0),14)), 10^(INDEX(ay_OpExAOEM,MATCH(sys_KeyOperator&\"Head\",key_AOEM,0),11) +(LOG(i_AmountAS3)*INDEX(ay_OpExAOEM,MATCH(sys_KeyOperator&\"Head\",key_AOEM,0),12)) +INDEX(ay_OpExAOEM,MATCH(sys_KeyOperator&\"Head\",key_AOEM,0),13)),MAX(INDEX(ay_OpExAOEM,MATCH(sys_KeyOperator&\"Head\",key_AOEM,0),14),(INDEX(ay_OpExAOEM,MATCH(sys_KeyOperator&\"Head\",key_AOEM,0),14) /1.5)*i_AmountAS3))","v":{"$error":"#N/A"}},{"$f":"IF(ISBLANK(INDEX(ay_OpExAOEM,MATCH(sys_KeyOperator&\"Head\",key_AOEM,0),10)),10^(INDEX(ay_OpExAOEM,MATCH(sys_KeyOperator&\"Head\",key_AOEM,0),7)+(LOG(i_AmountAS4)*INDEX(ay_OpExAOEM,MATCH(sys_KeyOperator&\"Head\",key_AOEM,0),8))+INDEX(ay_OpExAOEM,MATCH(sys_KeyOperator&\"Head\",key_AOEM,0),9)),MAX(INDEX(ay_OpExAOEM,MATCH(sys_KeyOperator&\"Head\",key_AOEM,0),10),(INDEX(ay_OpExAOEM,MATCH(sys_KeyOperator&\"Head\",key_AOEM,0),10)/1.5)*i_AmountAS4))","v":{"$error":"#N/A"}},{"$f":"IF(ISBLANK(INDEX(ay_OpExAOEM,MATCH(sys_KeyOperator&\"Head\",key_AOEM,0),14)), 10^(INDEX(ay_OpExAOEM,MATCH(sys_KeyOperator&\"Head\",key_AOEM,0),11) +(LOG(i_AmountAS4)*INDEX(ay_OpExAOEM,MATCH(sys_KeyOperator&\"Head\",key_AOEM,0),12)) +INDEX(ay_OpExAOEM,MATCH(sys_KeyOperator&\"Head\",key_AOEM,0),13)),MAX(INDEX(ay_OpExAOEM,MATCH(sys_KeyOperator&\"Head\",key_AOEM,0),14),(INDEX(ay_OpExAOEM,MATCH(sys_KeyOperator&\"Head\",key_AOEM,0),14) /1.5)*i_AmountAS4))","v":{"$error":"#N/A"}},"AOEM"]
[null,null,"Protected hands (gloves)",{"$f":"IF(ISBLANK(INDEX(ay_OpExAOEM,MATCH(sys_KeyOperator&\"Protected hands\",key_AOEM,0),10)),10^(INDEX(ay_OpExAOEM,MATCH(sys_KeyOperator&\"Protected hands\",key_AOEM,0),7)+(LOG(i_AmountAS1)*INDEX(ay_OpExAOEM,MATCH(sys_KeyOperator&\"Protected hands\",key_AOEM,0),8))+INDEX(ay_OpExAOEM,MATCH(sys_KeyOperator&\"Protected hands\",key_AOEM,0),9)),MAX(INDEX(ay_OpExAOEM,MATCH(sys_KeyOperator&\"Protected hands\",key_AOEM,0),10),(INDEX(ay_OpExAOEM,MATCH(sys_KeyOperator&\"Protected hands\",key_AOEM,0),10)/1.5)*i_AmountAS1))","v":{"$error":"#N/A"}},{"$f":"IF(ISBLANK(INDEX(ay_OpExAOEM,MATCH(sys_KeyOperator&\"Protected Hands\",key_AOEM,0),14)), 10^(INDEX(ay_OpExAOEM,MATCH(sys_KeyOperator&\"Protected Hands\",key_AOEM,0),11) +(LOG(i_AmountAS1)*INDEX(ay_OpExAOEM,MATCH(sys_KeyOperator&\"Protected Hands\",key_AOEM,0),12)) +INDEX(ay_OpExAOEM,MATCH(sys_KeyOperator&\"Protected Hands\",key_AOEM,0),13)),MAX(INDEX(ay_OpExAOEM,MATCH(sys_KeyOperator&\"Protected Hands\",key_AOEM,0),14),(INDEX(ay_OpExAOEM,MATCH(sys_KeyOperator&\"Protected Hands\",key_AOEM,0),14) /1.5)*i_AmountAS1))","v":{"$error":"#N/A"}},{"$f":"IF(ISBLANK(INDEX(ay_OpExAOEM,MATCH(sys_KeyOperator&\"Protected hands\",key_AOEM,0),10)),10^(INDEX(ay_OpExAOEM,MATCH(sys_KeyOperator&\"Protected hands\",key_AOEM,0),7)+(LOG(i_AmountAS2)*INDEX(ay_OpExAOEM,MATCH(sys_KeyOperator&\"Protected hands\",key_AOEM,0),8))+INDEX(ay_OpExAOEM,MATCH(sys_KeyOperator&\"Protected hands\",key_AOEM,0),9)),MAX(INDEX(ay_OpExAOEM,MATCH(sys_KeyOperator&\"Protected hands\",key_AOEM,0),10),(INDEX(ay_OpExAOEM,MATCH(sys_KeyOperator&\"Protected hands\",key_AOEM,0),10)/1.5)*i_AmountAS2))","v":{"$error":"#N/A"}},{"$f":"IF(ISBLANK(INDEX(ay_OpExAOEM,MATCH(sys_KeyOperator&\"Protected Hands\",key_AOEM,0),14)), 10^(INDEX(ay_OpExAOEM,MATCH(sys_KeyOperator&\"Protected Hands\",key_AOEM,0),11) +(LOG(i_AmountAS2)*INDEX(ay_OpExAOEM,MATCH(sys_KeyOperator&\"Protected Hands\",key_AOEM,0),12)) +INDEX(ay_OpExAOEM,MATCH(sys_KeyOperator&\"Protected Hands\",key_AOEM,0),13)),MAX(INDEX(ay_OpExAOEM,MATCH(sys_KeyOperator&\"Protected Hands\",key_AOEM,0),14),(INDEX(ay_OpExAOEM,MATCH(sys_KeyOperator&\"Protected Hands\",key_AOEM,0),14) /1.5)*i_AmountAS2))","v":{"$error":"#N/A"}},{"$f":"IF(ISBLANK(INDEX(ay_OpExAOEM,MATCH(sys_KeyOperator&\"Protected hands\",key_AOEM,0),10)),10^(INDEX(ay_OpExAOEM,MATCH(sys_KeyOperator&\"Protected hands\",key_AOEM,0),7)+(LOG(i_AmountAS3)*INDEX(ay_OpExAOEM,MATCH(sys_KeyOperator&\"Protected hands\",key_AOEM,0),8))+INDEX(ay_OpExAOEM,MATCH(sys_KeyOperator&\"Protected hands\",key_AOEM,0),9)),MAX(INDEX(ay_OpExAOEM,MATCH(sys_KeyOperator&\"Protected hands\",key_AOEM,0),10),(INDEX(ay_OpExAOEM,MATCH(sys_KeyOperator&\"Protected hands\",key_AOEM,0),10)/1.5)*i_AmountAS3))","v":{"$error":"#N/A"}},{"$f":"IF(ISBLANK(INDEX(ay_OpExAOEM,MATCH(sys_KeyOperator&\"Protected Hands\",key_AOEM,0),14)), 10^(INDEX(ay_OpExAOEM,MATCH(sys_KeyOperator&\"Protected Hands\",key_AOEM,0),11) +(LOG(i_AmountAS3)*INDEX(ay_OpExAOEM,MATCH(sys_KeyOperator&\"Protected Hands\",key_AOEM,0),12)) +INDEX(ay_OpExAOEM,MATCH(sys_KeyOperator&\"Protected Hands\",key_AOEM,0),13)),MAX(INDEX(ay_OpExAOEM,MATCH(sys_KeyOperator&\"Protected Hands\",key_AOEM,0),14),(INDEX(ay_OpExAOEM,MATCH(sys_KeyOperator&\"Protected Hands\",key_AOEM,0),14) /1.5)*i_AmountAS3))","v":{"$error":"#N/A"}},{"$f":"IF(ISBLANK(INDEX(ay_OpExAOEM,MATCH(sys_KeyOperator&\"Protected hands\",key_AOEM,0),10)),10^(INDEX(ay_OpExAOEM,MATCH(sys_KeyOperator&\"Protected hands\",key_AOEM,0),7)+(LOG(i_AmountAS4)*INDEX(ay_OpExAOEM,MATCH(sys_KeyOperator&\"Protected hands\",key_AOEM,0),8))+INDEX(ay_OpExAOEM,MATCH(sys_KeyOperator&\"Protected hands\",key_AOEM,0),9)),MAX(INDEX(ay_OpExAOEM,MATCH(sys_KeyOperator&\"Protected hands\",key_AOEM,0),10),(INDEX(ay_OpExAOEM,MATCH(sys_KeyOperator&\"Protected hands\",key_AOEM,0),10)/1.5)*i_AmountAS4))","v":{"$error":"#N/A"}},{"$f":"IF(ISBLANK(INDEX(ay_OpExAOEM,MATCH(sys_KeyOperator&\"Protected Hands\",key_AOEM,0),14)), 10^(INDEX(ay_OpExAOEM,MATCH(sys_KeyOperator&\"Protected Hands\",key_AOEM,0),11) +(LOG(i_AmountAS4)*INDEX(ay_OpExAOEM,MATCH(sys_KeyOperator&\"Protected Hands\",key_AOEM,0),12)) +INDEX(ay_OpExAOEM,MATCH(sys_KeyOperator&\"Protected Hands\",key_AOEM,0),13)),MAX(INDEX(ay_OpExAOEM,MATCH(sys_KeyOperator&\"Protected Hands\",key_AOEM,0),14),(INDEX(ay_OpExAOEM,MATCH(sys_KeyOperator&\"Protected Hands\",key_AOEM,0),14) /1.5)*i_AmountAS4))","v":{"$error":"#N/A"}},"AOEM"]
[null,null,"Protected body (workwear or protective garment and sturdy footwear)",{"$f":"IF(ISBLANK(INDEX(ay_OpExAOEM,MATCH(sys_KeyOperator&\"Protected Body\",key_AOEM,0),10)),10^(INDEX(ay_OpExAOEM,MATCH(sys_KeyOperator&\"Protected Body\",key_AOEM,0),7)+(LOG(i_AmountAS1)*INDEX(ay_OpExAOEM,MATCH(sys_KeyOperator&\"Protected Body\",key_AOEM,0),8))+INDEX(ay_OpExAOEM,MATCH(sys_KeyOperator&\"Protected Body\",key_AOEM,0),9)),MAX(INDEX(ay_OpExAOEM,MATCH(sys_KeyOperator&\"Protected Body\",key_AOEM,0),10),(INDEX(ay_OpExAOEM,MATCH(sys_KeyOperator&\"Protected Body\",key_AOEM,0),10)/1.5)*i_AmountAS1))","v":{"$error":"#N/A"}},{"$f":"IF(ISBLANK(INDEX(ay_OpExAOEM,MATCH(sys_KeyOperator&\"Protected Body\",key_AOEM,0),14)), 10^(INDEX(ay_OpExAOEM,MATCH(sys_KeyOperator&\"Protected Body\",key_AOEM,0),11) +(LOG(i_AmountAS1)*INDEX(ay_OpExAOEM,MATCH(sys_KeyOperator&\"Protected Body\",key_AOEM,0),12)) +INDEX(ay_OpExAOEM,MATCH(sys_KeyOperator&\"Protected Body\",key_AOEM,0),13)),MAX(INDEX(ay_OpExAOEM,MATCH(sys_KeyOperator&\"Protected Body\",key_AOEM,0),14),(INDEX(ay_OpExAOEM,MATCH(sys_KeyOperator&\"Protected Body\",key_AOEM,0),14) /1.5)*i_AmountAS1))","v":{"$error":"#N/A"}},{"$f":"IF(ISBLANK(INDEX(ay_OpExAOEM,MATCH(sys_KeyOperator&\"Protected Body\",key_AOEM,0),10)),10^(INDEX(ay_OpExAOEM,MATCH(sys_KeyOperator&\"Protected Body\",key_AOEM,0),7)+(LOG(i_AmountAS2)*INDEX(ay_OpExAOEM,MATCH(sys_KeyOperator&\"Protected Body\",key_AOEM,0),8))+INDEX(ay_OpExAOEM,MATCH(sys_KeyOperator&\"Protected Body\",key_AOEM,0),9)),MAX(INDEX(ay_OpExAOEM,MATCH(sys_KeyOperator&\"Protected Body\",key_AOEM,0),10),(INDEX(ay_OpExAOEM,MATCH(sys_KeyOperator&\"Protected Body\",key_AOEM,0),10)/1.5)*i_AmountAS2))","v":{"$error":"#N/A"}},{"$f":"IF(ISBLANK(INDEX(ay_OpExAOEM,MATCH(sys_KeyOperator&\"Protected Body\",key_AOEM,0),14)), 10^(INDEX(ay_OpExAOEM,MATCH(sys_KeyOperator&\"Protected Body\",key_AOEM,0),11) +(LOG(i_AmountAS2)*INDEX(ay_OpExAOEM,MATCH(sys_KeyOperator&\"Protected Body\",key_AOEM,0),12)) +INDEX(ay_OpExAOEM,MATCH(sys_KeyOperator&\"Protected Body\",key_AOEM,0),13)),MAX(INDEX(ay_OpExAOEM,MATCH(sys_KeyOperator&\"Protected Body\",key_AOEM,0),14),(INDEX(ay_OpExAOEM,MATCH(sys_KeyOperator&\"Protected Body\",key_AOEM,0),14) /1.5)*i_AmountAS2))","v":{"$error":"#N/A"}},{"$f":"IF(ISBLANK(INDEX(ay_OpExAOEM,MATCH(sys_KeyOperator&\"Protected Body\",key_AOEM,0),10)),10^(INDEX(ay_OpExAOEM,MATCH(sys_KeyOperator&\"Protected Body\",key_AOEM,0),7)+(LOG(i_AmountAS3)*INDEX(ay_OpExAOEM,MATCH(sys_KeyOperator&\"Protected Body\",key_AOEM,0),8))+INDEX(ay_OpExAOEM,MATCH(sys_KeyOperator&\"Protected Body\",key_AOEM,0),9)),MAX(INDEX(ay_OpExAOEM,MATCH(sys_KeyOperator&\"Protected Body\",key_AOEM,0),10),(INDEX(ay_OpExAOEM,MATCH(sys_KeyOperator&\"Protected Body\",key_AOEM,0),10)/1.5)*i_AmountAS3))","v":{"$error":"#N/A"}},{"$f":"IF(ISBLANK(INDEX(ay_OpExAOEM,MATCH(sys_KeyOperator&\"Protected Body\",key_AOEM,0),14)), 10^(INDEX(ay_OpExAOEM,MATCH(sys_KeyOperator&\"Protected Body\",key_AOEM,0),11) +(LOG(i_AmountAS3)*INDEX(ay_OpExAOEM,MATCH(sys_KeyOperator&\"Protected Body\",key_AOEM,0),12)) +INDEX(ay_OpExAOEM,MATCH(sys_KeyOperator&\"Protected Body\",key_AOEM,0),13)),MAX(INDEX(ay_OpExAOEM,MATCH(sys_KeyOperator&\"Protected Body\",key_AOEM,0),14),(INDEX(ay_OpExAOEM,MATCH(sys_KeyOperator&\"Protected Body\",key_AOEM,0),14) /1.5)*i_AmountAS3))","v":{"$error":"#N/A"}},{"$f":"IF(ISBLANK(INDEX(ay_OpExAOEM,MATCH(sys_KeyOperator&\"Protected Body\",key_AOEM,0),10)),10^(INDEX(ay_OpExAOEM,MATCH(sys_KeyOperator&\"Protected Body\",key_AOEM,0),7)+(LOG(i_AmountAS4)*INDEX(ay_OpExAOEM,MATCH(sys_KeyOperator&\"Protected Body\",key_AOEM,0),8))+INDEX(ay_OpExAOEM,MATCH(sys_KeyOperator&\"Protected Body\",key_AOEM,0),9)),MAX(INDEX(ay_OpExAOEM,MATCH(sys_KeyOperator&\"Protected Body\",key_AOEM,0),10),(INDEX(ay_OpExAOEM,MATCH(sys_KeyOperator&\"Protected Body\",key_AOEM,0),10)/1.5)*i_AmountAS4))","v":{"$error":"#N/A"}},{"$f":"IF(ISBLANK(INDEX(ay_OpExAOEM,MATCH(sys_KeyOperator&\"Protected Body\",key_AOEM,0),14)), 10^(INDEX(ay_OpExAOEM,MATCH(sys_KeyOperator&\"Protected Body\",key_AOEM,0),11) +(LOG(i_AmountAS4)*INDEX(ay_OpExAOEM,MATCH(sys_KeyOperator&\"Protected Body\",key_AOEM,0),12)) +INDEX(ay_OpExAOEM,MATCH(sys_KeyOperator&\"Protected Body\",key_AOEM,0),13)),MAX(INDEX(ay_OpExAOEM,MATCH(sys_KeyOperator&\"Protected Body\",key_AOEM,0),14),(INDEX(ay_OpExAOEM,MATCH(sys_KeyOperator&\"Protected Body\",key_AOEM,0),14) /1.5)*i_AmountAS4))","v":{"$error":"#N/A"}},"AOEM"]
[null,null,"Protected head (hood +/- face shield)",{"$f":"IF(ISBLANK(INDEX(ay_OpExAOEM,MATCH(sys_KeyOperator&\"Head\",key_AOEM,0),10)),10^(INDEX(ay_OpExAOEM,MATCH(sys_KeyOperator&\"Head\",key_AOEM,0),7)+(LOG(i_AmountAS1)*INDEX(ay_OpExAOEM,MATCH(sys_KeyOperator&\"Head\",key_AOEM,0),8))+INDEX(ay_OpExAOEM,MATCH(sys_KeyOperator&\"Head\",key_AOEM,0),9)+ d_head75ProtectionFactor),MAX(INDEX(ay_OpExAOEM,MATCH(sys_KeyOperator&\"Head\",key_AOEM,0),10),(INDEX(ay_OpExAOEM,MATCH(sys_KeyOperator&\"Head\",key_AOEM,0),10)/1.5)*i_AmountAS1))*IF(ISNUMBER(Hole_F25),Hole_F25,1)","v":{"$error":"#N/A"}},{"$f":"IF(ISBLANK(INDEX(ay_OpExAOEM,MATCH(sys_KeyOperator&\"Head\",key_AOEM,0),14)), 10^(INDEX(ay_OpExAOEM,MATCH(sys_KeyOperator&\"Head\",key_AOEM,0),11) +(LOG(i_AmountAS1)*INDEX(ay_OpExAOEM,MATCH(sys_KeyOperator&\"Head\",key_AOEM,0),12)) +INDEX(ay_OpExAOEM,MATCH(sys_KeyOperator&\"Head\",key_AOEM,0),13)+ d_head95ProtectionFactor),MAX(INDEX(ay_OpExAOEM,MATCH(sys_KeyOperator&\"Head\",key_AOEM,0),14),(INDEX(ay_OpExAOEM,MATCH(sys_KeyOperator&\"Head\",key_AOEM,0),14) /1.5)*i_AmountAS1))*IF(ISNUMBER(Hole_F25),Hole_F25,1)","v":{"$error":"#N/A"}},{"$f":"IF(ISBLANK(INDEX(ay_OpExAOEM,MATCH(sys_KeyOperator&\"Head\",key_AOEM,0),10)),10^(INDEX(ay_OpExAOEM,MATCH(sys_KeyOperator&\"Head\",key_AOEM,0),7)+(LOG(i_AmountAS2)*INDEX(ay_OpExAOEM,MATCH(sys_KeyOperator&\"Head\",key_AOEM,0),8))+INDEX(ay_OpExAOEM,MATCH(sys_KeyOperator&\"Head\",key_AOEM,0),9)  + d_head75ProtectionFactor  ),MAX(INDEX(ay_OpExAOEM,MATCH(sys_KeyOperator&\"Head\",key_AOEM,0),10),(INDEX(ay_OpExAOEM,MATCH(sys_KeyOperator&\"Head\",key_AOEM,0),10)/1.5)*i_AmountAS2))*IF(ISNUMBER(Hole_F25),Hole_F25,1)","v":{"$error":"#N/A"}},{"$f":"IF(ISBLANK(INDEX(ay_OpExAOEM,MATCH(sys_KeyOperator&\"Head\",key_AOEM,0),14)), 10^(INDEX(ay_OpExAOEM,MATCH(sys_KeyOperator&\"Head\",key_AOEM,0),11) +(LOG(i_AmountAS2)*INDEX(ay_OpExAOEM,MATCH(sys_KeyOperator&\"Head\",key_AOEM,0),12)) +INDEX(ay_OpExAOEM,MATCH(sys_KeyOperator&\"Head\",key_AOEM,0),13)+ d_head95ProtectionFactor),MAX(INDEX(ay_OpExAOEM,MATCH(sys_KeyOperator&\"Head\",key_AOEM,0),14),(INDEX(ay_OpExAOEM,MATCH(sys_KeyOperator&\"Head\",key_AOEM,0),14) /1.5)*i_AmountAS2))*IF(ISNUMBER(Hole_F25),Hole_F25,1)","v":{"$error":"#N/A"}},{"$f":"IF(ISBLANK(INDEX(ay_OpExAOEM,MATCH(sys_KeyOperator&\"Head\",key_AOEM,0),10)),10^(INDEX(ay_OpExAOEM,MATCH(sys_KeyOperator&\"Head\",key_AOEM,0),7)+(LOG(i_AmountAS3)*INDEX(ay_OpExAOEM,MATCH(sys_KeyOperator&\"Head\",key_AOEM,0),8))+INDEX(ay_OpExAOEM,MATCH(sys_KeyOperator&\"Head\",key_AOEM,0),9)  + d_head75ProtectionFactor  ),MAX(INDEX(ay_OpExAOEM,MATCH(sys_KeyOperator&\"Head\",key_AOEM,0),10),(INDEX(ay_OpExAOEM,MATCH(sys_KeyOperator&\"Head\",key_AOEM,0),10)/1.5)*i_AmountAS3))*IF(ISNUMBER(Hole_F25),Hole_F25,1)","v":{"$error":"#N/A"}},{"$f":"IF(ISBLANK(INDEX(ay_OpExAOEM,MATCH(sys_KeyOperator&\"Head\",key_AOEM,0),14)), 10^(INDEX(ay_OpExAOEM,MATCH(sys_KeyOperator&\"Head\",key_AOEM,0),11) +(LOG(i_AmountAS3)*INDEX(ay_OpExAOEM,MATCH(sys_KeyOperator&\"Head\",key_AOEM,0),12)) +INDEX(ay_OpExAOEM,MATCH(sys_KeyOperator&\"Head\",key_AOEM,0),13)+ d_head95ProtectionFactor),MAX(INDEX(ay_OpExAOEM,MATCH(sys_KeyOperator&\"Head\",key_AOEM,0),14),(INDEX(ay_OpExAOEM,MATCH(sys_KeyOperator&\"Head\",key_AOEM,0),14) /1.5)*i_AmountAS3))*IF(ISNUMBER(Hole_F25),Hole_F25,1)","v":{"$error":"#N/A"}},{"$f":"IF(ISBLANK(INDEX(ay_OpExAOEM,MATCH(sys_KeyOperator&\"Head\",key_AOEM,0),10)),10^(INDEX(ay_OpExAOEM,MATCH(sys_KeyOperator&\"Head\",key_AOEM,0),7)+(LOG(i_AmountAS4)*INDEX(ay_OpExAOEM,MATCH(sys_KeyOperator&\"Head\",key_AOEM,0),8))+INDEX(ay_OpExAOEM,MATCH(sys_KeyOperator&\"Head\",key_AOEM,0),9)  + d_head75ProtectionFactor  ),MAX(INDEX(ay_OpExAOEM,MATCH(sys_KeyOperator&\"Head\",key_AOEM,0),10),(INDEX(ay_OpExAOEM,MATCH(sys_KeyOperator&\"Head\",key_AOEM,0),10)/1.5)*i_AmountAS4))*IF(ISNUMBER(Hole_F25),Hole_F25,1)","v":{"$error":"#N/A"}},{"$f":"IF(ISBLANK(INDEX(ay_OpExAOEM,MATCH(sys_KeyOperator&\"Head\",key_AOEM,0),14)), 10^(INDEX(ay_OpExAOEM,MATCH(sys_KeyOperator&\"Head\",key_AOEM,0),11) +(LOG(i_AmountAS4)*INDEX(ay_OpExAOEM,MATCH(sys_KeyOperator&\"Head\",key_AOEM,0),12)) +INDEX(ay_OpExAOEM,MATCH(sys_KeyOperator&\"Head\",key_AOEM,0),13)+ d_head95ProtectionFactor),MAX(INDEX(ay_OpExAOEM,MATCH(sys_KeyOperator&\"Head\",key_AOEM,0),14),(INDEX(ay_OpExAOEM,MATCH(sys_KeyOperator&\"Head\",key_AOEM,0),14) /1.5)*i_AmountAS4))*IF(ISNUMBER(Hole_F25),Hole_F25,1)","v":{"$error":"#N/A"}},"AOEM"]
[null,null,"Inhalation",{"$f":"IF(ISBLANK(INDEX(ay_OpExAOEM,MATCH(sys_KeyOperator&\"Inhalation\",key_AOEM,0),10)),10^(INDEX(ay_OpExAOEM,MATCH(sys_KeyOperator&\"Inhalation\",key_AOEM,0),7)+(LOG(i_AmountAS1)*INDEX(ay_OpExAOEM,MATCH(sys_KeyOperator&\"Inhalation\",key_AOEM,0),8))+INDEX(ay_OpExAOEM,MATCH(sys_KeyOperator&\"Inhalation\",key_AOEM,0),9)),MAX(INDEX(ay_OpExAOEM,MATCH(sys_KeyOperator&\"Inhalation\",key_AOEM,0),10),(INDEX(ay_OpExAOEM,MATCH(sys_KeyOperator&\"Inhalation\",key_AOEM,0),10)/1.5)*i_AmountAS1))","v":{"$error":"#N/A"}},{"$f":"IF(ISBLANK(INDEX(ay_OpExAOEM,MATCH(sys_KeyOperator&\"Inhalation\",key_AOEM,0),14)), 10^(INDEX(ay_OpExAOEM,MATCH(sys_KeyOperator&\"Inhalation\",key_AOEM,0),11) +(LOG(i_AmountAS1)*INDEX(ay_OpExAOEM,MATCH(sys_KeyOperator&\"Inhalation\",key_AOEM,0),12)) +INDEX(ay_OpExAOEM,MATCH(sys_KeyOperator&\"Inhalation\",key_AOEM,0),13)),MAX(INDEX(ay_OpExAOEM,MATCH(sys_KeyOperator&\"Inhalation\",key_AOEM,0),14),(INDEX(ay_OpExAOEM,MATCH(sys_KeyOperator&\"Inhalation\",key_AOEM,0),14) /1.5)*i_AmountAS1))","v":{"$error":"#N/A"}},{"$f":"IF(ISBLANK(INDEX(ay_OpExAOEM,MATCH(sys_KeyOperator&\"Inhalation\",key_AOEM,0),10)),10^(INDEX(ay_OpExAOEM,MATCH(sys_KeyOperator&\"Inhalation\",key_AOEM,0),7)+(LOG(i_AmountAS2)*INDEX(ay_OpExAOEM,MATCH(sys_KeyOperator&\"Inhalation\",key_AOEM,0),8))+INDEX(ay_OpExAOEM,MATCH(sys_KeyOperator&\"Inhalation\",key_AOEM,0),9)),MAX(INDEX(ay_OpExAOEM,MATCH(sys_KeyOperator&\"Inhalation\",key_AOEM,0),10),(INDEX(ay_OpExAOEM,MATCH(sys_KeyOperator&\"Inhalation\",key_AOEM,0),10)/1.5)*i_AmountAS2))","v":{"$error":"#N/A"}},{"$f":"IF(ISBLANK(INDEX(ay_OpExAOEM,MATCH(sys_KeyOperator&\"Inhalation\",key_AOEM,0),14)), 10^(INDEX(ay_OpExAOEM,MATCH(sys_KeyOperator&\"Inhalation\",key_AOEM,0),11) +(LOG(i_AmountAS2)*INDEX(ay_OpExAOEM,MATCH(sys_KeyOperator&\"Inhalation\",key_AOEM,0),12)) +INDEX(ay_OpExAOEM,MATCH(sys_KeyOperator&\"Inhalation\",key_AOEM,0),13)),MAX(INDEX(ay_OpExAOEM,MATCH(sys_KeyOperator&\"Inhalation\",key_AOEM,0),14),(INDEX(ay_OpExAOEM,MATCH(sys_KeyOperator&\"Inhalation\",key_AOEM,0),14) /1.5)*i_AmountAS2))","v":{"$error":"#N/A"}},{"$f":"IF(ISBLANK(INDEX(ay_OpExAOEM,MATCH(sys_KeyOperator&\"Inhalation\",key_AOEM,0),10)),10^(INDEX(ay_OpExAOEM,MATCH(sys_KeyOperator&\"Inhalation\",key_AOEM,0),7)+(LOG(i_AmountAS3)*INDEX(ay_OpExAOEM,MATCH(sys_KeyOperator&\"Inhalation\",key_AOEM,0),8))+INDEX(ay_OpExAOEM,MATCH(sys_KeyOperator&\"Inhalation\",key_AOEM,0),9)),MAX(INDEX(ay_OpExAOEM,MATCH(sys_KeyOperator&\"Inhalation\",key_AOEM,0),10),(INDEX(ay_OpExAOEM,MATCH(sys_KeyOperator&\"Inhalation\",key_AOEM,0),10)/1.5)*i_AmountAS3))","v":{"$error":"#N/A"}},{"$f":"IF(ISBLANK(INDEX(ay_OpExAOEM,MATCH(sys_KeyOperator&\"Inhalation\",key_AOEM,0),14)), 10^(INDEX(ay_OpExAOEM,MATCH(sys_KeyOperator&\"Inhalation\",key_AOEM,0),11) +(LOG(i_AmountAS3)*INDEX(ay_OpExAOEM,MATCH(sys_KeyOperator&\"Inhalation\",key_AOEM,0),12)) +INDEX(ay_OpExAOEM,MATCH(sys_KeyOperator&\"Inhalation\",key_AOEM,0),13)),MAX(INDEX(ay_OpExAOEM,MATCH(sys_KeyOperator&\"Inhalation\",key_AOEM,0),14),(INDEX(ay_OpExAOEM,MATCH(sys_KeyOperator&\"Inhalation\",key_AOEM,0),14) /1.5)*i_AmountAS3))","v":{"$error":"#N/A"}},{"$f":"IF(ISBLANK(INDEX(ay_OpExAOEM,MATCH(sys_KeyOperator&\"Inhalation\",key_AOEM,0),10)),10^(INDEX(ay_OpExAOEM,MATCH(sys_KeyOperator&\"Inhalation\",key_AOEM,0),7)+(LOG(i_AmountAS4)*INDEX(ay_OpExAOEM,MATCH(sys_KeyOperator&\"Inhalation\",key_AOEM,0),8))+INDEX(ay_OpExAOEM,MATCH(sys_KeyOperator&\"Inhalation\",key_AOEM,0),9)),MAX(INDEX(ay_OpExAOEM,MATCH(sys_KeyOperator&\"Inhalation\",key_AOEM,0),10),(INDEX(ay_OpExAOEM,MATCH(sys_KeyOperator&\"Inhalation\",key_AOEM,0),10)/1.5)*i_AmountAS4))","v":{"$error":"#N/A"}},{"$f":"IF(ISBLANK(INDEX(ay_OpExAOEM,MATCH(sys_KeyOperator&\"Inhalation\",key_AOEM,0),14)), 10^(INDEX(ay_OpExAOEM,MATCH(sys_KeyOperator&\"Inhalation\",key_AOEM,0),11) +(LOG(i_AmountAS4)*INDEX(ay_OpExAOEM,MATCH(sys_KeyOperator&\"Inhalation\",key_AOEM,0),12)) +INDEX(ay_OpExAOEM,MATCH(sys_KeyOperator&\"Inhalation\",key_AOEM,0),13)),MAX(INDEX(ay_OpExAOEM,MATCH(sys_KeyOperator&\"Inhalation\",key_AOEM,0),14),(INDEX(ay_OpExAOEM,MATCH(sys_KeyOperator&\"Inhalation\",key_AOEM,0),14) /1.5)*i_AmountAS4))","v":{"$error":"#N/A"}},"AOEM"]
[null,null,"Protective Equipment","Select for inclusion",null,null,null,null,null,null,null,"Penetration factor","Inhalation Protection factor"]
[null,null,"Gloves",{"$f":"'Operator Spray'!D25","v":"No"},null,null,null,null,null,null,null,{"$f":"IF(D25=\"Yes\",\"Incl. in AOEM model\",\"\")","v":""}]
[null,null,"Clothing",{"$f":"'Operator Spray'!D26","v":"Work wear - arms, body and legs covered"},null,null,null,null,null,null,null,"Incl. in AOEM model"]
[null,null,"Head and respiratory PPE",{"$f":"'Operator Spray'!D27","v":"None"},null,null,null,null,null,null,null,{"$f":"IF(AND(i_AppEquip=\"Manual-Hand held\",D27=\"Hood and visor\"),\"Incl. in AOEM model\",INDEX(ay_MixPPEHead,MATCH(D27,key_MixPPEHead,0),2))","v":1},{"$f":"IF(OR(D27=\"Hood and visor\",D27=\"Hood\"),1,INDEX(ay_MixRPE,MATCH(D27,key_MixRPE,0),2))","v":1}]
[null,null,"Water soluble bag",{"$f":"'Operator Spray'!D28","v":"No"},null,null,null,null,null,null,null,{"$f":"IF(AND(D28=\"Yes\"),0.1,1)","v":1}]
[null,"Application",null,{"$f":"i_SubstName1","v":0},null,{"$f":"i_SubstName2","v":0},null,{"$f":"i_SubstName3","v":0},null,{"$f":"i_SubstName4","v":0}]
[null,null,"Exposure values ","µg exposure/day applied",null,"µg exposure/day applied",null,"µg exposure/day applied",null,"µg exposure/day applied",null,"Reference ","Comment"]
[null,null,null,"75th percentile","95th percentile ","75th percentile","95th percentile ","75th percentile","95th percentile ","75th percentile","95th percentile "]
[null,null,"Hands",{"$f":"IF(ISBLANK(INDEX(ay_OpExAOEM,MATCH(sys_KeyOperator&\"Hands\",key_AOEM,0),18)),10^(INDEX(ay_OpExAOEM,MATCH(sys_KeyOperator&\"Hands\",key_AOEM,0),15)+(LOG(0.1*i_AmountAS1)*INDEX(ay_OpExAOEM,MATCH(sys_KeyOperator&\"Hands\",key_AOEM,0),16))+  IF(AND(i_AppMeth=\"Upward spraying\",LEFT(i_AppEquip,15)=\"Vehicle-mounted\",d_AppPfCaBfR = \"Yes\"),0,IF(AND(i_Season = \"late (dense foliage)\",i_AppMeth=\"Upward spraying\",OR(i_AppEquip=\"Manual-Hand held\",i_AppEquip=\"Manual-Knapsack\")),0,INDEX(ay_OpExAOEM,MATCH(sys_KeyOperator&\"Hands\",key_AOEM,0),17)))   ),MAX(INDEX(ay_OpExAOEM,MATCH(sys_KeyOperator&\"Hands\",key_AOEM,0),18),(INDEX(ay_OpExAOEM,MATCH(sys_KeyOperator&\"Hands\",key_AOEM,0),18)/d_PctExtrapolation)*0.1*i_AmountAS1))","v":{"$error":"#N/A"}},{"$f":"IF(ISBLANK(INDEX(ay_OpExAOEM,MATCH(sys_KeyOperator&\"Hands\",key_AOEM,0),22)),10^(INDEX(ay_OpExAOEM,MATCH(sys_KeyOperator&\"Hands\",key_AOEM,0),19)+(LOG(0.1*i_AmountAS1)*INDEX(ay_OpExAOEM,MATCH(sys_KeyOperator&\"Hands\",key_AOEM,0),20))+  IF(AND(i_AppMeth=\"Upward spraying\",LEFT(i_AppEquip,15)=\"Vehicle-mounted\",d_AppPfCaBfR = \"Yes\"),0,IF(AND(i_Season = \"late (dense foliage)\",i_AppMeth=\"Upward spraying\",OR(i_AppEquip=\"Manual-Hand held\",i_AppEquip=\"Manual-Knapsack\")),0,INDEX(ay_OpExAOEM,MATCH(sys_KeyOperator&\"Hands\",key_AOEM,0),21)))   ),MAX(INDEX(ay_OpExAOEM,MATCH(sys_KeyOperator&\"Hands\",key_AOEM,0),22),(INDEX(ay_OpExAOEM,MATCH(sys_KeyOperator&\"Hands\",key_AOEM,0),22)/d_PctExtrapolation)*0.1*i_AmountAS1))","v":{"$error":"#N/A"}},{"$f":"IF(ISBLANK(INDEX(ay_OpExAOEM,MATCH(sys_KeyOperator&\"Hands\",key_AOEM,0),18)),10^(INDEX(ay_OpExAOEM,MATCH(sys_KeyOperator&\"Hands\",key_AOEM,0),15)+(LOG(0.1*i_AmountAS2)*INDEX(ay_OpExAOEM,MATCH(sys_KeyOperator&\"Hands\",key_AOEM,0),16))+  IF(AND(i_AppMeth=\"Upward spraying\",LEFT(i_AppEquip,15)=\"Vehicle-mounted\",d_AppPfCaBfR = \"Yes\"),0,IF(AND(i_Season = \"late (dense foliage)\",i_AppMeth=\"Upward spraying\",OR(i_AppEquip=\"Manual-Hand held\",i_AppEquip=\"Manual-Knapsack\")),0,INDEX(ay_OpExAOEM,MATCH(sys_KeyOperator&\"Hands\",key_AOEM,0),17)))   ),MAX(INDEX(ay_OpExAOEM,MATCH(sys_KeyOperator&\"Hands\",key_AOEM,0),18),(INDEX(ay_OpExAOEM,MATCH(sys_KeyOperator&\"Hands\",key_AOEM,0),18)/d_PctExtrapolation)*0.1*i_AmountAS2))","v":{"$error":"#N/A"}},{"$f":"IF(ISBLANK(INDEX(ay_OpExAOEM,MATCH(sys_KeyOperator&\"Hands\",key_AOEM,0),22)),10^(INDEX(ay_OpExAOEM,MATCH(sys_KeyOperator&\"Hands\",key_AOEM,0),19)+(LOG(0.1*i_AmountAS2)*INDEX(ay_OpExAOEM,MATCH(sys_KeyOperator&\"Hands\",key_AOEM,0),20))+  IF(AND(i_AppMeth=\"Upward spraying\",LEFT(i_AppEquip,15)=\"Vehicle-mounted\",d_AppPfCaBfR = \"Yes\"),0,IF(AND(i_Season = \"late (dense foliage)\",i_AppMeth=\"Upward spraying\",OR(i_AppEquip=\"Manual-Hand held\",i_AppEquip=\"Manual-Knapsack\")),0,INDEX(ay_OpExAOEM,MATCH(sys_KeyOperator&\"Hands\",key_AOEM,0),21)))   ),MAX(INDEX(ay_OpExAOEM,MATCH(sys_KeyOperator&\"Hands\",key_AOEM,0),22),(INDEX(ay_OpExAOEM,MATCH(sys_KeyOperator&\"Hands\",key_AOEM,0),22)/d_PctExtrapolation)*0.1*i_AmountAS2))","v":{"$error":"#N/A"}},{"$f":"IF(ISBLANK(INDEX(ay_OpExAOEM,MATCH(sys_KeyOperator&\"Hands\",key_AOEM,0),18)),10^(INDEX(ay_OpExAOEM,MATCH(sys_KeyOperator&\"Hands\",key_AOEM,0),15)+(LOG(0.1*i_AmountAS3)*INDEX(ay_OpExAOEM,MATCH(sys_KeyOperator&\"Hands\",key_AOEM,0),16))+  IF(AND(i_AppMeth=\"Upward spraying\",LEFT(i_AppEquip,15)=\"Vehicle-mounted\",d_AppPfCaBfR = \"Yes\"),0,IF(AND(i_Season = \"late (dense foliage)\",i_AppMeth=\"Upward spraying\",OR(i_AppEquip=\"Manual-Hand held\",i_AppEquip=\"Manual-Knapsack\")),0,INDEX(ay_OpExAOEM,MATCH(sys_KeyOperator&\"Hands\",key_AOEM,0),17)))   ),MAX(INDEX(ay_OpExAOEM,MATCH(sys_KeyOperator&\"Hands\",key_AOEM,0),18),(INDEX(ay_OpExAOEM,MATCH(sys_KeyOperator&\"Hands\",key_AOEM,0),18)/d_PctExtrapolation)*0.1*i_AmountAS3))","v":{"$error":"#N/A"}},{"$f":"IF(ISBLANK(INDEX(ay_OpExAOEM,MATCH(sys_KeyOperator&\"Hands\",key_AOEM,0),22)),10^(INDEX(ay_OpExAOEM,MATCH(sys_KeyOperator&\"Hands\",key_AOEM,0),19)+(LOG(0.1*i_AmountAS3)*INDEX(ay_OpExAOEM,MATCH(sys_KeyOperator&\"Hands\",key_AOEM,0),20))+  IF(AND(i_AppMeth=\"Upward spraying\",LEFT(i_AppEquip,15)=\"Vehicle-mounted\",d_AppPfCaBfR = \"Yes\"),0,IF(AND(i_Season = \"late (dense foliage)\",i_AppMeth=\"Upward spraying\",OR(i_AppEquip=\"Manual-Hand held\",i_AppEquip=\"Manual-Knapsack\")),0,INDEX(ay_OpExAOEM,MATCH(sys_KeyOperator&\"Hands\",key_AOEM,0),21)))   ),MAX(INDEX(ay_OpExAOEM,MATCH(sys_KeyOperator&\"Hands\",key_AOEM,0),22),(INDEX(ay_OpExAOEM,MATCH(sys_KeyOperator&\"Hands\",key_AOEM,0),22)/d_PctExtrapolation)*0.1*i_AmountAS3))","v":{"$error":"#N/A"}},{"$f":"IF(ISBLANK(INDEX(ay_OpExAOEM,MATCH(sys_KeyOperator&\"Hands\",key_AOEM,0),18)),10^(INDEX(ay_OpExAOEM,MATCH(sys_KeyOperator&\"Hands\",key_AOEM,0),15)+(LOG(0.1*i_AmountAS4)*INDEX(ay_OpExAOEM,MATCH(sys_KeyOperator&\"Hands\",key_AOEM,0),16))+  IF(AND(i_AppMeth=\"Upward spraying\",LEFT(i_AppEquip,15)=\"Vehicle-mounted\",d_AppPfCaBfR = \"Yes\"),0,IF(AND(i_Season = \"late (dense foliage)\",i_AppMeth=\"Upward spraying\",OR(i_AppEquip=\"Manual-Hand held\",i_AppEquip=\"Manual-Knapsack\")),0,INDEX(ay_OpExAOEM,MATCH(sys_KeyOperator&\"Hands\",key_AOEM,0),17)))   ),MAX(INDEX(ay_OpExAOEM,MATCH(sys_KeyOperator&\"Hands\",key_AOEM,0),18),(INDEX(ay_OpExAOEM,MATCH(sys_KeyOperator&\"Hands\",key_AOEM,0),18)/d_PctExtrapolation)*0.1*i_AmountAS4))","v":{"$error":"#N/A"}},{"$f":"IF(ISBLANK(INDEX(ay_OpExAOEM,MATCH(sys_KeyOperator&\"Hands\",key_AOEM,0),22)),10^(INDEX(ay_OpExAOEM,MATCH(sys_KeyOperator&\"Hands\",key_AOEM,0),19)+(LOG(0.1*i_AmountAS4)*INDEX(ay_OpExAOEM,MATCH(sys_KeyOperator&\"Hands\",key_AOEM,0),20))+  IF(AND(i_AppMeth=\"Upward spraying\",LEFT(i_AppEquip,15)=\"Vehicle-mounted\",d_AppPfCaBfR = \"Yes\"),0,IF(AND(i_Season = \"late (dense foliage)\",i_AppMeth=\"Upward spraying\",OR(i_AppEquip=\"Manual-Hand held\",i_AppEquip=\"Manual-Knapsack\")),0,INDEX(ay_OpExAOEM,MATCH(sys_KeyOperator&\"Hands\",key_AOEM,0),21)))   ),MAX(INDEX(ay_OpExAOEM,MATCH(sys_KeyOperator&\"Hands\",key_AOEM,0),22),(INDEX(ay_OpExAOEM,MATCH(sys_KeyOperator&\"Hands\",key_AOEM,0),22)/d_PctExtrapolation)*0.1*i_AmountAS4))","v":{"$error":"#N/A"}},"AOEM",{"$f":"IF(AND(d_AreaTreated=10,i_AppMeth=\"Downward spraying\"),IF(i_AppEquip=\"Vehicle-mounted-Drift Reduction\",\"Small area equipment and drift reduction cannot be selected together - drift reduction has not been applied\",\"This scenario assumes that small area equipment is used\"),IF(i_AppMeth=\"Upward spraying\", \"No data available for a drift reduction scenario\",\"\") )","v":""}]
[null,null,"Body",{"$f":"IF(ISBLANK(INDEX(ay_OpExAOEM,MATCH(sys_KeyOperator&\"Body\",key_AOEM,0),18)),10^(INDEX(ay_OpExAOEM,MATCH(sys_KeyOperator&\"Body\",key_AOEM,0),15)+(LOG(0.1*i_AmountAS1)*INDEX(ay_OpExAOEM,MATCH(sys_KeyOperator&\"Body\",key_AOEM,0),16))+  IF(AND(i_AppMeth=\"Upward spraying\",LEFT(i_AppEquip,15)=\"Vehicle-mounted\",d_AppPfCaBfR = \"Yes\"),0,IF(AND(i_Season = \"late (dense foliage)\",i_AppMeth=\"Upward spraying\",OR(i_AppEquip=\"Manual-Hand held\",i_AppEquip=\"Manual-Knapsack\")),0,INDEX(ay_OpExAOEM,MATCH(sys_KeyOperator&\"Body\",key_AOEM,0),17)))   ),MAX(INDEX(ay_OpExAOEM,MATCH(sys_KeyOperator&\"Body\",key_AOEM,0),18),(INDEX(ay_OpExAOEM,MATCH(sys_KeyOperator&\"Body\",key_AOEM,0),18)/d_PctExtrapolation)*0.1*i_AmountAS1))","v":{"$error":"#N/A"}},{"$f":"IF(ISBLANK(INDEX(ay_OpExAOEM,MATCH(sys_KeyOperator&\"Body\",key_AOEM,0),22)),10^(INDEX(ay_OpExAOEM,MATCH(sys_KeyOperator&\"Body\",key_AOEM,0),19)+(LOG(0.1*i_AmountAS1)*INDEX(ay_OpExAOEM,MATCH(sys_KeyOperator&\"Body\",key_AOEM,0),20))+  IF(AND(i_AppMeth=\"Upward spraying\",LEFT(i_AppEquip,15)=\"Vehicle-mounted\",d_AppPfCaBfR = \"Yes\"),0,IF(AND(i_Season = \"late (dense foliage)\",i_AppMeth=\"Upward spraying\",OR(i_AppEquip=\"Manual-Hand held\",i_AppEquip=\"Manual-Knapsack\")),0,INDEX(ay_OpExAOEM,MATCH(sys_KeyOperator&\"Body\",key_AOEM,0),21)))   ),MAX(INDEX(ay_OpExAOEM,MATCH(sys_KeyOperator&\"Body\",key_AOEM,0),22),(INDEX(ay_OpExAOEM,MATCH(sys_KeyOperator&\"Body\",key_AOEM,0),22)/d_PctExtrapolation)*0.1*i_AmountAS1))","v":{"$error":"#N/A"}},{"$f":"IF(ISBLANK(INDEX(ay_OpExAOEM,MATCH(sys_KeyOperator&\"Body\",key_AOEM,0),18)),10^(INDEX(ay_OpExAOEM,MATCH(sys_KeyOperator&\"Body\",key_AOEM,0),15)+(LOG(0.1*i_AmountAS2)*INDEX(ay_OpExAOEM,MATCH(sys_KeyOperator&\"Body\",key_AOEM,0),16))+  IF(AND(i_AppMeth=\"Upward spraying\",LEFT(i_AppEquip,15)=\"Vehicle-mounted\",d_AppPfCaBfR = \"Yes\"),0,IF(AND(i_Season = \"late (dense foliage)\",i_AppMeth=\"Upward spraying\",OR(i_AppEquip=\"Manual-Hand held\",i_AppEquip=\"Manual-Knapsack\")),0,INDEX(ay_OpExAOEM,MATCH(sys_KeyOperator&\"Body\",key_AOEM,0),17)))   ),MAX(INDEX(ay_OpExAOEM,MATCH(sys_KeyOperator&\"Body\",key_AOEM,0),18),(INDEX(ay_OpExAOEM,MATCH(sys_KeyOperator&\"Body\",key_AOEM,0),18)/d_PctExtrapolation)*0.1*i_AmountAS2))","v":{"$error":"#N/A"}},{"$f":"IF(ISBLANK(INDEX(ay_OpExAOEM,MATCH(sys_KeyOperator&\"Body\",key_AOEM,0),22)),10^(INDEX(ay_OpExAOEM,MATCH(sys_KeyOperator&\"Body\",key_AOEM,0),19)+(LOG(0.1*i_AmountAS2)*INDEX(ay_OpExAOEM,MATCH(sys_KeyOperator&\"Body\",key_AOEM,0),20))+  IF(AND(i_AppMeth=\"Upward spraying\",LEFT(i_AppEquip,15)=\"Vehicle-mounted\",d_AppPfCaBfR = \"Yes\"),0,IF(AND(i_Season = \"late (dense foliage)\",i_AppMeth=\"Upward spraying\",OR(i_AppEquip=\"Manual-Hand held\",i_AppEquip=\"Manual-Knapsack\")),0,INDEX(ay_OpExAOEM,MATCH(sys_KeyOperator&\"Body\",key_AOEM,0),21)))   ),MAX(INDEX(ay_OpExAOEM,MATCH(sys_KeyOperator&\"Body\",key_AOEM,0),22),(INDEX(ay_OpExAOEM,MATCH(sys_KeyOperator&\"Body\",key_AOEM,0),22)/d_PctExtrapolation)*0.1*i_AmountAS2))","v":{"$error":"#N/A"}},{"$f":"IF(ISBLANK(INDEX(ay_OpExAOEM,MATCH(sys_KeyOperator&\"Body\",key_AOEM,0),18)),10^(INDEX(ay_OpExAOEM,MATCH(sys_KeyOperator&\"Body\",key_AOEM,0),15)+(LOG(0.1*i_AmountAS3)*INDEX(ay_OpExAOEM,MATCH(sys_KeyOperator&\"Body\",key_AOEM,0),16))+  IF(AND(i_AppMeth=\"Upward spraying\",LEFT(i_AppEquip,15)=\"Vehicle-mounted\",d_AppPfCaBfR = \"Yes\"),0,IF(AND(i_Season = \"late (dense foliage)\",i_AppMeth=\"Upward spraying\",OR(i_AppEquip=\"Manual-Hand held\",i_AppEquip=\"Manual-Knapsack\")),0,INDEX(ay_OpExAOEM,MATCH(sys_KeyOperator&\"Body\",key_AOEM,0),17)))   ),MAX(INDEX(ay_OpExAOEM,MATCH(sys_KeyOperator&\"Body\",key_AOEM,0),18),(INDEX(ay_OpExAOEM,MATCH(sys_KeyOperator&\"Body\",key_AOEM,0),18)/d_PctExtrapolation)*0.1*i_AmountAS3))","v":{"$error":"#N/A"}},{"$f":"IF(ISBLANK(INDEX(ay_OpExAOEM,MATCH(sys_KeyOperator&\"Body\",key_AOEM,0),22)),10^(INDEX(ay_OpExAOEM,MATCH(sys_KeyOperator&\"Body\",key_AOEM,0),19)+(LOG(0.1*i_AmountAS3)*INDEX(ay_OpExAOEM,MATCH(sys_KeyOperator&\"Body\",key_AOEM,0),20))+  IF(AND(i_AppMeth=\"Upward spraying\",LEFT(i_AppEquip,15)=\"Vehicle-mounted\",d_AppPfCaBfR = \"Yes\"),0,IF(AND(i_Season = \"late (dense foliage)\",i_AppMeth=\"Upward spraying\",OR(i_AppEquip=\"Manual-Hand held\",i_AppEquip=\"Manual-Knapsack\")),0,INDEX(ay_OpExAOEM,MATCH(sys_KeyOperator&\"Body\",key_AOEM,0),21)))   ),MAX(INDEX(ay_OpExAOEM,MATCH(sys_KeyOperator&\"Body\",key_AOEM,0),22),(INDEX(ay_OpExAOEM,MATCH(sys_KeyOperator&\"Body\",key_AOEM,0),22)/d_PctExtrapolation)*0.1*i_AmountAS3))","v":{"$error":"#N/A"}},{"$f":"IF(ISBLANK(INDEX(ay_OpExAOEM,MATCH(sys_KeyOperator&\"Body\",key_AOEM,0),18)),10^(INDEX(ay_OpExAOEM,MATCH(sys_KeyOperator&\"Body\",key_AOEM,0),15)+(LOG(0.1*i_AmountAS4)*INDEX(ay_OpExAOEM,MATCH(sys_KeyOperator&\"Body\",key_AOEM,0),16))+  IF(AND(i_AppMeth=\"Upward spraying\",LEFT(i_AppEquip,15)=\"Vehicle-mounted\",d_AppPfCaBfR = \"Yes\"),0,IF(AND(i_Season = \"late (dense foliage)\",i_AppMeth=\"Upward spraying\",OR(i_AppEquip=\"Manual-Hand held\",i_AppEquip=\"Manual-Knapsack\")),0,INDEX(ay_OpExAOEM,MATCH(sys_KeyOperator&\"Body\",key_AOEM,0),17)))   ),MAX(INDEX(ay_OpExAOEM,MATCH(sys_KeyOperator&\"Body\",key_AOEM,0),18),(INDEX(ay_OpExAOEM,MATCH(sys_KeyOperator&\"Body\",key_AOEM,0),18)/d_PctExtrapolation)*0.1*i_AmountAS4))","v":{"$error":"#N/A"}},{"$f":"IF(ISBLANK(INDEX(ay_OpExAOEM,MATCH(sys_KeyOperator&\"Body\",key_AOEM,0),22)),10^(INDEX(ay_OpExAOEM,MATCH(sys_KeyOperator&\"Body\",key_AOEM,0),19)+(LOG(0.1*i_AmountAS4)*INDEX(ay_OpExAOEM,MATCH(sys_KeyOperator&\"Body\",key_AOEM,0),20))+  IF(AND(i_AppMeth=\"Upward spraying\",LEFT(i_AppEquip,15)=\"Vehicle-mounted\",d_AppPfCaBfR = \"Yes\"),0,IF(AND(i_Season = \"late (dense foliage)\",i_AppMeth=\"Upward spraying\",OR(i_AppEquip=\"Manual-Hand held\",i_AppEquip=\"Manual-Knapsack\")),0,INDEX(ay_OpExAOEM,MATCH(sys_KeyOperator&\"Body\",key_AOEM,0),21)))   ),MAX(INDEX(ay_OpExAOEM,MATCH(sys_KeyOperator&\"Body\",key_AOEM,0),22),(INDEX(ay_OpExAOEM,MATCH(sys_KeyOperator&\"Body\",key_AOEM,0),22)/d_PctExtrapolation)*0.1*i_AmountAS4))","v":{"$error":"#N/A"}},"AOEM"]
[null,null,"Head",{"$f":"IF(ISBLANK(INDEX(ay_OpExAOEM,MATCH(sys_KeyOperator&\"Head\",key_AOEM,0),18)),10^(INDEX(ay_OpExAOEM,MATCH(sys_KeyOperator&\"Head\",key_AOEM,0),15)+(LOG(0.1*i_AmountAS1)*INDEX(ay_OpExAOEM,MATCH(sys_KeyOperator&\"Head\",key_AOEM,0),16))+  IF(AND(i_AppMeth=\"Upward spraying\",LEFT(i_AppEquip,15)=\"Vehicle-mounted\",d_AppPfCaBfR = \"Yes\"),0,IF(AND(i_Season = \"late (dense foliage)\",i_AppMeth=\"Upward spraying\",OR(i_AppEquip=\"Manual-Hand held\",i_AppEquip=\"Manual-Knapsack\")),0,INDEX(ay_OpExAOEM,MATCH(sys_KeyOperator&\"Head\",key_AOEM,0),17)))   ),MAX(INDEX(ay_OpExAOEM,MATCH(sys_KeyOperator&\"Head\",key_AOEM,0),18),(INDEX(ay_OpExAOEM,MATCH(sys_KeyOperator&\"Head\",key_AOEM,0),18)/d_PctExtrapolation)*0.1*i_AmountAS1))","v":{"$error":"#N/A"}},{"$f":"IF(ISBLANK(INDEX(ay_OpExAOEM,MATCH(sys_KeyOperator&\"Head\",key_AOEM,0),22)),10^(INDEX(ay_OpExAOEM,MATCH(sys_KeyOperator&\"Head\",key_AOEM,0),19)+(LOG(0.1*i_AmountAS1)*INDEX(ay_OpExAOEM,MATCH(sys_KeyOperator&\"Head\",key_AOEM,0),20))+  IF(AND(i_AppMeth=\"Upward spraying\",LEFT(i_AppEquip,15)=\"Vehicle-mounted\",d_AppPfCaBfR = \"Yes\"),0,IF(AND(i_Season = \"late (dense foliage)\",i_AppMeth=\"Upward spraying\",OR(i_AppEquip=\"Manual-Hand held\",i_AppEquip=\"Manual-Knapsack\")),0,INDEX(ay_OpExAOEM,MATCH(sys_KeyOperator&\"Head\",key_AOEM,0),21)))   ),MAX(INDEX(ay_OpExAOEM,MATCH(sys_KeyOperator&\"Head\",key_AOEM,0),22),(INDEX(ay_OpExAOEM,MATCH(sys_KeyOperator&\"Head\",key_AOEM,0),22)/d_PctExtrapolation)*0.1*i_AmountAS1))","v":{"$error":"#N/A"}},{"$f":"IF(ISBLANK(INDEX(ay_OpExAOEM,MATCH(sys_KeyOperator&\"Head\",key_AOEM,0),18)),10^(INDEX(ay_OpExAOEM,MATCH(sys_KeyOperator&\"Head\",key_AOEM,0),15)+(LOG(0.1*i_AmountAS2)*INDEX(ay_OpExAOEM,MATCH(sys_KeyOperator&\"Head\",key_AOEM,0),16))+  IF(AND(i_AppMeth=\"Upward spraying\",LEFT(i_AppEquip,15)=\"Vehicle-mounted\",d_AppPfCaBfR = \"Yes\"),0,IF(AND(i_Season = \"late (dense foliage)\",i_AppMeth=\"Upward spraying\",OR(i_AppEquip=\"Manual-Hand held\",i_AppEquip=\"Manual-Knapsack\")),0,INDEX(ay_OpExAOEM,MATCH(sys_KeyOperator&\"Head\",key_AOEM,0),17)))   ),MAX(INDEX(ay_OpExAOEM,MATCH(sys_KeyOperator&\"Head\",key_AOEM,0),18),(INDEX(ay_OpExAOEM,MATCH(sys_KeyOperator&\"Head\",key_AOEM,0),18)/d_PctExtrapolation)*0.1*i_AmountAS2))","v":{"$error":"#N/A"}},{"$f":"IF(ISBLANK(INDEX(ay_OpExAOEM,MATCH(sys_KeyOperator&\"Head\",key_AOEM,0),22)),10^(INDEX(ay_OpExAOEM,MATCH(sys_KeyOperator&\"Head\",key_AOEM,0),19)+(LOG(0.1*i_AmountAS2)*INDEX(ay_OpExAOEM,MATCH(sys_KeyOperator&\"Head\",key_AOEM,0),20))+  IF(AND(i_AppMeth=\"Upward spraying\",LEFT(i_AppEquip,15)=\"Vehicle-mounted\",d_AppPfCaBfR = \"Yes\"),0,IF(AND(i_Season = \"late (dense foliage)\",i_AppMeth=\"Upward spraying\",OR(i_AppEquip=\"Manual-Hand held\",i_AppEquip=\"Manual-Knapsack\")),0,INDEX(ay_OpExAOEM,MATCH(sys_KeyOperator&\"Head\",key_AOEM,0),21)))   ),MAX(INDEX(ay_OpExAOEM,MATCH(sys_KeyOperator&\"Head\",key_AOEM,0),22),(INDEX(ay_OpExAOEM,MATCH(sys_KeyOperator&\"Head\",key_AOEM,0),22)/d_PctExtrapolation)*0.1*i_AmountAS2))","v":{"$error":"#N/A"}},{"$f":"IF(ISBLANK(INDEX(ay_OpExAOEM,MATCH(sys_KeyOperator&\"Head\",key_AOEM,0),18)),10^(INDEX(ay_OpExAOEM,MATCH(sys_KeyOperator&\"Head\",key_AOEM,0),15)+(LOG(0.1*i_AmountAS3)*INDEX(ay_OpExAOEM,MATCH(sys_KeyOperator&\"Head\",key_AOEM,0),16))+  IF(AND(i_AppMeth=\"Upward spraying\",LEFT(i_AppEquip,15)=\"Vehicle-mounted\",d_AppPfCaBfR = \"Yes\"),0,IF(AND(i_Season = \"late (dense foliage)\",i_AppMeth=\"Upward spraying\",OR(i_AppEquip=\"Manual-Hand held\",i_AppEquip=\"Manual-Knapsack\")),0,INDEX(ay_OpExAOEM,MATCH(sys_KeyOperator&\"Head\",key_AOEM,0),17)))   ),MAX(INDEX(ay_OpExAOEM,MATCH(sys_KeyOperator&\"Head\",key_AOEM,0),18),(INDEX(ay_OpExAOEM,MATCH(sys_KeyOperator&\"Head\",key_AOEM,0),18)/d_PctExtrapolation)*0.1*i_AmountAS3))","v":{"$error":"#N/A"}},{"$f":"IF(ISBLANK(INDEX(ay_OpExAOEM,MATCH(sys_KeyOperator&\"Head\",key_AOEM,0),22)),10^(INDEX(ay_OpExAOEM,MATCH(sys_KeyOperator&\"Head\",key_AOEM,0),19)+(LOG(0.1*i_AmountAS3)*INDEX(ay_OpExAOEM,MATCH(sys_KeyOperator&\"Head\",key_AOEM,0),20))+  IF(AND(i_AppMeth=\"Upward spraying\",LEFT(i_AppEquip,15)=\"Vehicle-mounted\",d_AppPfCaBfR = \"Yes\"),0,IF(AND(i_Season = \"late (dense foliage)\",i_AppMeth=\"Upward spraying\",OR(i_AppEquip=\"Manual-Hand held\",i_AppEquip=\"Manual-Knapsack\")),0,INDEX(ay_OpExAOEM,MATCH(sys_KeyOperator&\"Head\",key_AOEM,0),21)))   ),MAX(INDEX(ay_OpExAOEM,MATCH(sys_KeyOperator&\"Head\",key_AOEM,0),22),(INDEX(ay_OpExAOEM,MATCH(sys_KeyOperator&\"Head\",key_AOEM,0),22)/d_PctExtrapolation)*0.1*i_AmountAS3))","v":{"$error":"#N/A"}},{"$f":"IF(ISBLANK(INDEX(ay_OpExAOEM,MATCH(sys_KeyOperator&\"Head\",key_AOEM,0),18)),10^(INDEX(ay_OpExAOEM,MATCH(sys_KeyOperator&\"Head\",key_AOEM,0),15)+(LOG(0.1*i_AmountAS4)*INDEX(ay_OpExAOEM,MATCH(sys_KeyOperator&\"Head\",key_AOEM,0),16))+  IF(AND(i_AppMeth=\"Upward spraying\",LEFT(i_AppEquip,15)=\"Vehicle-mounted\",d_AppPfCaBfR = \"Yes\"),0,IF(AND(i_Season = \"late (dense foliage)\",i_AppMeth=\"Upward spraying\",OR(i_AppEquip=\"Manual-Hand held\",i_AppEquip=\"Manual-Knapsack\")),0,INDEX(ay_OpExAOEM,MATCH(sys_KeyOperator&\"Head\",key_AOEM,0),17)))   ),MAX(INDEX(ay_OpExAOEM,MATCH(sys_KeyOperator&\"Head\",key_AOEM,0),18),(INDEX(ay_OpExAOEM,MATCH(sys_KeyOperator&\"Head\",key_AOEM,0),18)/d_PctExtrapolation)*0.1*i_AmountAS4))","v":{"$error":"#N/A"}},{"$f":"IF(ISBLANK(INDEX(ay_OpExAOEM,MATCH(sys_KeyOperator&\"Head\",key_AOEM,0),22)),10^(INDEX(ay_OpExAOEM,MATCH(sys_KeyOperator&\"Head\",key_AOEM,0),19)+(LOG(0.1*i_AmountAS4)*INDEX(ay_OpExAOEM,MATCH(sys_KeyOperator&\"Head\",key_AOEM,0),20))+  IF(AND(i_AppMeth=\"Upward spraying\",LEFT(i_AppEquip,15)=\"Vehicle-mounted\",d_AppPfCaBfR = \"Yes\"),0,IF(AND(i_Season = \"late (dense foliage)\",i_AppMeth=\"Upward spraying\",OR(i_AppEquip=\"Manual-Hand held\",i_AppEquip=\"Manual-Knapsack\")),0,INDEX(ay_OpExAOEM,MATCH(sys_KeyOperator&\"Head\",key_AOEM,0),21)))   ),MAX(INDEX(ay_OpExAOEM,MATCH(sys_KeyOperator&\"Head\",key_AOEM,0),22),(INDEX(ay_OpExAOEM,MATCH(sys_KeyOperator&\"Head\",key_AOEM,0),22)/d_PctExtrapolation)*0.1*i_AmountAS4))","v":{"$error":"#N/A"}},"AOEM"]
[null,null,"Protected hands (gloves)",{"$f":"IF(ISBLANK(INDEX(ay_OpExAOEM,MATCH(sys_KeyOperator&\"Protected Hands\",key_AOEM,0),18)),10^(INDEX(ay_OpExAOEM,MATCH(sys_KeyOperator&\"Protected Hands\",key_AOEM,0),15)+(LOG(0.1*i_AmountAS1)*INDEX(ay_OpExAOEM,MATCH(sys_KeyOperator&\"Protected Hands\",key_AOEM,0),16))+  IF(AND(i_AppMeth=\"Upward spraying\",LEFT(i_AppEquip,15)=\"Vehicle-mounted\",d_AppPfCaBfR = \"Yes\"),0,IF(AND(i_Season = \"late (dense foliage)\",i_AppMeth=\"Upward spraying\",OR(i_AppEquip=\"Manual-Hand held\",i_AppEquip=\"Manual-Knapsack\")),0,INDEX(ay_OpExAOEM,MATCH(sys_KeyOperator&\"Protected Hands\",key_AOEM,0),17)))   ),MAX(INDEX(ay_OpExAOEM,MATCH(sys_KeyOperator&\"Protected Hands\",key_AOEM,0),18),(INDEX(ay_OpExAOEM,MATCH(sys_KeyOperator&\"Protected Hands\",key_AOEM,0),18)/d_PctExtrapolation)*0.1*i_AmountAS1))","v":{"$error":"#N/A"}},{"$f":"IF(ISBLANK(INDEX(ay_OpExAOEM,MATCH(sys_KeyOperator&\"Protected Hands\",key_AOEM,0),22)),10^(INDEX(ay_OpExAOEM,MATCH(sys_KeyOperator&\"Protected Hands\",key_AOEM,0),19)+(LOG(0.1*i_AmountAS1)*INDEX(ay_OpExAOEM,MATCH(sys_KeyOperator&\"Protected Hands\",key_AOEM,0),20))+  IF(AND(i_AppMeth=\"Upward spraying\",LEFT(i_AppEquip,15)=\"Vehicle-mounted\",d_AppPfCaBfR = \"Yes\"),0,IF(AND(i_Season = \"late (dense foliage)\",i_AppMeth=\"Upward spraying\",OR(i_AppEquip=\"Manual-Hand held\",i_AppEquip=\"Manual-Knapsack\")),0,INDEX(ay_OpExAOEM,MATCH(sys_KeyOperator&\"Protected Hands\",key_AOEM,0),21)))   ),MAX(INDEX(ay_OpExAOEM,MATCH(sys_KeyOperator&\"Protected Hands\",key_AOEM,0),22),(INDEX(ay_OpExAOEM,MATCH(sys_KeyOperator&\"Protected Hands\",key_AOEM,0),22)/d_PctExtrapolation)*0.1*i_AmountAS1))","v":{"$error":"#N/A"}},{"$f":"IF(ISBLANK(INDEX(ay_OpExAOEM,MATCH(sys_KeyOperator&\"Protected Hands\",key_AOEM,0),18)),10^(INDEX(ay_OpExAOEM,MATCH(sys_KeyOperator&\"Protected Hands\",key_AOEM,0),15)+(LOG(0.1*i_AmountAS2)*INDEX(ay_OpExAOEM,MATCH(sys_KeyOperator&\"Protected Hands\",key_AOEM,0),16))+  IF(AND(i_AppMeth=\"Upward spraying\",LEFT(i_AppEquip,15)=\"Vehicle-mounted\",d_AppPfCaBfR = \"Yes\"),0,IF(AND(i_Season = \"late (dense foliage)\",i_AppMeth=\"Upward spraying\",OR(i_AppEquip=\"Manual-Hand held\",i_AppEquip=\"Manual-Knapsack\")),0,INDEX(ay_OpExAOEM,MATCH(sys_KeyOperator&\"Protected Hands\",key_AOEM,0),17)))   ),MAX(INDEX(ay_OpExAOEM,MATCH(sys_KeyOperator&\"Protected Hands\",key_AOEM,0),18),(INDEX(ay_OpExAOEM,MATCH(sys_KeyOperator&\"Protected Hands\",key_AOEM,0),18)/d_PctExtrapolation)*0.1*i_AmountAS2))","v":{"$error":"#N/A"}},{"$f":"IF(ISBLANK(INDEX(ay_OpExAOEM,MATCH(sys_KeyOperator&\"Protected Hands\",key_AOEM,0),22)),10^(INDEX(ay_OpExAOEM,MATCH(sys_KeyOperator&\"Protected Hands\",key_AOEM,0),19)+(LOG(0.1*i_AmountAS2)*INDEX(ay_OpExAOEM,MATCH(sys_KeyOperator&\"Protected Hands\",key_AOEM,0),20))+  IF(AND(i_AppMeth=\"Upward spraying\",LEFT(i_AppEquip,15)=\"Vehicle-mounted\",d_AppPfCaBfR = \"Yes\"),0,IF(AND(i_Season = \"late (dense foliage)\",i_AppMeth=\"Upward spraying\",OR(i_AppEquip=\"Manual-Hand held\",i_AppEquip=\"Manual-Knapsack\")),0,INDEX(ay_OpExAOEM,MATCH(sys_KeyOperator&\"Protected Hands\",key_AOEM,0),21)))   ),MAX(INDEX(ay_OpExAOEM,MATCH(sys_KeyOperator&\"Protected Hands\",key_AOEM,0),22),(INDEX(ay_OpExAOEM,MATCH(sys_KeyOperator&\"Protected Hands\",key_AOEM,0),22)/d_PctExtrapolation)*0.1*i_AmountAS2))","v":{"$error":"#N/A"}},{"$f":"IF(ISBLANK(INDEX(ay_OpExAOEM,MATCH(sys_KeyOperator&\"Protected Hands\",key_AOEM,0),18)),10^(INDEX(ay_OpExAOEM,MATCH(sys_KeyOperator&\"Protected Hands\",key_AOEM,0),15)+(LOG(0.1*i_AmountAS3)*INDEX(ay_OpExAOEM,MATCH(sys_KeyOperator&\"Protected Hands\",key_AOEM,0),16))+  IF(AND(i_AppMeth=\"Upward spraying\",LEFT(i_AppEquip,15)=\"Vehicle-mounted\",d_AppPfCaBfR = \"Yes\"),0,IF(AND(i_Season = \"late (dense foliage)\",i_AppMeth=\"Upward spraying\",OR(i_AppEquip=\"Manual-Hand held\",i_AppEquip=\"Manual-Knapsack\")),0,INDEX(ay_OpExAOEM,MATCH(sys_KeyOperator&\"Protected Hands\",key_AOEM,0),17)))   ),MAX(INDEX(ay_OpExAOEM,MATCH(sys_KeyOperator&\"Protected Hands\",key_AOEM,0),18),(INDEX(ay_OpExAOEM,MATCH(sys_KeyOperator&\"Protected Hands\",key_AOEM,0),18)/d_PctExtrapolation)*0.1*i_AmountAS3))","v":{"$error":"#N/A"}},{"$f":"IF(ISBLANK(INDEX(ay_OpExAOEM,MATCH(sys_KeyOperator&\"Protected Hands\",key_AOEM,0),22)),10^(INDEX(ay_OpExAOEM,MATCH(sys_KeyOperator&\"Protected Hands\",key_AOEM,0),19)+(LOG(0.1*i_AmountAS3)*INDEX(ay_OpExAOEM,MATCH(sys_KeyOperator&\"Protected Hands\",key_AOEM,0),20))+  IF(AND(i_AppMeth=\"Upward spraying\",LEFT(i_AppEquip,15)=\"Vehicle-mounted\",d_AppPfCaBfR = \"Yes\"),0,IF(AND(i_Season = \"late (dense foliage)\",i_AppMeth=\"Upward spraying\",OR(i_AppEquip=\"Manual-Hand held\",i_AppEquip=\"Manual-Knapsack\")),0,INDEX(ay_OpExAOEM,MATCH(sys_KeyOperator&\"Protected Hands\",key_AOEM,0),21)))   ),MAX(INDEX(ay_OpExAOEM,MATCH(sys_KeyOperator&\"Protected Hands\",key_AOEM,0),22),(INDEX(ay_OpExAOEM,MATCH(sys_KeyOperator&\"Protected Hands\",key_AOEM,0),22)/d_PctExtrapolation)*0.1*i_AmountAS3))","v":{"$error":"#N/A"}},{"$f":"IF(ISBLANK(INDEX(ay_OpExAOEM,MATCH(sys_KeyOperator&\"Protected Hands\",key_AOEM,0),18)),10^(INDEX(ay_OpExAOEM,MATCH(sys_KeyOperator&\"Protected Hands\",key_AOEM,0),15)+(LOG(0.1*i_AmountAS4)*INDEX(ay_OpExAOEM,MATCH(sys_KeyOperator&\"Protected Hands\",key_AOEM,0),16))+  IF(AND(i_AppMeth=\"Upward spraying\",LEFT(i_AppEquip,15)=\"Vehicle-mounted\",d_AppPfCaBfR = \"Yes\"),0,IF(AND(i_Season = \"late (dense foliage)\",i_AppMeth=\"Upward spraying\",OR(i_AppEquip=\"Manual-Hand held\",i_AppEquip=\"Manual-Knapsack\")),0,INDEX(ay_OpExAOEM,MATCH(sys_KeyOperator&\"Protected Hands\",key_AOEM,0),17)))   ),MAX(INDEX(ay_OpExAOEM,MATCH(sys_KeyOperator&\"Protected Hands\",key_AOEM,0),18),(INDEX(ay_OpExAOEM,MATCH(sys_KeyOperator&\"Protected Hands\",key_AOEM,0),18)/d_PctExtrapolation)*0.1*i_AmountAS4))","v":{"$error":"#N/A"}},{"$f":"IF(ISBLANK(INDEX(ay_OpExAOEM,MATCH(sys_KeyOperator&\"Protected Hands\",key_AOEM,0),22)),10^(INDEX(ay_OpExAOEM,MATCH(sys_KeyOperator&\"Protected Hands\",key_AOEM,0),19)+(LOG(0.1*i_AmountAS4)*INDEX(ay_OpExAOEM,MATCH(sys_KeyOperator&\"Protected Hands\",key_AOEM,0),20))+  IF(AND(i_AppMeth=\"Upward spraying\",LEFT(i_AppEquip,15)=\"Vehicle-mounted\",d_AppPfCaBfR = \"Yes\"),0,IF(AND(i_Season = \"late (dense foliage)\",i_AppMeth=\"Upward spraying\",OR(i_AppEquip=\"Manual-Hand held\",i_AppEquip=\"Manual-Knapsack\")),0,INDEX(ay_OpExAOEM,MATCH(sys_KeyOperator&\"Protected Hands\",key_AOEM,0),21)))   ),MAX(INDEX(ay_OpExAOEM,MATCH(sys_KeyOperator&\"Protected Hands\",key_AOEM,0),22),(INDEX(ay_OpExAOEM,MATCH(sys_KeyOperator&\"Protected Hands\",key_AOEM,0),22)/d_PctExtrapolation)*0.1*i_AmountAS4))","v":{"$error":"#N/A"}},"AOEM"]
[null,null,"Protected body (workwear or protective garment and sturdy footwear)",{"$f":"IF(ISBLANK(INDEX(ay_OpExAOEM,MATCH(sys_KeyOperator&\"Protected Body\",key_AOEM,0),18)),10^(INDEX(ay_OpExAOEM,MATCH(sys_KeyOperator&\"Protected Body\",key_AOEM,0),15)+(LOG(0.1*i_AmountAS1)*INDEX(ay_OpExAOEM,MATCH(sys_KeyOperator&\"Protected Body\",key_AOEM,0),16))+  IF(AND(i_AppMeth=\"Upward spraying\",LEFT(i_AppEquip,15)=\"Vehicle-mounted\",d_AppPfCaBfR = \"Yes\"),0,IF(AND(i_Season = \"late (dense foliage)\",i_AppMeth=\"Upward spraying\",OR(i_AppEquip=\"Manual-Hand held\",i_AppEquip=\"Manual-Knapsack\")),0,INDEX(ay_OpExAOEM,MATCH(sys_KeyOperator&\"Protected Body\",key_AOEM,0),17)))   ),MAX(INDEX(ay_OpExAOEM,MATCH(sys_KeyOperator&\"Protected Body\",key_AOEM,0),18),(INDEX(ay_OpExAOEM,MATCH(sys_KeyOperator&\"Protected Body\",key_AOEM,0),18)/d_PctExtrapolation)*0.1*i_AmountAS1))","v":{"$error":"#N/A"}},{"$f":"IF(ISBLANK(INDEX(ay_OpExAOEM,MATCH(sys_KeyOperator&\"Protected Body\",key_AOEM,0),22)),10^(INDEX(ay_OpExAOEM,MATCH(sys_KeyOperator&\"Protected Body\",key_AOEM,0),19)++(LOG(0.1*i_AmountAS1)*INDEX(ay_OpExAOEM,MATCH(sys_KeyOperator&\"Protected Body\",key_AOEM,0),20))+  IF(AND(i_AppMeth=\"Upward spraying\",LEFT(i_AppEquip,15)=\"Vehicle-mounted\",d_AppPfCaBfR = \"Yes\"),0,IF(AND(i_Season = \"late (dense foliage)\",i_AppMeth=\"Upward spraying\",OR(i_AppEquip=\"Manual-Hand held\",i_AppEquip=\"Manual-Knapsack\")),0,INDEX(ay_OpExAOEM,MATCH(sys_KeyOperator&\"Protected Body\",key_AOEM,0),21)))   ),MAX(INDEX(ay_OpExAOEM,MATCH(sys_KeyOperator&\"Protected Body\",key_AOEM,0),22),(INDEX(ay_OpExAOEM,MATCH(sys_KeyOperator&\"Protected Body\",key_AOEM,0),22)/d_PctExtrapolation)*0.1*i_AmountAS1))","v":{"$error":"#N/A"}},{"$f":"IF(ISBLANK(INDEX(ay_OpExAOEM,MATCH(sys_KeyOperator&\"Protected Body\",key_AOEM,0),18)),10^(INDEX(ay_OpExAOEM,MATCH(sys_KeyOperator&\"Protected Body\",key_AOEM,0),15)+(LOG(0.1*i_AmountAS2)*INDEX(ay_OpExAOEM,MATCH(sys_KeyOperator&\"Protected Body\",key_AOEM,0),16))+  IF(AND(i_AppMeth=\"Upward spraying\",LEFT(i_AppEquip,15)=\"Vehicle-mounted\",d_AppPfCaBfR = \"Yes\"),0,IF(AND(i_Season = \"late (dense foliage)\",i_AppMeth=\"Upward spraying\",OR(i_AppEquip=\"Manual-Hand held\",i_AppEquip=\"Manual-Knapsack\")),0,INDEX(ay_OpExAOEM,MATCH(sys_KeyOperator&\"Protected Body\",key_AOEM,0),17)))   ),MAX(INDEX(ay_OpExAOEM,MATCH(sys_KeyOperator&\"Protected Body\",key_AOEM,0),18),(INDEX(ay_OpExAOEM,MATCH(sys_KeyOperator&\"Protected Body\",key_AOEM,0),18)/d_PctExtrapolation)*0.1*i_AmountAS2))","v":{"$error":"#N/A"}},{"$f":"IF(ISBLANK(INDEX(ay_OpExAOEM,MATCH(sys_KeyOperator&\"Protected Body\",key_AOEM,0),22)),10^(INDEX(ay_OpExAOEM,MATCH(sys_KeyOperator&\"Protected Body\",key_AOEM,0),19)++(LOG(0.1*i_AmountAS2)*INDEX(ay_OpExAOEM,MATCH(sys_KeyOperator&\"Protected Body\",key_AOEM,0),20))+  IF(AND(i_AppMeth=\"Upward spraying\",LEFT(i_AppEquip,15)=\"Vehicle-mounted\",d_AppPfCaBfR = \"Yes\"),0,IF(AND(i_Season = \"late (dense foliage)\",i_AppMeth=\"Upward spraying\",OR(i_AppEquip=\"Manual-Hand held\",i_AppEquip=\"Manual-Knapsack\")),0,INDEX(ay_OpExAOEM,MATCH(sys_KeyOperator&\"Protected Body\",key_AOEM,0),21)))   ),MAX(INDEX(ay_OpExAOEM,MATCH(sys_KeyOperator&\"Protected Body\",key_AOEM,0),22),(INDEX(ay_OpExAOEM,MATCH(sys_KeyOperator&\"Protected Body\",key_AOEM,0),22)/d_PctExtrapolation)*0.1*i_AmountAS2))","v":{"$error":"#N/A"}},{"$f":"IF(ISBLANK(INDEX(ay_OpExAOEM,MATCH(sys_KeyOperator&\"Protected Body\",key_AOEM,0),18)),10^(INDEX(ay_OpExAOEM,MATCH(sys_KeyOperator&\"Protected Body\",key_AOEM,0),15)+(LOG(0.1*i_AmountAS3)*INDEX(ay_OpExAOEM,MATCH(sys_KeyOperator&\"Protected Body\",key_AOEM,0),16))+  IF(AND(i_AppMeth=\"Upward spraying\",LEFT(i_AppEquip,15)=\"Vehicle-mounted\",d_AppPfCaBfR = \"Yes\"),0,IF(AND(i_Season = \"late (dense foliage)\",i_AppMeth=\"Upward spraying\",OR(i_AppEquip=\"Manual-Hand held\",i_AppEquip=\"Manual-Knapsack\")),0,INDEX(ay_OpExAOEM,MATCH(sys_KeyOperator&\"Protected Body\",key_AOEM,0),17)))   ),MAX(INDEX(ay_OpExAOEM,MATCH(sys_KeyOperator&\"Protected Body\",key_AOEM,0),18),(INDEX(ay_OpExAOEM,MATCH(sys_KeyOperator&\"Protected Body\",key_AOEM,0),18)/d_PctExtrapolation)*0.1*i_AmountAS3))","v":{"$error":"#N/A"}},{"$f":"IF(ISBLANK(INDEX(ay_OpExAOEM,MATCH(sys_KeyOperator&\"Protected Body\",key_AOEM,0),22)),10^(INDEX(ay_OpExAOEM,MATCH(sys_KeyOperator&\"Protected Body\",key_AOEM,0),19)++(LOG(0.1*i_AmountAS3)*INDEX(ay_OpExAOEM,MATCH(sys_KeyOperator&\"Protected Body\",key_AOEM,0),20))+  IF(AND(i_AppMeth=\"Upward spraying\",LEFT(i_AppEquip,15)=\"Vehicle-mounted\",d_AppPfCaBfR = \"Yes\"),0,IF(AND(i_Season = \"late (dense foliage)\",i_AppMeth=\"Upward spraying\",OR(i_AppEquip=\"Manual-Hand held\",i_AppEquip=\"Manual-Knapsack\")),0,INDEX(ay_OpExAOEM,MATCH(sys_KeyOperator&\"Protected Body\",key_AOEM,0),21)))   ),MAX(INDEX(ay_OpExAOEM,MATCH(sys_KeyOperator&\"Protected Body\",key_AOEM,0),22),(INDEX(ay_OpExAOEM,MATCH(sys_KeyOperator&\"Protected Body\",key_AOEM,0),22)/d_PctExtrapolation)*0.1*i_AmountAS3))","v":{"$error":"#N/A"}},{"$f":"IF(ISBLANK(INDEX(ay_OpExAOEM,MATCH(sys_KeyOperator&\"Protected Body\",key_AOEM,0),18)),10^(INDEX(ay_OpExAOEM,MATCH(sys_KeyOperator&\"Protected Body\",key_AOEM,0),15)+(LOG(0.1*i_AmountAS4)*INDEX(ay_OpExAOEM,MATCH(sys_KeyOperator&\"Protected Body\",key_AOEM,0),16))+  IF(AND(i_AppMeth=\"Upward spraying\",LEFT(i_AppEquip,15)=\"Vehicle-mounted\",d_AppPfCaBfR = \"Yes\"),0,IF(AND(i_Season = \"late (dense foliage)\",i_AppMeth=\"Upward spraying\",OR(i_AppEquip=\"Manual-Hand held\",i_AppEquip=\"Manual-Knapsack\")),0,INDEX(ay_OpExAOEM,MATCH(sys_KeyOperator&\"Protected Body\",key_AOEM,0),17)))   ),MAX(INDEX(ay_OpExAOEM,MATCH(sys_KeyOperator&\"Protected Body\",key_AOEM,0),18),(INDEX(ay_OpExAOEM,MATCH(sys_KeyOperator&\"Protected Body\",key_AOEM,0),18)/d_PctExtrapolation)*0.1*i_AmountAS4))","v":{"$error":"#N/A"}},{"$f":"IF(ISBLANK(INDEX(ay_OpExAOEM,MATCH(sys_KeyOperator&\"Protected Body\",key_AOEM,0),22)),10^(INDEX(ay_OpExAOEM,MATCH(sys_KeyOperator&\"Protected Body\",key_AOEM,0),19)++(LOG(0.1*i_AmountAS4)*INDEX(ay_OpExAOEM,MATCH(sys_KeyOperator&\"Protected Body\",key_AOEM,0),20))+  IF(AND(i_AppMeth=\"Upward spraying\",LEFT(i_AppEquip,15)=\"Vehicle-mounted\",d_AppPfCaBfR = \"Yes\"),0,IF(AND(i_Season = \"late (dense foliage)\",i_AppMeth=\"Upward spraying\",OR(i_AppEquip=\"Manual-Hand held\",i_AppEquip=\"Manual-Knapsack\")),0,INDEX(ay_OpExAOEM,MATCH(sys_KeyOperator&\"Protected Body\",key_AOEM,0),21)))   ),MAX(INDEX(ay_OpExAOEM,MATCH(sys_KeyOperator&\"Protected Body\",key_AOEM,0),22),(INDEX(ay_OpExAOEM,MATCH(sys_KeyOperator&\"Protected Body\",key_AOEM,0),22)/d_PctExtrapolation)*0.1*i_AmountAS4))","v":{"$error":"#N/A"}},"AOEM"]
[null,null,"Inhalation",{"$f":"IF(ISBLANK(INDEX(ay_OpExAOEM,MATCH(sys_KeyOperator&\"Inhalation\",key_AOEM,0),18)),10^(INDEX(ay_OpExAOEM,MATCH(sys_KeyOperator&\"Inhalation\",key_AOEM,0),15)+(LOG(0.1*i_AmountAS1)*INDEX(ay_OpExAOEM,MATCH(sys_KeyOperator&\"Inhalation\",key_AOEM,0),16))+  IF(AND(i_AppMeth=\"Upward spraying\",LEFT(i_AppEquip,15)=\"Vehicle-mounted\",d_AppPfCaBfR = \"Yes\"),0,IF(AND(i_Season = \"late (dense foliage)\",i_AppMeth=\"Upward spraying\",OR(i_AppEquip=\"Manual-Hand held\",i_AppEquip=\"Manual-Knapsack\")),0,INDEX(ay_OpExAOEM,MATCH(sys_KeyOperator&\"Inhalation\",key_AOEM,0),17)))  ),MAX(INDEX(ay_OpExAOEM,MATCH(sys_KeyOperator&\"Inhalation\",key_AOEM,0),18),(INDEX(ay_OpExAOEM,MATCH(sys_KeyOperator&\"Inhalation\",key_AOEM,0),18)/d_PctExtrapolation)*0.1*i_AmountAS1))","v":{"$error":"#N/A"}},{"$f":"IF(ISBLANK(INDEX(ay_OpExAOEM,MATCH(sys_KeyOperator&\"Inhalation\",key_AOEM,0),22)),10^(INDEX(ay_OpExAOEM,MATCH(sys_KeyOperator&\"Inhalation\",key_AOEM,0),19)+(LOG(0.1*i_AmountAS1)*INDEX(ay_OpExAOEM,MATCH(sys_KeyOperator&\"Inhalation\",key_AOEM,0),20))+  IF(AND(i_AppMeth=\"Upward spraying\",LEFT(i_AppEquip,15)=\"Vehicle-mounted\",d_AppPfCaBfR = \"Yes\"),0,IF(AND(i_Season = \"late (dense foliage)\",i_AppMeth=\"Upward spraying\",OR(i_AppEquip=\"Manual-Hand held\",i_AppEquip=\"Manual-Knapsack\")),0,INDEX(ay_OpExAOEM,MATCH(sys_KeyOperator&\"Inhalation\",key_AOEM,0),21)))  ),MAX(INDEX(ay_OpExAOEM,MATCH(sys_KeyOperator&\"Inhalation\",key_AOEM,0),22),(INDEX(ay_OpExAOEM,MATCH(sys_KeyOperator&\"Inhalation\",key_AOEM,0),22)/d_PctExtrapolation)*0.1*i_AmountAS1))","v":{"$error":"#N/A"}},{"$f":"IF(ISBLANK(INDEX(ay_OpExAOEM,MATCH(sys_KeyOperator&\"Inhalation\",key_AOEM,0),18)),10^(INDEX(ay_OpExAOEM,MATCH(sys_KeyOperator&\"Inhalation\",key_AOEM,0),15)+(LOG(0.1*i_AmountAS2)*INDEX(ay_OpExAOEM,MATCH(sys_KeyOperator&\"Inhalation\",key_AOEM,0),16))+  IF(AND(i_AppMeth=\"Upward spraying\",LEFT(i_AppEquip,15)=\"Vehicle-mounted\",d_AppPfCaBfR = \"Yes\"),0,IF(AND(i_Season = \"late (dense foliage)\",i_AppMeth=\"Upward spraying\",OR(i_AppEquip=\"Manual-Hand held\",i_AppEquip=\"Manual-Knapsack\")),0,INDEX(ay_OpExAOEM,MATCH(sys_KeyOperator&\"Inhalation\",key_AOEM,0),17)))  ),MAX(INDEX(ay_OpExAOEM,MATCH(sys_KeyOperator&\"Inhalation\",key_AOEM,0),18),(INDEX(ay_OpExAOEM,MATCH(sys_KeyOperator&\"Inhalation\",key_AOEM,0),18)/d_PctExtrapolation)*0.1*i_AmountAS2))","v":{"$error":"#N/A"}},{"$f":"IF(ISBLANK(INDEX(ay_OpExAOEM,MATCH(sys_KeyOperator&\"Inhalation\",key_AOEM,0),22)),10^(INDEX(ay_OpExAOEM,MATCH(sys_KeyOperator&\"Inhalation\",key_AOEM,0),19)+(LOG(0.1*i_AmountAS2)*INDEX(ay_OpExAOEM,MATCH(sys_KeyOperator&\"Inhalation\",key_AOEM,0),20))+  IF(AND(i_AppMeth=\"Upward spraying\",LEFT(i_AppEquip,15)=\"Vehicle-mounted\",d_AppPfCaBfR = \"Yes\"),0,IF(AND(i_Season = \"late (dense foliage)\",i_AppMeth=\"Upward spraying\",OR(i_AppEquip=\"Manual-Hand held\",i_AppEquip=\"Manual-Knapsack\")),0,INDEX(ay_OpExAOEM,MATCH(sys_KeyOperator&\"Inhalation\",key_AOEM,0),21)))  ),MAX(INDEX(ay_OpExAOEM,MATCH(sys_KeyOperator&\"Inhalation\",key_AOEM,0),22),(INDEX(ay_OpExAOEM,MATCH(sys_KeyOperator&\"Inhalation\",key_AOEM,0),22)/d_PctExtrapolation)*0.1*i_AmountAS2))","v":{"$error":"#N/A"}},{"$f":"IF(ISBLANK(INDEX(ay_OpExAOEM,MATCH(sys_KeyOperator&\"Inhalation\",key_AOEM,0),18)),10^(INDEX(ay_OpExAOEM,MATCH(sys_KeyOperator&\"Inhalation\",key_AOEM,0),15)+(LOG(0.1*i_AmountAS3)*INDEX(ay_OpExAOEM,MATCH(sys_KeyOperator&\"Inhalation\",key_AOEM,0),16))+  IF(AND(i_AppMeth=\"Upward spraying\",LEFT(i_AppEquip,15)=\"Vehicle-mounted\",d_AppPfCaBfR = \"Yes\"),0,IF(AND(i_Season = \"late (dense foliage)\",i_AppMeth=\"Upward spraying\",OR(i_AppEquip=\"Manual-Hand held\",i_AppEquip=\"Manual-Knapsack\")),0,INDEX(ay_OpExAOEM,MATCH(sys_KeyOperator&\"Inhalation\",key_AOEM,0),17)))  ),MAX(INDEX(ay_OpExAOEM,MATCH(sys_KeyOperator&\"Inhalation\",key_AOEM,0),18),(INDEX(ay_OpExAOEM,MATCH(sys_KeyOperator&\"Inhalation\",key_AOEM,0),18)/d_PctExtrapolation)*0.1*i_AmountAS3))","v":{"$error":"#N/A"}},{"$f":"IF(ISBLANK(INDEX(ay_OpExAOEM,MATCH(sys_KeyOperator&\"Inhalation\",key_AOEM,0),22)),10^(INDEX(ay_OpExAOEM,MATCH(sys_KeyOperator&\"Inhalation\",key_AOEM,0),19)+(LOG(0.1*i_AmountAS3)*INDEX(ay_OpExAOEM,MATCH(sys_KeyOperator&\"Inhalation\",key_AOEM,0),20))+  IF(AND(i_AppMeth=\"Upward spraying\",LEFT(i_AppEquip,15)=\"Vehicle-mounted\",d_AppPfCaBfR = \"Yes\"),0,IF(AND(i_Season = \"late (dense foliage)\",i_AppMeth=\"Upward spraying\",OR(i_AppEquip=\"Manual-Hand held\",i_AppEquip=\"Manual-Knapsack\")),0,INDEX(ay_OpExAOEM,MATCH(sys_KeyOperator&\"Inhalation\",key_AOEM,0),21)))  ),MAX(INDEX(ay_OpExAOEM,MATCH(sys_KeyOperator&\"Inhalation\",key_AOEM,0),22),(INDEX(ay_OpExAOEM,MATCH(sys_KeyOperator&\"Inhalation\",key_AOEM,0),22)/d_PctExtrapolation)*0.1*i_AmountAS3))","v":{"$error":"#N/A"}},{"$f":"IF(ISBLANK(INDEX(ay_OpExAOEM,MATCH(sys_KeyOperator&\"Inhalation\",key_AOEM,0),18)),10^(INDEX(ay_OpExAOEM,MATCH(sys_KeyOperator&\"Inhalation\",key_AOEM,0),15)+(LOG(0.1*i_AmountAS4)*INDEX(ay_OpExAOEM,MATCH(sys_KeyOperator&\"Inhalation\",key_AOEM,0),16))+  IF(AND(i_AppMeth=\"Upward spraying\",LEFT(i_AppEquip,15)=\"Vehicle-mounted\",d_AppPfCaBfR = \"Yes\"),0,IF(AND(i_Season = \"late (dense foliage)\",i_AppMeth=\"Upward spraying\",OR(i_AppEquip=\"Manual-Hand held\",i_AppEquip=\"Manual-Knapsack\")),0,INDEX(ay_OpExAOEM,MATCH(sys_KeyOperator&\"Inhalation\",key_AOEM,0),17)))  ),MAX(INDEX(ay_OpExAOEM,MATCH(sys_KeyOperator&\"Inhalation\",key_AOEM,0),18),(INDEX(ay_OpExAOEM,MATCH(sys_KeyOperator&\"Inhalation\",key_AOEM,0),18)/d_PctExtrapolation)*0.1*i_AmountAS4))","v":{"$error":"#N/A"}},{"$f":"IF(ISBLANK(INDEX(ay_OpExAOEM,MATCH(sys_KeyOperator&\"Inhalation\",key_AOEM,0),22)),10^(INDEX(ay_OpExAOEM,MATCH(sys_KeyOperator&\"Inhalation\",key_AOEM,0),19)+(LOG(0.1*i_AmountAS4)*INDEX(ay_OpExAOEM,MATCH(sys_KeyOperator&\"Inhalation\",key_AOEM,0),20))+  IF(AND(i_AppMeth=\"Upward spraying\",LEFT(i_AppEquip,15)=\"Vehicle-mounted\",d_AppPfCaBfR = \"Yes\"),0,IF(AND(i_Season = \"late (dense foliage)\",i_AppMeth=\"Upward spraying\",OR(i_AppEquip=\"Manual-Hand held\",i_AppEquip=\"Manual-Knapsack\")),0,INDEX(ay_OpExAOEM,MATCH(sys_KeyOperator&\"Inhalation\",key_AOEM,0),21)))  ),MAX(INDEX(ay_OpExAOEM,MATCH(sys_KeyOperator&\"Inhalation\",key_AOEM,0),22),(INDEX(ay_OpExAOEM,MATCH(sys_KeyOperator&\"Inhalation\",key_AOEM,0),22)/d_PctExtrapolation)*0.1*i_AmountAS4))","v":{"$error":"#N/A"}},"AOEM"]
[null,null,"Protective Equipment",null,null,null,null,null,null,null,null,"Penetration factor","Inhalation Protection factor"]
[null,null,"Gloves",{"$f":"'Operator Spray'!D39","v":"No"},null,null,null,null,null,null,null,{"$f":"IF(D39=\"Yes\",\"Incl. in AOEM model\",\"\")","v":""}]
[null,null,"Clothing",{"$f":"'Operator Spray'!D40","v":"Work wear - arms, body and legs covered"},null,null,null,null,null,null,null,"Incl. in AOEM model"]
[null,null,"Head and respiratory PPE",{"$f":"'Operator Spray'!D41","v":"None"},null,null,null,null,null,null,null,{"$f":"INDEX(ay_MixPPEHead,MATCH(D41,key_MixPPEHead,0),2)","v":1},{"$f":"IF(OR(D41=\"Hood and visor\",D41=\"Hood\"),1,INDEX(ay_MixRPE,MATCH(D41,key_MixRPE,0),2))","v":1}]
[null,null,"Cabin",{"$f":"'Operator Spray'!D42","v":"Not relevant"},null,null,null,null,null,null,null,"vehicle mounted upward spraying only"]
[]
[null,"1. Total",null,{"$f":"i_SubstName1","v":0},null,{"$f":"i_SubstName2","v":0},null,{"$f":"i_SubstName3","v":0},null,{"$f":"i_SubstName4","v":0},null,"Combined"]
[null,null,null,"Without RPE/PPE","With RPE/PPE ","Without RPE/PPE","With RPE/PPE ","Without RPE/PPE","With RPE/PPE ","Without RPE/PPE","With RPE/PPE ","Without RPE/PPE","With RPE/PPE "]
[null,"Short-term"]
[null,"Total systemic exposure from mixing, loading and application (mg a.s./day)",null,{"$f":"(D63+D79)","v":{"$error":"#N/A"}},{"$f":"(D70+D85)","v":{"$error":"#N/A"}},{"$f":"(F63+F79)","v":{"$error":"#N/A"}},{"$f":"(F70+F85)","v":{"$error":"#N/A"}},{"$f":"(H63+H79)","v":{"$error":"#N/A"}},{"$f":"(H70+H85)","v":{"$error":"#N/A"}},{"$f":"(J63+J79)","v":{"$error":"#N/A"}},{"$f":"(J70+J85)","v":{"$error":"#N/A"}}]
[null,"Total systemic dose from mixing, loading and application per kg body weight (mg/kg bw/day)",null,{"$f":"D47/d_BwAdult","v":{"$error":"#N/A"}},{"$error":"#N/A"},{"$error":"#N/A"},{"$error":"#N/A"},{"$error":"#N/A"},{"$error":"#N/A"},{"$error":"#N/A"},{"$error":"#N/A"}]
[null,"% of AOEL",null,{"$f":"IFERROR(D48/i_AOEL1,0)","v":0},{"$f":"IFERROR(E48/i_AOEL1,0)","v":0},{"$f":"IFERROR(F48/i_AOEL2,0)","v":0},{"$f":"IFERROR(G48/i_AOEL2,0)","v":0},{"$f":"IFERROR(H48/i_AOEL3,0)","v":0},{"$f":"IFERROR(I48/i_AOEL3,0)","v":0},{"$f":"IFERROR(J48/i_AOEL4,0)","v":0},{"$f":"IFERROR(K48/i_AOEL4,0)","v":0},{"$f":"\"Hazard index = \"&FIXED(D49+F49+H49+J49,3)","v":"Hazard index = 0.000"},{"$f":"\"Hazard index = \"&FIXED(E49+G49+I49+K49,3)","v":"Hazard index = 0.000"}]
[null,"Acute "]
[null,"Total systemic exposure from mixing, loading and application (mg a.s./day)",null,{"$f":"(D95+D111)","v":{"$error":"#N/A"}},{"$f":"(D102+D117)","v":{"$error":"#N/A"}},{"$f":"(F95+F111)","v":{"$error":"#N/A"}},{"$f":"(F102+F117)","v":{"$error":"#N/A"}},{"$f":"(H95+H111)","v":{"$error":"#N/A"}},{"$f":"(H102+H117)","v":{"$error":"#N/A"}},{"$f":"(J95+J111)","v":{"$error":"#N/A"}},{"$f":"(J102+J117)","v":{"$error":"#N/A"}}]
[null,"Total systemic dose from mixing, loading and application per kg body weight (mg/kg bw/day)",null,{"$f":"D51/d_BwAdult","v":{"$error":"#N/A"}},{"$f":"E51/d_BwAdult","v":{"$error":"#N/A"}},{"$error":"#N/A"},{"$error":"#N/A"},{"$error":"#N/A"},{"$error":"#N/A"},{"$error":"#N/A"},{"$error":"#N/A"}]
[null,"% of AAOEL",null,{"$f":"IFERROR(D52/i_AAOEL1,0)","v":0},{"$f":"IFERROR(E52/i_AAOEL1,0)","v":0},{"$f":"IFERROR(F52/i_AAOEL2,0)","v":0},{"$f":"IFERROR(G52/i_AAOEL2,0)","v":0},{"$f":"IFERROR(H52/i_AAOEL3,0)","v":0},{"$f":"IFERROR(I52/i_AAOEL3,0)","v":0},{"$f":"IFERROR(J52/i_AAOEL4,0)","v":0},{"$f":"IFERROR(K52/i_AAOEL4,0)","v":0},{"$f":"\"Hazard index = \"&FIXED(D53+F53+H53+J53,3)","v":"Hazard index = 0.000"},{"$f":"\"Hazard index = \"&FIXED(E53+G53+I53+K53,3)","v":"Hazard index = 0.000"}]
[]
[null,"2. Short-term exposure"]
[null,"2.1 Mixing and loading",null,{"$f":"i_SubstName1","v":0},null,{"$f":"i_SubstName2","v":0},null,{"$f":"i_SubstName3","v":0},null,{"$f":"i_SubstName4","v":0}]
[null,null,null,"Systemic exposure [mg a.s. /day]","Systemic dose [mg a.s./kg bw/day]","Systemic exposure [mg a.s. /day]","Systemic dose [mg a.s./kg bw/day]","Systemic exposure [mg a.s. /day]","Systemic dose [mg a.s./kg bw/day]","Systemic exposure [mg a.s. /day]","Systemic dose [mg a.s./kg bw/day]"]
[null,"Without RPE/PPE"]
[null,"Hands",null,{"$f":"D17*i_AbsorpProduct1/1000","v":{"$error":"#N/A"}},{"$f":"D59/d_BwAdult","v":{"$error":"#N/A"}},{"$f":"F17*i_AbsorpProduct2/1000","v":{"$error":"#N/A"}},{"$f":"F59/d_BwAdult","v":{"$error":"#N/A"}},{"$f":"H17*i_AbsorpProduct3/1000","v":{"$error":"#N/A"}},{"$f":"H59/d_BwAdult","v":{"$error":"#N/A"}},{"$f":"J17*i_AbsorpProduct4/1000","v":{"$error":"#N/A"}},{"$f":"J59/d_BwAdult","v":{"$error":"#N/A"}}]
[null,"Body",null,{"$f":"D18*i_AbsorpProduct1/1000","v":{"$error":"#N/A"}},{"$f":"D60/d_BwAdult","v":{"$error":"#N/A"}},{"$f":"F18*i_AbsorpProduct2/1000","v":{"$error":"#N/A"}},{"$f":"F60/d_BwAdult","v":{"$error":"#N/A"}},{"$f":"H18*i_AbsorpProduct3/1000","v":{"$error":"#N/A"}},{"$f":"H60/d_BwAdult","v":{"$error":"#N/A"}},{"$f":"J18*i_AbsorpProduct4/1000","v":{"$error":"#N/A"}},{"$f":"J60/d_BwAdult","v":{"$error":"#N/A"}}]
[null,"Head",null,{"$f":"D19*i_AbsorpProduct1/1000","v":{"$error":"#N/A"}},{"$f":"D61/d_BwAdult","v":{"$error":"#N/A"}},{"$f":"F19*i_AbsorpProduct2/1000","v":{"$error":"#N/A"}},{"$f":"F61/d_BwAdult","v":{"$error":"#N/A"}},{"$f":"H19*i_AbsorpProduct3/1000","v":{"$error":"#N/A"}},{"$f":"H61/d_BwAdult","v":{"$error":"#N/A"}},{"$f":"J19*i_AbsorpProduct4/1000","v":{"$error":"#N/A"}},{"$f":"J61/d_BwAdult","v":{"$error":"#N/A"}}]
[null,"Inhalation",null,{"$f":"D23*i_AbsorpInhalation1/1000","v":{"$error":"#N/A"}},{"$f":"D62/d_BwAdult","v":{"$error":"#N/A"}},{"$f":"F23*i_AbsorpInhalation1/1000","v":{"$error":"#N/A"}},{"$f":"F62/d_BwAdult","v":{"$error":"#N/A"}},{"$f":"H23*i_AbsorpInhalation1/1000","v":{"$error":"#N/A"}},{"$f":"H62/d_BwAdult","v":{"$error":"#N/A"}},{"$f":"J23*i_AbsorpInhalation1/1000","v":{"$error":"#N/A"}},{"$f":"J62/d_BwAdult","v":{"$error":"#N/A"}}]
[null,"Sum ",null,{"$f":"D59+D60+D61+D62","v":{"$error":"#N/A"}},{"$f":"D63/d_BwAdult","v":{"$error":"#N/A"}},{"$f":"F59+F60+F61+F62","v":{"$error":"#N/A"}},{"$f":"F63/d_BwAdult","v":{"$error":"#N/A"}},{"$f":"H59+H60+H61+H62","v":{"$error":"#N/A"}},{"$f":"H63/d_BwAdult","v":{"$error":"#N/A"}},{"$f":"J59+J60+J61+J62","v":{"$error":"#N/A"}},{"$f":"J63/d_BwAdult","v":{"$error":"#N/A"}}]
[null,"With RPE/PPE (as selected above)"]
[null,"Hands",null,{"$f":"IF(D25=\"Yes\", D20,D17)*i_AbsorpProduct1/1000","v":{"$error":"#N/A"}},{"$f":"D65/d_BwAdult","v":{"$error":"#N/A"}},{"$f":"IF(D25=\"Yes\", F20,F17)*i_AbsorpProduct2/1000","v":{"$error":"#N/A"}},{"$f":"F65/d_BwAdult","v":{"$error":"#N/A"}},{"$f":"IF(D25=\"Yes\", H20,H17)*i_AbsorpProduct3/1000","v":{"$error":"#N/A"}},{"$f":"H65/d_BwAdult","v":{"$error":"#N/A"}},{"$f":"IF(D25=\"Yes\", J20,J17)*i_AbsorpProduct4/1000","v":{"$error":"#N/A"}},{"$f":"J65/d_BwAdult","v":{"$error":"#N/A"}}]
[null,"Body",null,{"$f":"IF(D26<>\"Potential exposure\",D21,D18)*i_AbsorpProduct1/1000","v":{"$error":"#N/A"}},{"$error":"#N/A"},{"$f":"IF(D26<>\"Potential exposure\",F21,F18)*i_AbsorpProduct2/1000","v":{"$error":"#N/A"}},{"$error":"#N/A"},{"$f":"IF(D26<>\"Potential exposure\",H21,H18)*i_AbsorpProduct3/1000","v":{"$error":"#N/A"}},{"$error":"#N/A"},{"$f":"IF(D26<>\"Potential exposure\",J21,J18)*i_AbsorpProduct4/1000","v":{"$error":"#N/A"}},{"$error":"#N/A"}]
[null,"Head",null,{"$f":"IF($D27<>\"None\",D22*i_AbsorpProduct1,D19*i_AbsorpProduct1)/1000","v":{"$error":"#N/A"}},{"$error":"#N/A"},{"$f":"IF($D27<>\"None\",F22*i_AbsorpProduct2,F19*i_AbsorpProduct2)/1000","v":{"$error":"#N/A"}},{"$error":"#N/A"},{"$f":"IF($D27<>\"None\",H22*i_AbsorpProduct3,H19*i_AbsorpProduct3)/1000","v":{"$error":"#N/A"}},{"$error":"#N/A"},{"$f":"IF($D27<>\"None\",J22*i_AbsorpProduct4,J19*i_AbsorpProduct4)/1000","v":{"$error":"#N/A"}},{"$error":"#N/A"}]
[null,"Inhalation",null,{"$f":"D23*i_AbsorpInhalation1*$M27/1000","v":{"$error":"#N/A"}},{"$error":"#N/A"},{"$f":"F23*i_AbsorpInhalation2*$M27/1000","v":{"$error":"#N/A"}},{"$error":"#N/A"},{"$f":"H23*i_AbsorpInhalation3*$M27/1000","v":{"$error":"#N/A"}},{"$error":"#N/A"},{"$f":"J23*i_AbsorpInhalation4*$M27/1000","v":{"$error":"#N/A"}},{"$error":"#N/A"}]
[null,"Sum ",null,{"$f":"SUM(D65:D68)","v":{"$error":"#N/A"}},{"$error":"#N/A"},{"$f":"SUM(F65:F68)","v":{"$error":"#N/A"}},{"$error":"#N/A"},{"$f":"SUM(H65:H68)","v":{"$error":"#N/A"}},{"$error":"#N/A"},{"$f":"SUM(J65:J68)","v":{"$error":"#N/A"}},{"$error":"#N/A"}]
[null,"Water soluble bag",null,{"$f":"D69*$L28","v":{"$error":"#N/A"}},{"$error":"#N/A"},{"$f":"F69*$L28","v":{"$error":"#N/A"}},{"$error":"#N/A"},{"$f":"H69*$L28","v":{"$error":"#N/A"}},{"$error":"#N/A"},{"$f":"J69*$L28","v":{"$error":"#N/A"}},{"$error":"#N/A"}]
[]
[null,"2.2 Application",null,{"$f":"i_SubstName1","v":0},null,{"$f":"i_SubstName2","v":0},null,{"$f":"i_SubstName3","v":0},null,{"$f":"i_SubstName4","v":0}]
[null,null,null,"Systemic exposure [mg a.s. /day]","Systemic dose [mg a.s./kg bw/day]","Systemic exposure [mg a.s. /day]","Systemic dose [mg a.s./kg bw/day]","Systemic exposure [mg a.s. /day]","Systemic dose [mg a.s./kg bw/day]","Systemic exposure [mg a.s. /day]","Systemic dose [mg a.s./kg bw/day]"]
[null,"Without RPE/PPE"]
[null,"Hands",null,{"$f":"D32*i_AbsorpInuse1/1000","v":{"$error":"#N/A"}},{"$f":"D75/d_BwAdult","v":{"$error":"#N/A"}},{"$f":"F32*i_AbsorpInuse2/1000","v":{"$error":"#N/A"}},{"$f":"F75/d_BwAdult","v":{"$error":"#N/A"}},{"$f":"H32*i_AbsorpInuse3/1000","v":{"$error":"#N/A"}},{"$f":"H75/d_BwAdult","v":{"$error":"#N/A"}},{"$f":"J32*i_AbsorpInuse4/1000","v":{"$error":"#N/A"}},{"$f":"J75/d_BwAdult","v":{"$error":"#N/A"}}]
[null,"Body",null,{"$f":"D33*i_AbsorpInuse1/1000","v":{"$error":"#N/A"}},{"$f":"D76/d_BwAdult","v":{"$error":"#N/A"}},{"$f":"F33*i_AbsorpInuse2/1000","v":{"$error":"#N/A"}},{"$f":"F76/d_BwAdult","v":{"$error":"#N/A"}},{"$f":"H33*i_AbsorpInuse3/1000","v":{"$error":"#N/A"}},{"$f":"H76/d_BwAdult","v":{"$error":"#N/A"}},{"$f":"J33*i_AbsorpInuse4/1000","v":{"$error":"#N/A"}},{"$f":"J76/d_BwAdult","v":{"$error":"#N/A"}}]
[null,"Head",null,{"$f":"D34*i_AbsorpInuse1/1000","v":{"$error":"#N/A"}},{"$f":"D77/d_BwAdult","v":{"$error":"#N/A"}},{"$f":"F34*i_AbsorpInuse2/1000","v":{"$error":"#N/A"}},{"$f":"F77/d_BwAdult","v":{"$error":"#N/A"}},{"$f":"H34*i_AbsorpInuse3/1000","v":{"$error":"#N/A"}},{"$f":"H77/d_BwAdult","v":{"$error":"#N/A"}},{"$f":"J34*i_AbsorpInuse4/1000","v":{"$error":"#N/A"}},{"$f":"J77/d_BwAdult","v":{"$error":"#N/A"}}]
[null,"Inhalation",null,{"$f":"D37*i_AbsorpInhalation1/1000","v":{"$error":"#N/A"}},{"$f":"D78/d_BwAdult","v":{"$error":"#N/A"}},{"$f":"F37*i_AbsorpInhalation1/1000","v":{"$error":"#N/A"}},{"$f":"F78/d_BwAdult","v":{"$error":"#N/A"}},{"$f":"H37*i_AbsorpInhalation1/1000","v":{"$error":"#N/A"}},{"$f":"H78/d_BwAdult","v":{"$error":"#N/A"}},{"$f":"J37*i_AbsorpInhalation1/1000","v":{"$error":"#N/A"}},{"$f":"J78/d_BwAdult","v":{"$error":"#N/A"}}]
[null,"Sum ",null,{"$f":"D75+D76+D77+D78","v":{"$error":"#N/A"}},{"$f":"D79/d_BwAdult","v":{"$error":"#N/A"}},{"$f":"F75+F76+F77+F78","v":{"$error":"#N/A"}},{"$f":"F79/d_BwAdult","v":{"$error":"#N/A"}},{"$f":"H75+H76+H77+H78","v":{"$error":"#N/A"}},{"$f":"H79/d_BwAdult","v":{"$error":"#N/A"}},{"$f":"J75+J76+J77+J78","v":{"$error":"#N/A"}},{"$f":"J79/d_BwAdult","v":{"$error":"#N/A"}}]
[null,"With RPE/PPE (as selected above)"]
[null,"Hands",null,{"$f":"IF(D39=\"Yes\", D35,D32)*i_AbsorpInuse1/1000","v":{"$error":"#N/A"}},{"$f":"D81/d_BwAdult","v":{"$error":"#N/A"}},{"$f":"IF(D39=\"Yes\", F35,F32)*i_AbsorpInuse2/1000","v":{"$error":"#N/A"}},{"$f":"F81/d_BwAdult","v":{"$error":"#N/A"}},{"$f":"IF(D39=\"Yes\", H35,H32)*i_AbsorpInuse3/1000","v":{"$error":"#N/A"}},{"$f":"H81/d_BwAdult","v":{"$error":"#N/A"}},{"$f":"IF(D39=\"Yes\", J35,J32)*i_AbsorpInuse4/1000","v":{"$error":"#N/A"}},{"$f":"J81/d_BwAdult","v":{"$error":"#N/A"}}]
[null,"Body",null,{"$f":"IF(D40<>\"Potential exposure\",D36,D33)*i_AbsorpInuse1/1000","v":{"$error":"#N/A"}},{"$f":"D82/d_BwAdult","v":{"$error":"#N/A"}},{"$f":"IF(D40<>\"Potential exposure\",F36,F33)*i_AbsorpInuse2/1000","v":{"$error":"#N/A"}},{"$f":"F82/d_BwAdult","v":{"$error":"#N/A"}},{"$f":"IF(D40<>\"Potential exposure\",H36,H33)*i_AbsorpInuse3/1000","v":{"$error":"#N/A"}},{"$f":"H82/d_BwAdult","v":{"$error":"#N/A"}},{"$f":"IF(D40<>\"Potential exposure\",J36,J33)*i_AbsorpInuse4/1000","v":{"$error":"#N/A"}},{"$f":"J82/d_BwAdult","v":{"$error":"#N/A"}}]
[null,"Head",null,{"$f":"D34*i_AbsorpInuse1*$L41/1000","v":{"$error":"#N/A"}},{"$f":"D83/d_BwAdult","v":{"$error":"#N/A"}},{"$f":"F34*i_AbsorpInuse2*L41/1000","v":{"$error":"#N/A"}},{"$f":"F83/d_BwAdult","v":{"$error":"#N/A"}},{"$f":"H34*i_AbsorpInuse3*L41/1000","v":{"$error":"#N/A"}},{"$f":"H83/d_BwAdult","v":{"$error":"#N/A"}},{"$f":"J34*i_AbsorpInuse4*L41/1000","v":{"$error":"#N/A"}},{"$f":"J83/d_BwAdult","v":{"$error":"#N/A"}}]
[null,"Inhalation",null,{"$f":"D37*i_AbsorpInhalation1*$M41/1000","v":{"$error":"#N/A"}},{"$f":"D84/d_BwAdult","v":{"$error":"#N/A"}},{"$f":"F37*i_AbsorpInhalation2*$M41/1000","v":{"$error":"#N/A"}},{"$f":"F84/d_BwAdult","v":{"$error":"#N/A"}},{"$f":"H37*i_AbsorpInhalation3*$M41/1000","v":{"$error":"#N/A"}},{"$f":"H84/d_BwAdult","v":{"$error":"#N/A"}},{"$f":"J37*i_AbsorpInhalation4*$M41/1000","v":{"$error":"#N/A"}},{"$f":"J84/d_BwAdult","v":{"$error":"#N/A"}}]
[null,"Sum ",null,{"$f":"SUM(D81:D84)","v":{"$error":"#N/A"}},{"$f":"D85/d_BwAdult","v":{"$error":"#N/A"}},{"$f":"SUM(F81:F84)","v":{"$error":"#N/A"}},{"$f":"F85/d_BwAdult","v":{"$error":"#N/A"}},{"$f":"SUM(H81:H84)","v":{"$error":"#N/A"}},{"$f":"H85/d_BwAdult","v":{"$error":"#N/A"}},{"$f":"SUM(J81:J84)","v":{"$error":"#N/A"}},{"$f":"J85/d_BwAdult","v":{"$error":"#N/A"}}]
[]
[null,"3. Acute exposure"]
[null,"3.1 Mixing and loading",null,{"$f":"i_SubstName1","v":0},null,{"$f":"i_SubstName2","v":0},null,{"$f":"i_SubstName3","v":0},null,{"$f":"i_SubstName4","v":0}]
[null,null,null,"Systemic exposure [mg a.s. /day]","Systemic dose [mg a.s./kg bw/day]","Systemic exposure [mg a.s. /day]","Systemic dose [mg a.s./kg bw/day]","Systemic exposure [mg a.s. /day]","Systemic dose [mg a.s./kg bw/day]","Systemic exposure [mg a.s. /day]","Systemic dose [mg a.s./kg bw/day]"]
[null,"Without RPE/PPE"]
[null,"Hands",null,{"$f":"E17*i_AbsorpProduct1/1000","v":{"$error":"#N/A"}},{"$f":"D91/d_BwAdult","v":{"$error":"#N/A"}},{"$f":"G17*i_AbsorpProduct2/1000","v":{"$error":"#N/A"}},{"$f":"F91/d_BwAdult","v":{"$error":"#N/A"}},{"$f":"I17*i_AbsorpProduct3/1000","v":{"$error":"#N/A"}},{"$f":"H91/d_BwAdult","v":{"$error":"#N/A"}},{"$f":"K17*i_AbsorpProduct4/1000","v":{"$error":"#N/A"}},{"$f":"J91/d_BwAdult","v":{"$error":"#N/A"}}]
[null,"Body",null,{"$f":"E18*i_AbsorpProduct1/1000","v":{"$error":"#N/A"}},{"$f":"D92/d_BwAdult","v":{"$error":"#N/A"}},{"$f":"G18*i_AbsorpProduct2/1000","v":{"$error":"#N/A"}},{"$f":"F92/d_BwAdult","v":{"$error":"#N/A"}},{"$f":"I18*i_AbsorpProduct3/1000","v":{"$error":"#N/A"}},{"$f":"H92/d_BwAdult","v":{"$error":"#N/A"}},{"$f":"K18*i_AbsorpProduct4/1000","v":{"$error":"#N/A"}},{"$f":"J92/d_BwAdult","v":{"$error":"#N/A"}}]
[null,"Head",null,{"$f":"E19*i_AbsorpProduct1/1000","v":{"$error":"#N/A"}},{"$f":"D93/d_BwAdult","v":{"$error":"#N/A"}},{"$f":"G19*i_AbsorpProduct2/1000","v":{"$error":"#N/A"}},{"$f":"F93/d_BwAdult","v":{"$error":"#N/A"}},{"$f":"I19*i_AbsorpProduct3/1000","v":{"$error":"#N/A"}},{"$f":"H93/d_BwAdult","v":{"$error":"#N/A"}},{"$f":"K19*i_AbsorpProduct4/1000","v":{"$error":"#N/A"}},{"$f":"J93/d_BwAdult","v":{"$error":"#N/A"}}]
[null,"Inhalation",null,{"$f":"E23*i_AbsorpInhalation1/1000","v":{"$error":"#N/A"}},{"$f":"D94/d_BwAdult","v":{"$error":"#N/A"}},{"$f":"G23*i_AbsorpInhalation1/1000","v":{"$error":"#N/A"}},{"$f":"F94/d_BwAdult","v":{"$error":"#N/A"}},{"$f":"I23*i_AbsorpInhalation1/1000","v":{"$error":"#N/A"}},{"$f":"H94/d_BwAdult","v":{"$error":"#N/A"}},{"$f":"K23*i_AbsorpInhalation1/1000","v":{"$error":"#N/A"}},{"$f":"J94/d_BwAdult","v":{"$error":"#N/A"}}]
[null,"Sum ",null,{"$f":"D91+D92+D93+D94","v":{"$error":"#N/A"}},{"$f":"D95/d_BwAdult","v":{"$error":"#N/A"}},{"$f":"F91+F92+F93+F94","v":{"$error":"#N/A"}},{"$f":"F95/d_BwAdult","v":{"$error":"#N/A"}},{"$f":"H91+H92+H93+H94","v":{"$error":"#N/A"}},{"$f":"H95/d_BwAdult","v":{"$error":"#N/A"}},{"$f":"J91+J92+J93+J94","v":{"$error":"#N/A"}},{"$f":"J95/d_BwAdult","v":{"$error":"#N/A"}}]
[null,"With RPE/PPE (as selected above)"]
[null,"Hands",null,{"$f":"IF(D25=\"Yes\", E20,E17)*i_AbsorpProduct1/1000","v":{"$error":"#N/A"}},{"$f":"D97/d_BwAdult","v":{"$error":"#N/A"}},{"$f":"IF(D25=\"Yes\", G20,G17)*i_AbsorpProduct2/1000","v":{"$error":"#N/A"}},{"$f":"F97/d_BwAdult","v":{"$error":"#N/A"}},{"$f":"IF(D25=\"Yes\", I20,I17)*i_AbsorpProduct3/1000","v":{"$error":"#N/A"}},{"$f":"H97/d_BwAdult","v":{"$error":"#N/A"}},{"$f":"IF(D25=\"Yes\", K20,K17)*i_AbsorpProduct4/1000","v":{"$error":"#N/A"}},{"$f":"J97/d_BwAdult","v":{"$error":"#N/A"}}]
[null,"Body",null,{"$f":"IF(D26=\"Work wear - arms, body and legs covered\",E21,E18)*i_AbsorpProduct1/1000","v":{"$error":"#N/A"}},{"$error":"#N/A"},{"$f":"IF(D26=\"Work wear - arms, body and legs covered\",G21,G18)*i_AbsorpProduct2/1000","v":{"$error":"#N/A"}},{"$error":"#N/A"},{"$f":"IF(D26=\"Work wear - arms, body and legs covered\",I21,I18)*i_AbsorpProduct3/1000","v":{"$error":"#N/A"}},{"$error":"#N/A"},{"$f":"IF(D26=\"Work wear - arms, body and legs covered\",K21,K18)*i_AbsorpProduct4/1000","v":{"$error":"#N/A"}},{"$error":"#N/A"}]
[null,"Head",null,{"$f":"IF($D27<>\"None\",E22*i_AbsorpProduct1,E19*i_AbsorpProduct1)/1000","v":{"$error":"#N/A"}},{"$error":"#N/A"},{"$f":"IF($D27<>\"None\",G22*i_AbsorpProduct2,G19*i_AbsorpProduct2)/1000","v":{"$error":"#N/A"}},{"$error":"#N/A"},{"$f":"IF($D27<>\"None\",I22*i_AbsorpProduct3,I19*i_AbsorpProduct3)/1000","v":{"$error":"#N/A"}},{"$error":"#N/A"},{"$f":"IF($D27<>\"None\",K22*i_AbsorpProduct4,K19*i_AbsorpProduct4)/1000","v":{"$error":"#N/A"}},{"$error":"#N/A"}]
[null,"Inhalation",null,{"$f":"E23*i_AbsorpInhalation1*$M27/1000","v":{"$error":"#N/A"}},{"$error":"#N/A"},{"$f":"G23*i_AbsorpInhalation2*$M27/1000","v":{"$error":"#N/A"}},{"$error":"#N/A"},{"$f":"I23*i_AbsorpInhalation3*$M27/1000","v":{"$error":"#N/A"}},{"$error":"#N/A"},{"$f":"K23*i_AbsorpInhalation4*$M27/1000","v":{"$error":"#N/A"}},{"$error":"#N/A"}]
[null,"Sum ",null,{"$f":"SUM(D97:D100)","v":{"$error":"#N/A"}},{"$error":"#N/A"},{"$f":"SUM(F97:F100)","v":{"$error":"#N/A"}},{"$error":"#N/A"},{"$f":"SUM(H97:H100)","v":{"$error":"#N/A"}},{"$error":"#N/A"},{"$f":"SUM(J97:J100)","v":{"$error":"#N/A"}},{"$error":"#N/A"}]
[null,"Water soluble bag",null,{"$f":"D101*$L28","v":{"$error":"#N/A"}},{"$error":"#N/A"},{"$f":"F101*$L28","v":{"$error":"#N/A"}},{"$error":"#N/A"},{"$f":"H101*$L28","v":{"$error":"#N/A"}},{"$error":"#N/A"},{"$f":"J101*$L28","v":{"$error":"#N/A"}},{"$error":"#N/A"}]
[]
[null,"2.2 Application",null,{"$f":"i_SubstName1","v":0},null,{"$f":"i_SubstName2","v":0},null,{"$f":"i_SubstName3","v":0},null,{"$f":"i_SubstName4","v":0}]
[null,null,null,"Systemic exposure [mg a.s. /day]","Systemic dose [mg a.s./kg bw/day]","Systemic exposure [mg a.s. /day]","Systemic dose [mg a.s./kg bw/day]","Systemic exposure [mg a.s. /day]","Systemic dose [mg a.s./kg bw/day]","Systemic exposure [mg a.s. /day]","Systemic dose [mg a.s./kg bw/day]"]
[null,"Without RPE/PPE"]
[null,"Hands",null,{"$f":"E32*i_AbsorpInuse1/1000","v":{"$error":"#N/A"}},{"$f":"D107/d_BwAdult","v":{"$error":"#N/A"}},{"$f":"G32*i_AbsorpInuse2/1000","v":{"$error":"#N/A"}},{"$f":"F107/d_BwAdult","v":{"$error":"#N/A"}},{"$f":"I32*i_AbsorpInuse3/1000","v":{"$error":"#N/A"}},{"$f":"H107/d_BwAdult","v":{"$error":"#N/A"}},{"$f":"K32*i_AbsorpInuse4/1000","v":{"$error":"#N/A"}},{"$f":"J107/d_BwAdult","v":{"$error":"#N/A"}}]
[null,"Body",null,{"$f":"E33*i_AbsorpInuse1/1000","v":{"$error":"#N/A"}},{"$f":"D108/d_BwAdult","v":{"$error":"#N/A"}},{"$f":"G33*i_AbsorpInuse2/1000","v":{"$error":"#N/A"}},{"$f":"F108/d_BwAdult","v":{"$error":"#N/A"}},{"$f":"I33*i_AbsorpInuse3/1000","v":{"$error":"#N/A"}},{"$f":"H108/d_BwAdult","v":{"$error":"#N/A"}},{"$f":"K33*i_AbsorpInuse4/1000","v":{"$error":"#N/A"}},{"$f":"J108/d_BwAdult","v":{"$error":"#N/A"}}]
[null,"Head",null,{"$f":"E34*i_AbsorpInuse1/1000","v":{"$error":"#N/A"}},{"$f":"D109/d_BwAdult","v":{"$error":"#N/A"}},{"$f":"G34*i_AbsorpInuse2/1000","v":{"$error":"#N/A"}},{"$f":"F109/d_BwAdult","v":{"$error":"#N/A"}},{"$f":"I34*i_AbsorpInuse3/1000","v":{"$error":"#N/A"}},{"$f":"H109/d_BwAdult","v":{"$error":"#N/A"}},{"$f":"K34*i_AbsorpInuse4/1000","v":{"$error":"#N/A"}},{"$f":"J109/d_BwAdult","v":{"$error":"#N/A"}}]
[null,"Inhalation",null,{"$f":"E37*i_AbsorpInhalation1/1000","v":{"$error":"#N/A"}},{"$f":"D110/d_BwAdult","v":{"$error":"#N/A"}},{"$f":"G37*i_AbsorpInhalation2/1000","v":{"$error":"#N/A"}},{"$f":"F110/d_BwAdult","v":{"$error":"#N/A"}},{"$f":"I37*i_AbsorpInhalation3/1000","v":{"$error":"#N/A"}},{"$f":"H110/d_BwAdult","v":{"$error":"#N/A"}},{"$f":"K37*i_AbsorpInhalation4/1000","v":{"$error":"#N/A"}},{"$f":"J110/d_BwAdult","v":{"$error":"#N/A"}}]
[null,"Sum ",null,{"$f":"D107+D108+D109+D110","v":{"$error":"#N/A"}},{"$f":"D111/d_BwAdult","v":{"$error":"#N/A"}},{"$f":"F107+F108+F109+F110","v":{"$error":"#N/A"}},{"$f":"F111/d_BwAdult","v":{"$error":"#N/A"}},{"$f":"H107+H108+H109+H110","v":{"$error":"#N/A"}},{"$f":"H111/d_BwAdult","v":{"$error":"#N/A"}},{"$f":"J107+J108+J109+J110","v":{"$error":"#N/A"}},{"$f":"J111/d_BwAdult","v":{"$error":"#N/A"}}]
[null,"With RPE/PPE (as selected above)"]
[null,"Hands",null,{"$f":"IF(D39=\"Yes\",E35,E32)*i_AbsorpInuse1/1000","v":{"$error":"#N/A"}},{"$f":"D113/d_BwAdult","v":{"$error":"#N/A"}},{"$f":"IF(D39=\"Yes\",G35,G32)*i_AbsorpInuse2/1000","v":{"$error":"#N/A"}},{"$f":"F113/d_BwAdult","v":{"$error":"#N/A"}},{"$f":"IF(D39=\"Yes\",I35,I32)*i_AbsorpInuse3/1000","v":{"$error":"#N/A"}},{"$f":"H113/d_BwAdult","v":{"$error":"#N/A"}},{"$f":"IF(D39=\"Yes\",K35,K32)*i_AbsorpInuse4/1000","v":{"$error":"#N/A"}},{"$f":"J113/d_BwAdult","v":{"$error":"#N/A"}}]
[null,"Body",null,{"$f":"IF(D40=\"Work wear - arms, body and legs covered\",E36,E33)*i_AbsorpInuse1/1000","v":{"$error":"#N/A"}},{"$f":"D114/d_BwAdult","v":{"$error":"#N/A"}},{"$f":"IF(D40=\"Work wear - arms, body and legs covered\",G36,G33)*i_AbsorpInuse2/1000","v":{"$error":"#N/A"}},{"$f":"F114/d_BwAdult","v":{"$error":"#N/A"}},{"$f":"IF(D40=\"Work wear - arms, body and legs covered\",I36,I33)*i_AbsorpInuse3/1000","v":{"$error":"#N/A"}},{"$f":"H114/d_BwAdult","v":{"$error":"#N/A"}},{"$f":"IF(D40=\"Work wear - arms, body and legs covered\",K36,K33)*i_AbsorpInuse4/1000","v":{"$error":"#N/A"}},{"$f":"J114/d_BwAdult","v":{"$error":"#N/A"}}]
[null,"Head",null,{"$f":"E34*i_AbsorpInuse1*$L41/1000","v":{"$error":"#N/A"}},{"$f":"D115/d_BwAdult","v":{"$error":"#N/A"}},{"$f":"G34*i_AbsorpInuse2*$L41/1000","v":{"$error":"#N/A"}},{"$f":"F115/d_BwAdult","v":{"$error":"#N/A"}},{"$f":"I34*i_AbsorpInuse3*$L41/1000","v":{"$error":"#N/A"}},{"$f":"H115/d_BwAdult","v":{"$error":"#N/A"}},{"$f":"K34*i_AbsorpInuse4*$L41/1000","v":{"$error":"#N/A"}},{"$f":"J115/d_BwAdult","v":{"$error":"#N/A"}}]
[null,"Inhalation",null,{"$f":"E37*i_AbsorpInhalation1*$M41/1000","v":{"$error":"#N/A"}},{"$f":"D116/d_BwAdult","v":{"$error":"#N/A"}},{"$f":"G37*i_AbsorpInhalation2*$M41/1000","v":{"$error":"#N/A"}},{"$f":"F116/d_BwAdult","v":{"$error":"#N/A"}},{"$f":"I37*i_AbsorpInhalation3*$M41/1000","v":{"$error":"#N/A"}},{"$f":"H116/d_BwAdult","v":{"$error":"#N/A"}},{"$f":"K37*i_AbsorpInhalation4*$M41/1000","v":{"$error":"#N/A"}},{"$f":"J116/d_BwAdult","v":{"$error":"#N/A"}}]
[null,"Sum ",null,{"$f":"SUM(D113:D116)","v":{"$error":"#N/A"}},{"$f":"D117/d_BwAdult","v":{"$error":"#N/A"}},{"$f":"SUM(F113:F116)","v":{"$error":"#N/A"}},{"$f":"F117/d_BwAdult","v":{"$error":"#N/A"}},{"$f":"SUM(H113:H116)","v":{"$error":"#N/A"}},{"$f":"H117/d_BwAdult","v":{"$error":"#N/A"}},{"$f":"SUM(J113:J116)","v":{"$error":"#N/A"}},{"$f":"J117/d_BwAdult","v":{"$error":"#N/A"}}]

{"sheet":"Operator Spray","index":10,"n_rows":117,"n_cols":16,"rows_kept":117,"cut":false,"hidden":false,"merged":[[54,4,54,5],[87,5,87,6],[87,7,87,8],[71,9,71,10],[55,7,55,8],[57,1,57,2],[55,9,55,10],[61,1,61,2],[78,1,78,2],[80,1,80,2],[66,1,66,2],[67,1,67,2],[68,1,68,2],[69,1,69,2],[71,1,71,2],[56,1,56,2],[58,1,58,2],[64,1,64,2],[65,1,65,2],[59,1,59,2],[60,1,60,2],[62,1,62,2],[83,1,83,2],[103,5,103,6],[92,1,92,2],[87,9,87,10],[71,3,71,4],[63,1,63,2],[81,1,81,2],[87,3,87,4],[79,1,79,2],[72,1,72,2],[82,1,82,2],[71,5,71,6],[71,7,71,8],[103,3,103,4],[88,1,88,2],[84,1,84,2],[73,1,73,2],[74,1,74,2],[75,1,75,2],[76,1,76,2],[77,1,77,2],[103,7,103,8],[103,9,103,10],[89,1,89,2],[90,1,90,2],[116,1,116,2],[105,1,105,2],[106,1,106,2],[107,1,107,2],[108,1,108,2],[109,1,109,2],[114,1,114,2],[115,1,115,2],[111,1,111,2],[112,1,112,2],[113,1,113,2],[104,1,104,2],[110,1,110,2],[93,1,93,2],[94,1,94,2],[95,1,95,2],[96,1,96,2],[99,1,99,2],[100,1,100,2],[101,1,101,2],[97,1,97,2],[98,1,98,2],[91,1,91,2],[1,7,1,8],[2,7,2,8],[2,9,2,10],[1,9,1,10],[10,3,10,10],[3,3,3,4],[4,3,4,4],[5,3,5,4],[6,3,6,10],[7,3,7,10],[8,3,8,10],[9,3,9,10],[3,5,3,6],[4,5,4,6],[5,5,5,6],[53,4,53,5],[55,5,55,6],[55,3,55,4],[1,3,1,4],[2,3,2,4],[1,5,1,6],[2,5,2,6],[43,3,43,4],[24,3,24,4],[25,3,25,4],[26,3,26,4],[29,3,29,4],[29,5,29,6],[28,3,28,4],[28,5,28,6],[39,3,39,4],[40,3,40,4],[49,1,49,12],[51,11,51,12],[3,7,3,8],[4,7,4,8],[5,7,5,8],[50,1,50,2],[51,1,51,2],[13,9,13,10],[13,3,13,4],[13,5,13,6],[13,7,13,8],[41,11,41,12],[43,11,43,12],[48,1,48,2],[47,11,47,12],[14,12,15,12],[43,7,43,8],[43,9,43,10],[29,7,29,8],[28,7,28,8],[46,1,46,2],[47,1,47,2],[11,3,11,10],[3,9,3,10],[4,9,4,10],[5,9,5,10],[12,1,12,12],[45,1,45,12],[31,12,36,12],[14,5,14,6],[14,7,14,8],[14,9,14,10],[29,12,30,12],[29,9,29,10],[29,11,30,11],[14,1,27,1],[14,2,15,2],[14,3,14,4],[14,11,15,11],[27,3,27,4],[28,1,41,1],[29,2,30,2],[38,3,38,4],[37,3,37,4],[41,3,41,4],[28,9,28,10],[43,5,43,6],[23,3,23,4]]}
[null,{"$f":"\"Operator exposure for \"&i_ProductName & \" spray applications\"","v":"Operator exposure for  spray applications"},null,null,null,{"$f":"IF(i_FormVal <> \"Granules, fine granules\",\"\",\"This sheet is only for spray applications\")","v":""}]
[null,null,null,{"$f":"i_SubstName1","v":0},null,{"$f":"i_SubstName2","v":0},null,{"$f":"i_SubstName3","v":0},null,{"$f":"i_SubstName4","v":0}]
[null,"Application rate of active substance",null,{"$f":"i_AppRateAS1","v":0},null,{"$f":"i_AppRateAS2","v":0},null,{"$f":"i_AppRateAS3","v":0},null,{"$f":"i_AppRateAS4","v":0},null,"kg a.s./ha","i_AppRateAS"]
[null,"Amount of active substance applied",null,{"$f":"d_AreaTreated*i_AppRateAS1","v":0},null,{"$f":"d_AreaTreated*i_AppRateAS2","v":0},null,{"$f":"d_AreaTreated*i_AppRateAS3","v":0},null,{"$f":"d_AreaTreated*i_AppRateAS4","v":0},null,"kg a.s./day","i_AmountAS"]
[null,"Dermal absorption of the product",null,{"$f":"i_AbsorpProduct1","v":0},null,{"$f":"i_AbsorpProduct2","v":0},null,{"$f":"i_AbsorpProduct3","v":0},null,{"$f":"i_AbsorpProduct4","v":0},null,null,"i_AbsorpProduct"]
[null,"Dermal absorption of in-use dilution",null,{"$f":"i_AbsorpInuse1","v":0},null,{"$f":"i_AbsorpInuse2","v":0},null,{"$f":"i_AbsorpInuse3","v":0},null,{"$f":"i_AbsorpInuse4","v":0},null,null,"i_AbsorInuse"]
[null,"Formulation type",null,{"$f":"i_FormVal","v":0}]
[null,"Indoor or Outdoor application",null,{"$f":"'Data entry'!D8","v":0}]
[null,"Application method",null,{"$f":"i_AppMeth","v":0}]
[null,"Application equipment",null,{"$f":"i_AppEquip","v":0}]
[null,"Assumed area treated",null,{"$f":"d_AreaTreated","v":1},null,null,null,null,null,null,null,"ha/day","d_AreaTreated"]
[null,"Season",null,{"$f":"i_Season","v":"not relevant"}]
[null,{"$f":"i_IndoorOutdoor&i_FormVal&i_AppMeth&i_AppEquip&IF(AND(i_AppMeth=\"Downward spraying\",i_AppEquip=\"Vehicle-mounted\",Driftreduction=0.5),\"-Drift Reduction\",\"\")","v":""}]
[null,null,null,{"$f":"i_SubstName1","v":0},null,{"$f":"i_SubstName2","v":0},null,{"$f":"i_SubstName3","v":0},null,{"$f":"i_SubstName4","v":0}]
[null,"Mixing and loading","Exposure values ","µg exposure/day mixed and loaded",null,"µg exposure/day mixed and loaded",null,"µg exposure/day mixed and loaded",null,"µg exposure/day mixed and loaded",null,"Reference ","Comment"]
[null,null,null,"75th percentile","95th percentile ","75th percentile","95th percentile ","75th percentile","95th percentile ","75th percentile","95th percentile "]
[null,null,"Hands",{"$f":"IF(ISBLANK(INDEX(ay_OpExAOEM,MATCH(sys_KeyOperator&\"Hands\",key_AOEM,0),10)),10^(INDEX(ay_OpExAOEM,MATCH(sys_KeyOperator&\"Hands\",key_AOEM,0),7)+(LOG(i_AmountAS1)*INDEX(ay_OpExAOEM,MATCH(sys_KeyOperator&\"Hands\",key_AOEM,0),8))+INDEX(ay_OpExAOEM,MATCH(sys_KeyOperator&\"Hands\",key_AOEM,0),9)),MAX(INDEX(ay_OpExAOEM,MATCH(sys_KeyOperator&\"Hands\",key_AOEM,0),10),(INDEX(ay_OpExAOEM,MATCH(sys_KeyOperator&\"Hands\",key_AOEM,0),10)/1.5)*i_AmountAS1))","v":{"$error":"#N/A"}},{"$f":"IF(ISBLANK(INDEX(ay_OpExAOEM,MATCH(sys_KeyOperator&\"Hands\",key_AOEM,0),14)),10^(INDEX(ay_OpExAOEM,MATCH(sys_KeyOperator&\"Hands\",key_AOEM,0),11)+(LOG(i_AmountAS1)*INDEX(ay_OpExAOEM,MATCH(sys_KeyOperator&\"Hands\",key_AOEM,0),12))+INDEX(ay_OpExAOEM,MATCH(sys_KeyOperator&\"Hands\",key_AOEM,0),13)),MAX(INDEX(ay_OpExAOEM,MATCH(sys_KeyOperator&\"Hands\",key_AOEM,0),14),(INDEX(ay_OpExAOEM,MATCH(sys_KeyOperator&\"Hands\",key_AOEM,0),14)/1.5)*i_AmountAS1))","v":{"$error":"#N/A"}},{"$f":"IF(ISBLANK(INDEX(ay_OpExAOEM,MATCH(sys_KeyOperator&\"Hands\",key_AOEM,0),10)),10^(INDEX(ay_OpExAOEM,MATCH(sys_KeyOperator&\"Hands\",key_AOEM,0),7)+(LOG(i_AmountAS2)*INDEX(ay_OpExAOEM,MATCH(sys_KeyOperator&\"Hands\",key_AOEM,0),8))+INDEX(ay_OpExAOEM,MATCH(sys_KeyOperator&\"Hands\",key_AOEM,0),9)),MAX(INDEX(ay_OpExAOEM,MATCH(sys_KeyOperator&\"Hands\",key_AOEM,0),10),(INDEX(ay_OpExAOEM,MATCH(sys_KeyOperator&\"Hands\",key_AOEM,0),10)/1.5)*i_AmountAS2))","v":{"$error":"#N/A"}},{"$f":"IF(ISBLANK(INDEX(ay_OpExAOEM,MATCH(sys_KeyOperator&\"Hands\",key_AOEM,0),14)),10^(INDEX(ay_OpExAOEM,MATCH(sys_KeyOperator&\"Hands\",key_AOEM,0),11)+(LOG(i_AmountAS2)*INDEX(ay_OpExAOEM,MATCH(sys_KeyOperator&\"Hands\",key_AOEM,0),12))+INDEX(ay_OpExAOEM,MATCH(sys_KeyOperator&\"Hands\",key_AOEM,0),13)),MAX(INDEX(ay_OpExAOEM,MATCH(sys_KeyOperator&\"Hands\",key_AOEM,0),14),(INDEX(ay_OpExAOEM,MATCH(sys_KeyOperator&\"Hands\",key_AOEM,0),14)/1.5)*i_AmountAS2))","v":{"$error":"#N/A"}},{"$f":"IF(ISBLANK(INDEX(ay_OpExAOEM,MATCH(sys_KeyOperator&\"Hands\",key_AOEM,0),10)),10^(INDEX(ay_OpExAOEM,MATCH(sys_KeyOperator&\"Hands\",key_AOEM,0),7)+(LOG(i_AmountAS3)*INDEX(ay_OpExAOEM,MATCH(sys_KeyOperator&\"Hands\",key_AOEM,0),8))+INDEX(ay_OpExAOEM,MATCH(sys_KeyOperator&\"Hands\",key_AOEM,0),9)),MAX(INDEX(ay_OpExAOEM,MATCH(sys_KeyOperator&\"Hands\",key_AOEM,0),10),(INDEX(ay_OpExAOEM,MATCH(sys_KeyOperator&\"Hands\",key_AOEM,0),10)/1.5)*i_AmountAS3))","v":{"$error":"#N/A"}},{"$f":"IF(ISBLANK(INDEX(ay_OpExAOEM,MATCH(sys_KeyOperator&\"Hands\",key_AOEM,0),14)), 10^(INDEX(ay_OpExAOEM,MATCH(sys_KeyOperator&\"Hands\",key_AOEM,0),11) +(LOG(i_AmountAS3)*INDEX(ay_OpExAOEM,MATCH(sys_KeyOperator&\"Hands\",key_AOEM,0),12)) +INDEX(ay_OpExAOEM,MATCH(sys_KeyOperator&\"Hands\",key_AOEM,0),13)),MAX(INDEX(ay_OpExAOEM,MATCH(sys_KeyOperator&\"Hands\",key_AOEM,0),14),(INDEX(ay_OpExAOEM,MATCH(sys_KeyOperator&\"Hands\",key_AOEM,0),14) /1.5)*i_AmountAS3))","v":{"$error":"#N/A"}},{"$f":"IF(ISBLANK(INDEX(ay_OpExAOEM,MATCH(sys_KeyOperator&\"Hands\",key_AOEM,0),10)),10^(INDEX(ay_OpExAOEM,MATCH(sys_KeyOperator&\"Hands\",key_AOEM,0),7)+(LOG(i_AmountAS4)*INDEX(ay_OpExAOEM,MATCH(sys_KeyOperator&\"Hands\",key_AOEM,0),8))+INDEX(ay_OpExAOEM,MATCH(sys_KeyOperator&\"Hands\",key_AOEM,0),9)),MAX(INDEX(ay_OpExAOEM,MATCH(sys_KeyOperator&\"Hands\",key_AOEM,0),10),(INDEX(ay_OpExAOEM,MATCH(sys_KeyOperator&\"Hands\",key_AOEM,0),10)/1.5)*i_AmountAS4))","v":{"$error":"#N/A"}},{"$f":"IF(ISBLANK(INDEX(ay_OpExAOEM,MATCH(sys_KeyOperator&\"Hands\",key_AOEM,0),14)),10^(INDEX(ay_OpExAOEM,MATCH(sys_KeyOperator&\"Hands\",key_AOEM,0),11)+(LOG(i_AmountAS4)*INDEX(ay_OpExAOEM,MATCH(sys_KeyOperator&\"Hands\",key_AOEM,0),12))+INDEX(ay_OpExAOEM,MATCH(sys_KeyOperator&\"Hands\",key_AOEM,0),13)),MAX(INDEX(ay_OpExAOEM,MATCH(sys_KeyOperator&\"Hands\",key_AOEM,0),14),(INDEX(ay_OpExAOEM,MATCH(sys_KeyOperator&\"Hands\",key_AOEM,0),14)/1.5)*i_AmountAS4))","v":{"$error":"#N/A"}},"AOEM"]
[null,null,"Body",{"$f":"IF(ISBLANK(INDEX(ay_OpExAOEM,MATCH(sys_KeyOperator&\"Body\",key_AOEM,0),10)),10^(INDEX(ay_OpExAOEM,MATCH(sys_KeyOperator&\"Body\",key_AOEM,0),7)+(LOG(i_AmountAS1)*INDEX(ay_OpExAOEM,MATCH(sys_KeyOperator&\"Body\",key_AOEM,0),8))+INDEX(ay_OpExAOEM,MATCH(sys_KeyOperator&\"Body\",key_AOEM,0),9)),MAX(INDEX(ay_OpExAOEM,MATCH(sys_KeyOperator&\"Body\",key_AOEM,0),10),(INDEX(ay_OpExAOEM,MATCH(sys_KeyOperator&\"Body\",key_AOEM,0),10)/1.5)*i_AmountAS1))","v":{"$error":"#N/A"}},{"$f":"IF(ISBLANK(INDEX(ay_OpExAOEM,MATCH(sys_KeyOperator&\"Body\",key_AOEM,0),14)), 10^(INDEX(ay_OpExAOEM,MATCH(sys_KeyOperator&\"Body\",key_AOEM,0),11) +(LOG(i_AmountAS1)*INDEX(ay_OpExAOEM,MATCH(sys_KeyOperator&\"Body\",key_AOEM,0),12)) +INDEX(ay_OpExAOEM,MATCH(sys_KeyOperator&\"Body\",key_AOEM,0),13)),MAX(INDEX(ay_OpExAOEM,MATCH(sys_KeyOperator&\"Body\",key_AOEM,0),14),(INDEX(ay_OpExAOEM,MATCH(sys_KeyOperator&\"Body\",key_AOEM,0),14) /1.5)*i_AmountAS1))","v":{"$error":"#N/A"}},{"$f":"IF(ISBLANK(INDEX(ay_OpExAOEM,MATCH(sys_KeyOperator&\"Body\",key_AOEM,0),10)),10^(INDEX(ay_OpExAOEM,MATCH(sys_KeyOperator&\"Body\",key_AOEM,0),7)+(LOG(i_AmountAS2)*INDEX(ay_OpExAOEM,MATCH(sys_KeyOperator&\"Body\",key_AOEM,0),8))+INDEX(ay_OpExAOEM,MATCH(sys_KeyOperator&\"Body\",key_AOEM,0),9)),MAX(INDEX(ay_OpExAOEM,MATCH(sys_KeyOperator&\"Body\",key_AOEM,0),10),(INDEX(ay_OpExAOEM,MATCH(sys_KeyOperator&\"Body\",key_AOEM,0),10)/1.5)*i_AmountAS2))","v":{"$error":"#N/A"}},{"$f":"IF(ISBLANK(INDEX(ay_OpExAOEM,MATCH(sys_KeyOperator&\"Body\",key_AOEM,0),14)), 10^(INDEX(ay_OpExAOEM,MATCH(sys_KeyOperator&\"Body\",key_AOEM,0),11) +(LOG(i_AmountAS2)*INDEX(ay_OpExAOEM,MATCH(sys_KeyOperator&\"Body\",key_AOEM,0),12)) +INDEX(ay_OpExAOEM,MATCH(sys_KeyOperator&\"Body\",key_AOEM,0),13)),MAX(INDEX(ay_OpExAOEM,MATCH(sys_KeyOperator&\"Body\",key_AOEM,0),14),(INDEX(ay_OpExAOEM,MATCH(sys_KeyOperator&\"Body\",key_AOEM,0),14) /1.5)*i_AmountAS2))","v":{"$error":"#N/A"}},{"$f":"IF(ISBLANK(INDEX(ay_OpExAOEM,MATCH(sys_KeyOperator&\"Body\",key_AOEM,0),10)),10^(INDEX(ay_OpExAOEM,MATCH(sys_KeyOperator&\"Body\",key_AOEM,0),7)+(LOG(i_AmountAS3)*INDEX(ay_OpExAOEM,MATCH(sys_KeyOperator&\"Body\",key_AOEM,0),8))+INDEX(ay_OpExAOEM,MATCH(sys_KeyOperator&\"Body\",key_AOEM,0),9)),MAX(INDEX(ay_OpExAOEM,MATCH(sys_KeyOperator&\"Body\",key_AOEM,0),10),(INDEX(ay_OpExAOEM,MATCH(sys_KeyOperator&\"Body\",key_AOEM,0),10)/1.5)*i_AmountAS3))","v":{"$error":"#N/A"}},{"$f":"IF(ISBLANK(INDEX(ay_OpExAOEM,MATCH(sys_KeyOperator&\"Body\",key_AOEM,0),14)), 10^(INDEX(ay_OpExAOEM,MATCH(sys_KeyOperator&\"Body\",key_AOEM,0),11) +(LOG(i_AmountAS3)*INDEX(ay_OpExAOEM,MATCH(sys_KeyOperator&\"Body\",key_AOEM,0),12)) +INDEX(ay_OpExAOEM,MATCH(sys_KeyOperator&\"Body\",key_AOEM,0),13)),MAX(INDEX(ay_OpExAOEM,MATCH(sys_KeyOperator&\"Body\",key_AOEM,0),14),(INDEX(ay_OpExAOEM,MATCH(sys_KeyOperator&\"Body\",key_AOEM,0),14) /1.5)*i_AmountAS3))","v":{"$error":"#N/A"}},{"$f":"IF(ISBLANK(INDEX(ay_OpExAOEM,MATCH(sys_KeyOperator&\"Body\",key_AOEM,0),10)),10^(INDEX(ay_OpExAOEM,MATCH(sys_KeyOperator&\"Body\",key_AOEM,0),7)+(LOG(i_AmountAS4)*INDEX(ay_OpExAOEM,MATCH(sys_KeyOperator&\"Body\",key_AOEM,0),8))+INDEX(ay_OpExAOEM,MATCH(sys_KeyOperator&\"Body\",key_AOEM,0),9)),MAX(INDEX(ay_OpExAOEM,MATCH(sys_KeyOperator&\"Body\",key_AOEM,0),10),(INDEX(ay_OpExAOEM,MATCH(sys_KeyOperator&\"Body\",key_AOEM,0),10)/1.5)*i_AmountAS4))","v":{"$error":"#N/A"}},{"$f":"IF(ISBLANK(INDEX(ay_OpExAOEM,MATCH(sys_KeyOperator&\"Body\",key_AOEM,0),14)), 10^(INDEX(ay_OpExAOEM,MATCH(sys_KeyOperator&\"Body\",key_AOEM,0),11) +(LOG(i_AmountAS4)*INDEX(ay_OpExAOEM,MATCH(sys_KeyOperator&\"Body\",key_AOEM,0),12)) +INDEX(ay_OpExAOEM,MATCH(sys_KeyOperator&\"Body\",key_AOEM,0),13)),MAX(INDEX(ay_OpExAOEM,MATCH(sys_KeyOperator&\"Body\",key_AOEM,0),14),(INDEX(ay_OpExAOEM,MATCH(sys_KeyOperator&\"Body\",key_AOEM,0),14) /1.5)*i_AmountAS4))","v":{"$error":"#N/A"}},"AOEM"]
[null,null,"Head",{"$f":"IF(ISBLANK(INDEX(ay_OpExAOEM,MATCH(sys_KeyOperator&\"Head\",key_AOEM,0),10)),10^(INDEX(ay_OpExAOEM,MATCH(sys_KeyOperator&\"Head\",key_AOEM,0),7)+(LOG(i_AmountAS1)*INDEX(ay_OpExAOEM,MATCH(sys_KeyOperator&\"Head\",key_AOEM,0),8))+INDEX(ay_OpExAOEM,MATCH(sys_KeyOperator&\"Head\",key_AOEM,0),9)),MAX(INDEX(ay_OpExAOEM,MATCH(sys_KeyOperator&\"Head\",key_AOEM,0),10),(INDEX(ay_OpExAOEM,MATCH(sys_KeyOperator&\"Head\",key_AOEM,0),10)/1.5)*i_AmountAS1))","v":{"$error":"#N/A"}},{"$f":"IF(ISBLANK(INDEX(ay_OpExAOEM,MATCH(sys_KeyOperator&\"Head\",key_AOEM,0),14)), 10^(INDEX(ay_OpExAOEM,MATCH(sys_KeyOperator&\"Head\",key_AOEM,0),11) +(LOG(i_AmountAS1)*INDEX(ay_OpExAOEM,MATCH(sys_KeyOperator&\"Head\",key_AOEM,0),12)) +INDEX(ay_OpExAOEM,MATCH(sys_KeyOperator&\"Head\",key_AOEM,0),13)),MAX(INDEX(ay_OpExAOEM,MATCH(sys_KeyOperator&\"Head\",key_AOEM,0),14),(INDEX(ay_OpExAOEM,MATCH(sys_KeyOperator&\"Head\",key_AOEM,0),14) /1.5)*i_AmountAS1))","v":{"$error":"#N/A"}},{"$f":"IF(ISBLANK(INDEX(ay_OpExAOEM,MATCH(sys_KeyOperator&\"Head\",key_AOEM,0),10)),10^(INDEX(ay_OpExAOEM,MATCH(sys_KeyOperator&\"Head\",key_AOEM,0),7)+(LOG(i_AmountAS2)*INDEX(ay_OpExAOEM,MATCH(sys_KeyOperator&\"Head\",key_AOEM,0),8))+INDEX(ay_OpExAOEM,MATCH(sys_KeyOperator&\"Head\",key_AOEM,0),9)),MAX(INDEX(ay_OpExAOEM,MATCH(sys_KeyOperator&\"Head\",key_AOEM,0),10),(INDEX(ay_OpExAOEM,MATCH(sys_KeyOperator&\"Head\",key_AOEM,0),10)/1.5)*i_AmountAS2))","v":{"$error":"#N/A"}},{"$f":"IF(ISBLANK(INDEX(ay_OpExAOEM,MATCH(sys_KeyOperator&\"Head\",key_AOEM,0),14)), 10^(INDEX(ay_OpExAOEM,MATCH(sys_KeyOperator&\"Head\",key_AOEM,0),11) +(LOG(i_AmountAS2)*INDEX(ay_OpExAOEM,MATCH(sys_KeyOperator&\"Head\",key_AOEM,0),12)) +INDEX(ay_OpExAOEM,MATCH(sys_KeyOperator&\"Head\",key_AOEM,0),13)),MAX(INDEX(ay_OpExAOEM,MATCH(sys_KeyOperator&\"Head\",key_AOEM,0),14),(INDEX(ay_OpExAOEM,MATCH(sys_KeyOperator&\"Head\",key_AOEM,0),14) /1.5)*i_AmountAS2))","v":{"$error":"#N/A"}},{"$f":"IF(ISBLANK(INDEX(ay_OpExAOEM,MATCH(sys_KeyOperator&\"Head\",key_AOEM,0),10)),10^(INDEX(ay_OpExAOEM,MATCH(sys_KeyOperator&\"Head\",key_AOEM,0),7)+(LOG(i_AmountAS3)*INDEX(ay_OpExAOEM,MATCH(sys_KeyOperator&\"Head\",key_AOEM,0),8))+INDEX(ay_OpExAOEM,MATCH(sys_KeyOperator&\"Head\",key_AOEM,0),9)),MAX(INDEX(ay_OpExAOEM,MATCH(sys_KeyOperator&\"Head\",key_AOEM,0),10),(INDEX(ay_OpExAOEM,MATCH(sys_KeyOperator&\"Head\",key_AOEM,0),10)/1.5)*i_AmountAS3))","v":{"$error":"#N/A"}},{"$f":"IF(ISBLANK(INDEX(ay_OpExAOEM,MATCH(sys_KeyOperator&\"Head\",key_AOEM,0),14)), 10^(INDEX(ay_OpExAOEM,MATCH(sys_KeyOperator&\"Head\",key_AOEM,0),11) +(LOG(i_AmountAS3)*INDEX(ay_OpExAOEM,MATCH(sys_KeyOperator&\"Head\",key_AOEM,0),12)) +INDEX(ay_OpExAOEM,MATCH(sys_KeyOperator&\"Head\",key_AOEM,0),13)),MAX(INDEX(ay_OpExAOEM,MATCH(sys_KeyOperator&\"Head\",key_AOEM,0),14),(INDEX(ay_OpExAOEM,MATCH(sys_KeyOperator&\"Head\",key_AOEM,0),14) /1.5)*i_AmountAS3))","v":{"$error":"#N/A"}},{"$f":"IF(ISBLANK(INDEX(ay_OpExAOEM,MATCH(sys_KeyOperator&\"Head\",key_AOEM,0),10)),10^(INDEX(ay_OpExAOEM,MATCH(sys_KeyOperator&\"Head\",key_AOEM,0),7)+(LOG(i_AmountAS4)*INDEX(ay_OpExAOEM,MATCH(sys_KeyOperator&\"Head\",key_AOEM,0),8))+INDEX(ay_OpExAOEM,MATCH(sys_KeyOperator&\"Head\",key_AOEM,0),9)),MAX(INDEX(ay_OpExAOEM,MATCH(sys_KeyOperator&\"Head\",key_AOEM,0),10),(INDEX(ay_OpExAOEM,MATCH(sys_KeyOperator&\"Head\",key_AOEM,0),10)/1.5)*i_AmountAS4))","v":{"$error":"#N/A"}},{"$f":"IF(ISBLANK(INDEX(ay_OpExAOEM,MATCH(sys_KeyOperator&\"Head\",key_AOEM,0),14)), 10^(INDEX(ay_OpExAOEM,MATCH(sys_KeyOperator&\"Head\",key_AOEM,0),11) +(LOG(i_AmountAS4)*INDEX(ay_OpExAOEM,MATCH(sys_KeyOperator&\"Head\",key_AOEM,0),12)) +INDEX(ay_OpExAOEM,MATCH(sys_KeyOperator&\"Head\",key_AOEM,0),13)),MAX(INDEX(ay_OpExAOEM,MATCH(sys_KeyOperator&\"Head\",key_AOEM,0),14),(INDEX(ay_OpExAOEM,MATCH(sys_KeyOperator&\"Head\",key_AOEM,0),14) /1.5)*i_AmountAS4))","v":{"$error":"#N/A"}},"AOEM"]
[null,null,"Protected hands",{"$f":"IF(ISBLANK(INDEX(ay_OpExAOEM,MATCH(sys_KeyOperator&\"Protected hands\",key_AOEM,0),10)),10^(INDEX(ay_OpExAOEM,MATCH(sys_KeyOperator&\"Protected hands\",key_AOEM,0),7)+(LOG(i_AmountAS1)*INDEX(ay_OpExAOEM,MATCH(sys_KeyOperator&\"Protected hands\",key_AOEM,0),8))+INDEX(ay_OpExAOEM,MATCH(sys_KeyOperator&\"Protected hands\",key_AOEM,0),9)),MAX(INDEX(ay_OpExAOEM,MATCH(sys_KeyOperator&\"Protected hands\",key_AOEM,0),10),(INDEX(ay_OpExAOEM,MATCH(sys_KeyOperator&\"Protected hands\",key_AOEM,0),10)/1.5)*i_AmountAS1))","v":{"$error":"#N/A"}},{"$f":"IF(ISBLANK(INDEX(ay_OpExAOEM,MATCH(sys_KeyOperator&\"Protected Hands\",key_AOEM,0),14)), 10^(INDEX(ay_OpExAOEM,MATCH(sys_KeyOperator&\"Protected Hands\",key_AOEM,0),11) +(LOG(i_AmountAS1)*INDEX(ay_OpExAOEM,MATCH(sys_KeyOperator&\"Protected Hands\",key_AOEM,0),12)) +INDEX(ay_OpExAOEM,MATCH(sys_KeyOperator&\"Protected Hands\",key_AOEM,0),13)),MAX(INDEX(ay_OpExAOEM,MATCH(sys_KeyOperator&\"Protected Hands\",key_AOEM,0),14),(INDEX(ay_OpExAOEM,MATCH(sys_KeyOperator&\"Protected Hands\",key_AOEM,0),14) /1.5)*i_AmountAS1))","v":{"$error":"#N/A"}},{"$f":"IF(ISBLANK(INDEX(ay_OpExAOEM,MATCH(sys_KeyOperator&\"Protected hands\",key_AOEM,0),10)),10^(INDEX(ay_OpExAOEM,MATCH(sys_KeyOperator&\"Protected hands\",key_AOEM,0),7)+(LOG(i_AmountAS2)*INDEX(ay_OpExAOEM,MATCH(sys_KeyOperator&\"Protected hands\",key_AOEM,0),8))+INDEX(ay_OpExAOEM,MATCH(sys_KeyOperator&\"Protected hands\",key_AOEM,0),9)),MAX(INDEX(ay_OpExAOEM,MATCH(sys_KeyOperator&\"Protected hands\",key_AOEM,0),10),(INDEX(ay_OpExAOEM,MATCH(sys_KeyOperator&\"Protected hands\",key_AOEM,0),10)/1.5)*i_AmountAS2))","v":{"$error":"#N/A"}},{"$f":"IF(ISBLANK(INDEX(ay_OpExAOEM,MATCH(sys_KeyOperator&\"Protected Hands\",key_AOEM,0),14)), 10^(INDEX(ay_OpExAOEM,MATCH(sys_KeyOperator&\"Protected Hands\",key_AOEM,0),11) +(LOG(i_AmountAS2)*INDEX(ay_OpExAOEM,MATCH(sys_KeyOperator&\"Protected Hands\",key_AOEM,0),12)) +INDEX(ay_OpExAOEM,MATCH(sys_KeyOperator&\"Protected Hands\",key_AOEM,0),13)),MAX(INDEX(ay_OpExAOEM,MATCH(sys_KeyOperator&\"Protected Hands\",key_AOEM,0),14),(INDEX(ay_OpExAOEM,MATCH(sys_KeyOperator&\"Protected Hands\",key_AOEM,0),14) /1.5)*i_AmountAS2))","v":{"$error":"#N/A"}},{"$f":"IF(ISBLANK(INDEX(ay_OpExAOEM,MATCH(sys_KeyOperator&\"Protected hands\",key_AOEM,0),10)),10^(INDEX(ay_OpExAOEM,MATCH(sys_KeyOperator&\"Protected hands\",key_AOEM,0),7)+(LOG(i_AmountAS3)*INDEX(ay_OpExAOEM,MATCH(sys_KeyOperator&\"Protected hands\",key_AOEM,0),8))+INDEX(ay_OpExAOEM,MATCH(sys_KeyOperator&\"Protected hands\",key_AOEM,0),9)),MAX(INDEX(ay_OpExAOEM,MATCH(sys_KeyOperator&\"Protected hands\",key_AOEM,0),10),(INDEX(ay_OpExAOEM,MATCH(sys_KeyOperator&\"Protected hands\",key_AOEM,0),10)/1.5)*i_AmountAS3))","v":{"$error":"#N/A"}},{"$f":"IF(ISBLANK(INDEX(ay_OpExAOEM,MATCH(sys_KeyOperator&\"Protected Hands\",key_AOEM,0),14)), 10^(INDEX(ay_OpExAOEM,MATCH(sys_KeyOperator&\"Protected Hands\",key_AOEM,0),11) +(LOG(i_AmountAS3)*INDEX(ay_OpExAOEM,MATCH(sys_KeyOperator&\"Protected Hands\",key_AOEM,0),12)) +INDEX(ay_OpExAOEM,MATCH(sys_KeyOperator&\"Protected Hands\",key_AOEM,0),13)),MAX(INDEX(ay_OpExAOEM,MATCH(sys_KeyOperator&\"Protected Hands\",key_AOEM,0),14),(INDEX(ay_OpExAOEM,MATCH(sys_KeyOperator&\"Protected Hands\",key_AOEM,0),14) /1.5)*i_AmountAS3))","v":{"$error":"#N/A"}},{"$f":"IF(ISBLANK(INDEX(ay_OpExAOEM,MATCH(sys_KeyOperator&\"Protected hands\",key_AOEM,0),10)),10^(INDEX(ay_OpExAOEM,MATCH(sys_KeyOperator&\"Protected hands\",key_AOEM,0),7)+(LOG(i_AmountAS4)*INDEX(ay_OpExAOEM,MATCH(sys_KeyOperator&\"Protected hands\",key_AOEM,0),8))+INDEX(ay_OpExAOEM,MATCH(sys_KeyOperator&\"Protected hands\",key_AOEM,0),9)),MAX(INDEX(ay_OpExAOEM,MATCH(sys_KeyOperator&\"Protected hands\",key_AOEM,0),10),(INDEX(ay_OpExAOEM,MATCH(sys_KeyOperator&\"Protected hands\",key_AOEM,0),10)/1.5)*i_AmountAS4))","v":{"$error":"#N/A"}},{"$f":"IF(ISBLANK(INDEX(ay_OpExAOEM,MATCH(sys_KeyOperator&\"Protected Hands\",key_AOEM,0),14)), 10^(INDEX(ay_OpExAOEM,MATCH(sys_KeyOperator&\"Protected Hands\",key_AOEM,0),11) +(LOG(i_AmountAS4)*INDEX(ay_OpExAOEM,MATCH(sys_KeyOperator&\"Protected Hands\",key_AOEM,0),12)) +INDEX(ay_OpExAOEM,MATCH(sys_KeyOperator&\"Protected Hands\",key_AOEM,0),13)),MAX(INDEX(ay_OpExAOEM,MATCH(sys_KeyOperator&\"Protected Hands\",key_AOEM,0),14),(INDEX(ay_OpExAOEM,MATCH(sys_KeyOperator&\"Protected Hands\",key_AOEM,0),14) /1.5)*i_AmountAS4))","v":{"$error":"#N/A"}},"AOEM"]
[null,null,"Protected body",{"$f":"IF(ISBLANK(INDEX(ay_OpExAOEM,MATCH(sys_KeyOperator&\"Protected Body\",key_AOEM,0),10)),10^(INDEX(ay_OpExAOEM,MATCH(sys_KeyOperator&\"Protected Body\",key_AOEM,0),7)+(LOG(i_AmountAS1)*INDEX(ay_OpExAOEM,MATCH(sys_KeyOperator&\"Protected Body\",key_AOEM,0),8))+INDEX(ay_OpExAOEM,MATCH(sys_KeyOperator&\"Protected Body\",key_AOEM,0),9)),MAX(INDEX(ay_OpExAOEM,MATCH(sys_KeyOperator&\"Protected Body\",key_AOEM,0),10),(INDEX(ay_OpExAOEM,MATCH(sys_KeyOperator&\"Protected Body\",key_AOEM,0),10)/1.5)*i_AmountAS1))","v":{"$error":"#N/A"}},{"$f":"IF(ISBLANK(INDEX(ay_OpExAOEM,MATCH(sys_KeyOperator&\"Protected Body\",key_AOEM,0),14)), 10^(INDEX(ay_OpExAOEM,MATCH(sys_KeyOperator&\"Protected Body\",key_AOEM,0),11) +(LOG(i_AmountAS1)*INDEX(ay_OpExAOEM,MATCH(sys_KeyOperator&\"Protected Body\",key_AOEM,0),12)) +INDEX(ay_OpExAOEM,MATCH(sys_KeyOperator&\"Protected Body\",key_AOEM,0),13)),MAX(INDEX(ay_OpExAOEM,MATCH(sys_KeyOperator&\"Protected Body\",key_AOEM,0),14),(INDEX(ay_OpExAOEM,MATCH(sys_KeyOperator&\"Protected Body\",key_AOEM,0),14) /1.5)*i_AmountAS1))","v":{"$error":"#N/A"}},{"$f":"IF(ISBLANK(INDEX(ay_OpExAOEM,MATCH(sys_KeyOperator&\"Protected Body\",key_AOEM,0),10)),10^(INDEX(ay_OpExAOEM,MATCH(sys_KeyOperator&\"Protected Body\",key_AOEM,0),7)+(LOG(i_AmountAS2)*INDEX(ay_OpExAOEM,MATCH(sys_KeyOperator&\"Protected Body\",key_AOEM,0),8))+INDEX(ay_OpExAOEM,MATCH(sys_KeyOperator&\"Protected Body\",key_AOEM,0),9)),MAX(INDEX(ay_OpExAOEM,MATCH(sys_KeyOperator&\"Protected Body\",key_AOEM,0),10),(INDEX(ay_OpExAOEM,MATCH(sys_KeyOperator&\"Protected Body\",key_AOEM,0),10)/1.5)*i_AmountAS2))","v":{"$error":"#N/A"}},{"$f":"IF(ISBLANK(INDEX(ay_OpExAOEM,MATCH(sys_KeyOperator&\"Protected Body\",key_AOEM,0),14)), 10^(INDEX(ay_OpExAOEM,MATCH(sys_KeyOperator&\"Protected Body\",key_AOEM,0),11) +(LOG(i_AmountAS2)*INDEX(ay_OpExAOEM,MATCH(sys_KeyOperator&\"Protected Body\",key_AOEM,0),12)) +INDEX(ay_OpExAOEM,MATCH(sys_KeyOperator&\"Protected Body\",key_AOEM,0),13)),MAX(INDEX(ay_OpExAOEM,MATCH(sys_KeyOperator&\"Protected Body\",key_AOEM,0),14),(INDEX(ay_OpExAOEM,MATCH(sys_KeyOperator&\"Protected Body\",key_AOEM,0),14) /1.5)*i_AmountAS2))","v":{"$error":"#N/A"}},{"$f":"IF(ISBLANK(INDEX(ay_OpExAOEM,MATCH(sys_KeyOperator&\"Protected Body\",key_AOEM,0),10)),10^(INDEX(ay_OpExAOEM,MATCH(sys_KeyOperator&\"Protected Body\",key_AOEM,0),7)+(LOG(i_AmountAS3)*INDEX(ay_OpExAOEM,MATCH(sys_KeyOperator&\"Protected Body\",key_AOEM,0),8))+INDEX(ay_OpExAOEM,MATCH(sys_KeyOperator&\"Protected Body\",key_AOEM,0),9)),MAX(INDEX(ay_OpExAOEM,MATCH(sys_KeyOperator&\"Protected Body\",key_AOEM,0),10),(INDEX(ay_OpExAOEM,MATCH(sys_KeyOperator&\"Protected Body\",key_AOEM,0),10)/1.5)*i_AmountAS3))","v":{"$error":"#N/A"}},{"$f":"IF(ISBLANK(INDEX(ay_OpExAOEM,MATCH(sys_KeyOperator&\"Protected Body\",key_AOEM,0),14)), 10^(INDEX(ay_OpExAOEM,MATCH(sys_KeyOperator&\"Protected Body\",key_AOEM,0),11) +(LOG(i_AmountAS3)*INDEX(ay_OpExAOEM,MATCH(sys_KeyOperator&\"Protected Body\",key_AOEM,0),12)) +INDEX(ay_OpExAOEM,MATCH(sys_KeyOperator&\"Protected Body\",key_AOEM,0),13)),MAX(INDEX(ay_OpExAOEM,MATCH(sys_KeyOperator&\"Protected Body\",key_AOEM,0),14),(INDEX(ay_OpExAOEM,MATCH(sys_KeyOperator&\"Protected Body\",key_AOEM,0),14) /1.5)*i_AmountAS3))","v":{"$error":"#N/A"}},{"$f":"IF(ISBLANK(INDEX(ay_OpExAOEM,MATCH(sys_KeyOperator&\"Protected Body\",key_AOEM,0),10)),10^(INDEX(ay_OpExAOEM,MATCH(sys_KeyOperator&\"Protected Body\",key_AOEM,0),7)+(LOG(i_AmountAS4)*INDEX(ay_OpExAOEM,MATCH(sys_KeyOperator&\"Protected Body\",key_AOEM,0),8))+INDEX(ay_OpExAOEM,MATCH(sys_KeyOperator&\"Protected Body\",key_AOEM,0),9)),MAX(INDEX(ay_OpExAOEM,MATCH(sys_KeyOperator&\"Protected Body\",key_AOEM,0),10),(INDEX(ay_OpExAOEM,MATCH(sys_KeyOperator&\"Protected Body\",key_AOEM,0),10)/1.5)*i_AmountAS4))","v":{"$error":"#N/A"}},{"$f":"IF(ISBLANK(INDEX(ay_OpExAOEM,MATCH(sys_KeyOperator&\"Protected Body\",key_AOEM,0),14)), 10^(INDEX(ay_OpExAOEM,MATCH(sys_KeyOperator&\"Protected Body\",key_AOEM,0),11) +(LOG(i_AmountAS4)*INDEX(ay_OpExAOEM,MATCH(sys_KeyOperator&\"Protected Body\",key_AOEM,0),12)) +INDEX(ay_OpExAOEM,MATCH(sys_KeyOperator&\"Protected Body\",key_AOEM,0),13)),MAX(INDEX(ay_OpExAOEM,MATCH(sys_KeyOperator&\"Protected Body\",key_AOEM,0),14),(INDEX(ay_OpExAOEM,MATCH(sys_KeyOperator&\"Protected Body\",key_AOEM,0),14) /1.5)*i_AmountAS4))","v":{"$error":"#N/A"}},"AOEM"]
[null,null,"Protected head",{"$f":"IF(ISBLANK(INDEX(ay_OpExAOEM,MATCH(sys_KeyOperator&\"Head\",key_AOEM,0),10)),10^(INDEX(ay_OpExAOEM,MATCH(sys_KeyOperator&\"Head\",key_AOEM,0),7)+(LOG(i_AmountAS1)*INDEX(ay_OpExAOEM,MATCH(sys_KeyOperator&\"Head\",key_AOEM,0),8))+INDEX(ay_OpExAOEM,MATCH(sys_KeyOperator&\"Head\",key_AOEM,0),9)+ d_head75ProtectionFactor),MAX(INDEX(ay_OpExAOEM,MATCH(sys_KeyOperator&\"Head\",key_AOEM,0),10),(INDEX(ay_OpExAOEM,MATCH(sys_KeyOperator&\"Head\",key_AOEM,0),10)/1.5)*i_AmountAS1))*IF(ISNUMBER(Hole_F25),Hole_F25,1)","v":{"$error":"#N/A"}},{"$f":"IF(ISBLANK(INDEX(ay_OpExAOEM,MATCH(sys_KeyOperator&\"Head\",key_AOEM,0),14)), 10^(INDEX(ay_OpExAOEM,MATCH(sys_KeyOperator&\"Head\",key_AOEM,0),11) +(LOG(i_AmountAS1)*INDEX(ay_OpExAOEM,MATCH(sys_KeyOperator&\"Head\",key_AOEM,0),12)) +INDEX(ay_OpExAOEM,MATCH(sys_KeyOperator&\"Head\",key_AOEM,0),13)+ d_head95ProtectionFactor),MAX(INDEX(ay_OpExAOEM,MATCH(sys_KeyOperator&\"Head\",key_AOEM,0),14),(INDEX(ay_OpExAOEM,MATCH(sys_KeyOperator&\"Head\",key_AOEM,0),14) /1.5)*i_AmountAS1))*IF(ISNUMBER(Hole_F25),Hole_F25,1)","v":{"$error":"#N/A"}},{"$f":"IF(ISBLANK(INDEX(ay_OpExAOEM,MATCH(sys_KeyOperator&\"Head\",key_AOEM,0),10)),10^(INDEX(ay_OpExAOEM,MATCH(sys_KeyOperator&\"Head\",key_AOEM,0),7)+(LOG(i_AmountAS2)*INDEX(ay_OpExAOEM,MATCH(sys_KeyOperator&\"Head\",key_AOEM,0),8))+INDEX(ay_OpExAOEM,MATCH(sys_KeyOperator&\"Head\",key_AOEM,0),9)  + d_head75ProtectionFactor  ),MAX(INDEX(ay_OpExAOEM,MATCH(sys_KeyOperator&\"Head\",key_AOEM,0),10),(INDEX(ay_OpExAOEM,MATCH(sys_KeyOperator&\"Head\",key_AOEM,0),10)/1.5)*i_AmountAS2))*IF(ISNUMBER(Hole_F25),Hole_F25,1)","v":{"$error":"#N/A"}},{"$f":"IF(ISBLANK(INDEX(ay_OpExAOEM,MATCH(sys_KeyOperator&\"Head\",key_AOEM,0),14)), 10^(INDEX(ay_OpExAOEM,MATCH(sys_KeyOperator&\"Head\",key_AOEM,0),11) +(LOG(i_AmountAS2)*INDEX(ay_OpExAOEM,MATCH(sys_KeyOperator&\"Head\",key_AOEM,0),12)) +INDEX(ay_OpExAOEM,MATCH(sys_KeyOperator&\"Head\",key_AOEM,0),13)+ d_head95ProtectionFactor),MAX(INDEX(ay_OpExAOEM,MATCH(sys_KeyOperator&\"Head\",key_AOEM,0),14),(INDEX(ay_OpExAOEM,MATCH(sys_KeyOperator&\"Head\",key_AOEM,0),14) /1.5)*i_AmountAS2))*IF(ISNUMBER(Hole_F25),Hole_F25,1)","v":{"$error":"#N/A"}},{"$f":"IF(ISBLANK(INDEX(ay_OpExAOEM,MATCH(sys_KeyOperator&\"Head\",key_AOEM,0),10)),10^(INDEX(ay_OpExAOEM,MATCH(sys_KeyOperator&\"Head\",key_AOEM,0),7)+(LOG(i_AmountAS3)*INDEX(ay_OpExAOEM,MATCH(sys_KeyOperator&\"Head\",key_AOEM,0),8))+INDEX(ay_OpExAOEM,MATCH(sys_KeyOperator&\"Head\",key_AOEM,0),9)  + d_head75ProtectionFactor  ),MAX(INDEX(ay_OpExAOEM,MATCH(sys_KeyOperator&\"Head\",key_AOEM,0),10),(INDEX(ay_OpExAOEM,MATCH(sys_KeyOperator&\"Head\",key_AOEM,0),10)/1.5)*i_AmountAS3))*IF(ISNUMBER(Hole_F25),Hole_F25,1)","v":{"$error":"#N/A"}},{"$f":"IF(ISBLANK(INDEX(ay_OpExAOEM,MATCH(sys_KeyOperator&\"Head\",key_AOEM,0),14)), 10^(INDEX(ay_OpExAOEM,MATCH(sys_KeyOperator&\"Head\",key_AOEM,0),11) +(LOG(i_AmountAS3)*INDEX(ay_OpExAOEM,MATCH(sys_KeyOperator&\"Head\",key_AOEM,0),12)) +INDEX(ay_OpExAOEM,MATCH(sys_KeyOperator&\"Head\",key_AOEM,0),13)+ d_head95ProtectionFactor),MAX(INDEX(ay_OpExAOEM,MATCH(sys_KeyOperator&\"Head\",key_AOEM,0),14),(INDEX(ay_OpExAOEM,MATCH(sys_KeyOperator&\"Head\",key_AOEM,0),14) /1.5)*i_AmountAS3))*IF(ISNUMBER(Hole_F25),Hole_F25,1)","v":{"$error":"#N/A"}},{"$f":"IF(ISBLANK(INDEX(ay_OpExAOEM,MATCH(sys_KeyOperator&\"Head\",key_AOEM,0),10)),10^(INDEX(ay_OpExAOEM,MATCH(sys_KeyOperator&\"Head\",key_AOEM,0),7)+(LOG(i_AmountAS4)*INDEX(ay_OpExAOEM,MATCH(sys_KeyOperator&\"Head\",key_AOEM,0),8))+INDEX(ay_OpExAOEM,MATCH(sys_KeyOperator&\"Head\",key_AOEM,0),9)  + d_head75ProtectionFactor  ),MAX(INDEX(ay_OpExAOEM,MATCH(sys_KeyOperator&\"Head\",key_AOEM,0),10),(INDEX(ay_OpExAOEM,MATCH(sys_KeyOperator&\"Head\",key_AOEM,0),10)/1.5)*i_AmountAS4))*IF(ISNUMBER(Hole_F25),Hole_F25,1)","v":{"$error":"#N/A"}},{"$f":"IF(ISBLANK(INDEX(ay_OpExAOEM,MATCH(sys_KeyOperator&\"Head\",key_AOEM,0),14)), 10^(INDEX(ay_OpExAOEM,MATCH(sys_KeyOperator&\"Head\",key_AOEM,0),11) +(LOG(i_AmountAS4)*INDEX(ay_OpExAOEM,MATCH(sys_KeyOperator&\"Head\",key_AOEM,0),12)) +INDEX(ay_OpExAOEM,MATCH(sys_KeyOperator&\"Head\",key_AOEM,0),13)+ d_head95ProtectionFactor),MAX(INDEX(ay_OpExAOEM,MATCH(sys_KeyOperator&\"Head\",key_AOEM,0),14),(INDEX(ay_OpExAOEM,MATCH(sys_KeyOperator&\"Head\",key_AOEM,0),14) /1.5)*i_AmountAS4))*IF(ISNUMBER(Hole_F25),Hole_F25,1)","v":{"$error":"#N/A"}},"AOEM"]
[null,null,"Inhalation",{"$f":"IF(ISBLANK(INDEX(ay_OpExAOEM,MATCH(sys_KeyOperator&\"Inhalation\",key_AOEM,0),10)),10^(INDEX(ay_OpExAOEM,MATCH(sys_KeyOperator&\"Inhalation\",key_AOEM,0),7)+(LOG(i_AmountAS1)*INDEX(ay_OpExAOEM,MATCH(sys_KeyOperator&\"Inhalation\",key_AOEM,0),8))+INDEX(ay_OpExAOEM,MATCH(sys_KeyOperator&\"Inhalation\",key_AOEM,0),9)),MAX(INDEX(ay_OpExAOEM,MATCH(sys_KeyOperator&\"Inhalation\",key_AOEM,0),10),(INDEX(ay_OpExAOEM,MATCH(sys_KeyOperator&\"Inhalation\",key_AOEM,0),10)/1.5)*i_AmountAS1))","v":{"$error":"#N/A"}},{"$f":"IF(ISBLANK(INDEX(ay_OpExAOEM,MATCH(sys_KeyOperator&\"Inhalation\",key_AOEM,0),14)), 10^(INDEX(ay_OpExAOEM,MATCH(sys_KeyOperator&\"Inhalation\",key_AOEM,0),11) +(LOG(i_AmountAS1)*INDEX(ay_OpExAOEM,MATCH(sys_KeyOperator&\"Inhalation\",key_AOEM,0),12)) +INDEX(ay_OpExAOEM,MATCH(sys_KeyOperator&\"Inhalation\",key_AOEM,0),13)),MAX(INDEX(ay_OpExAOEM,MATCH(sys_KeyOperator&\"Inhalation\",key_AOEM,0),14),(INDEX(ay_OpExAOEM,MATCH(sys_KeyOperator&\"Inhalation\",key_AOEM,0),14) /1.5)*i_AmountAS1))","v":{"$error":"#N/A"}},{"$f":"IF(ISBLANK(INDEX(ay_OpExAOEM,MATCH(sys_KeyOperator&\"Inhalation\",key_AOEM,0),10)),10^(INDEX(ay_OpExAOEM,MATCH(sys_KeyOperator&\"Inhalation\",key_AOEM,0),7)+(LOG(i_AmountAS2)*INDEX(ay_OpExAOEM,MATCH(sys_KeyOperator&\"Inhalation\",key_AOEM,0),8))+INDEX(ay_OpExAOEM,MATCH(sys_KeyOperator&\"Inhalation\",key_AOEM,0),9)),MAX(INDEX(ay_OpExAOEM,MATCH(sys_KeyOperator&\"Inhalation\",key_AOEM,0),10),(INDEX(ay_OpExAOEM,MATCH(sys_KeyOperator&\"Inhalation\",key_AOEM,0),10)/1.5)*i_AmountAS2))","v":{"$error":"#N/A"}},{"$f":"IF(ISBLANK(INDEX(ay_OpExAOEM,MATCH(sys_KeyOperator&\"Inhalation\",key_AOEM,0),14)), 10^(INDEX(ay_OpExAOEM,MATCH(sys_KeyOperator&\"Inhalation\",key_AOEM,0),11) +(LOG(i_AmountAS2)*INDEX(ay_OpExAOEM,MATCH(sys_KeyOperator&\"Inhalation\",key_AOEM,0),12)) +INDEX(ay_OpExAOEM,MATCH(sys_KeyOperator&\"Inhalation\",key_AOEM,0),13)),MAX(INDEX(ay_OpExAOEM,MATCH(sys_KeyOperator&\"Inhalation\",key_AOEM,0),14),(INDEX(ay_OpExAOEM,MATCH(sys_KeyOperator&\"Inhalation\",key_AOEM,0),14) /1.5)*i_AmountAS2))","v":{"$error":"#N/A"}},{"$f":"IF(ISBLANK(INDEX(ay_OpExAOEM,MATCH(sys_KeyOperator&\"Inhalation\",key_AOEM,0),10)),10^(INDEX(ay_OpExAOEM,MATCH(sys_KeyOperator&\"Inhalation\",key_AOEM,0),7)+(LOG(i_AmountAS3)*INDEX(ay_OpExAOEM,MATCH(sys_KeyOperator&\"Inhalation\",key_AOEM,0),8))+INDEX(ay_OpExAOEM,MATCH(sys_KeyOperator&\"Inhalation\",key_AOEM,0),9)),MAX(INDEX(ay_OpExAOEM,MATCH(sys_KeyOperator&\"Inhalation\",key_AOEM,0),10),(INDEX(ay_OpExAOEM,MATCH(sys_KeyOperator&\"Inhalation\",key_AOEM,0),10)/1.5)*i_AmountAS3))","v":{"$error":"#N/A"}},{"$f":"IF(ISBLANK(INDEX(ay_OpExAOEM,MATCH(sys_KeyOperator&\"Inhalation\",key_AOEM,0),14)), 10^(INDEX(ay_OpExAOEM,MATCH(sys_KeyOperator&\"Inhalation\",key_AOEM,0),11) +(LOG(i_AmountAS3)*INDEX(ay_OpExAOEM,MATCH(sys_KeyOperator&\"Inhalation\",key_AOEM,0),12)) +INDEX(ay_OpExAOEM,MATCH(sys_KeyOperator&\"Inhalation\",key_AOEM,0),13)),MAX(INDEX(ay_OpExAOEM,MATCH(sys_KeyOperator&\"Inhalation\",key_AOEM,0),14),(INDEX(ay_OpExAOEM,MATCH(sys_KeyOperator&\"Inhalation\",key_AOEM,0),14) /1.5)*i_AmountAS3))","v":{"$error":"#N/A"}},{"$f":"IF(ISBLANK(INDEX(ay_OpExAOEM,MATCH(sys_KeyOperator&\"Inhalation\",key_AOEM,0),10)),10^(INDEX(ay_OpExAOEM,MATCH(sys_KeyOperator&\"Inhalation\",key_AOEM,0),7)+(LOG(i_AmountAS4)*INDEX(ay_OpExAOEM,MATCH(sys_KeyOperator&\"Inhalation\",key_AOEM,0),8))+INDEX(ay_OpExAOEM,MATCH(sys_KeyOperator&\"Inhalation\",key_AOEM,0),9)),MAX(INDEX(ay_OpExAOEM,MATCH(sys_KeyOperator&\"Inhalation\",key_AOEM,0),10),(INDEX(ay_OpExAOEM,MATCH(sys_KeyOperator&\"Inhalation\",key_AOEM,0),10)/1.5)*i_AmountAS4))","v":{"$error":"#N/A"}},{"$f":"IF(ISBLANK(INDEX(ay_OpExAOEM,MATCH(sys_KeyOperator&\"Inhalation\",key_AOEM,0),14)), 10^(INDEX(ay_OpExAOEM,MATCH(sys_KeyOperator&\"Inhalation\",key_AOEM,0),11) +(LOG(i_AmountAS4)*INDEX(ay_OpExAOEM,MATCH(sys_KeyOperator&\"Inhalation\",key_AOEM,0),12)) +INDEX(ay_OpExAOEM,MATCH(sys_KeyOperator&\"Inhalation\",key_AOEM,0),13)),MAX(INDEX(ay_OpExAOEM,MATCH(sys_KeyOperator&\"Inhalation\",key_AOEM,0),14),(INDEX(ay_OpExAOEM,MATCH(sys_KeyOperator&\"Inhalation\",key_AOEM,0),14) /1.5)*i_AmountAS4))","v":{"$error":"#N/A"}},"AOEM"]
[null,null,"Protective Equipment","Select for inclusion",null,null,null,null,null,null,null,"Penetration factor","Inhalation Protection factor"]
[null,null,"Gloves","No",null,null,null,null,null,null,null,{"$f":"IF(D25=\"Yes\",\"Incl. in AOEM model\",\"\")","v":""}]
[null,null,"Clothing","Work wear - arms, body and legs covered",null,null,null,null,null,null,null,"Incl. in AOEM model"]
[null,null,"Head and respiratory PPE","None",null,null,null,null,null,null,null,{"$f":"IF(AND(i_AppEquip<>\"Manual-Knapsack\",D27=\"Face shield\"),\"Incl. in AOEM model\",INDEX(ay_MixPPEHead,MATCH(D27,key_MixPPEHead,0),2))","v":1},{"$f":"IF(OR(D27=\"Hood and face shield\",D27=\"Hood\",D27=\"Face shield\"),1,INDEX(ay_MixRPE,MATCH(D27,key_MixRPE,0),2))","v":1}]
[null,null,"Water soluble bag","No",null,null,null,null,null,null,null,{"$f":"IF(AND(D28=\"Yes\"),0.1,1)","v":1}]
[null,"Application",null,{"$f":"i_SubstName1","v":0},null,{"$f":"i_SubstName2","v":0},null,{"$f":"i_SubstName3","v":0},null,{"$f":"i_SubstName4","v":0}]
[null,null,"Exposure values ","µg exposure/day applied",null,"µg exposure/day applied",null,"µg exposure/day applied",null,"µg exposure/day applied",null,"Reference ","Comment"]
[null,null,null,"75th percentile","95th percentile ","75th percentile","95th percentile ","75th percentile","95th percentile ","75th percentile","95th percentile "]
[null,null,"Hands",{"$f":"IF(i_AppEquip=\"Manual-Trolley\",Trolley!D35+MHH!D35,IF(ISBLANK(INDEX(ay_OpExAOEM,MATCH(sys_KeyOperator&\"Hands\",key_AOEM,0),18)),10^(INDEX(ay_OpExAOEM,MATCH(sys_KeyOperator&\"Hands\",key_AOEM,0),15)+(LOG(i_AmountAS1)*INDEX(ay_OpExAOEM,MATCH(sys_KeyOperator&\"Hands\",key_AOEM,0),16))+ IF(AND(i_AppMeth=\"Upward spraying\",LEFT(i_AppEquip,15)=\"Vehicle-mounted\",d_AppPfCaBfR = \"Yes\"),0,IF(AND(i_Season = \"late (dense foliage)\",i_AppMeth=\"Upward spraying\",OR(i_AppEquip=\"Manual-Hand held\",i_AppEquip=\"Manual-Knapsack\")),0,INDEX(ay_OpExAOEM,MATCH(sys_KeyOperator&\"Hands\",key_AOEM,0),17)))),MAX(INDEX(ay_OpExAOEM,MATCH(sys_KeyOperator&\"Hands\",key_AOEM,0),18),(INDEX(ay_OpExAOEM,MATCH(sys_KeyOperator&\"Hands\",key_AOEM,0),18)/d_PctExtrapolation)*i_AmountAS1)))","v":{"$error":"#N/A"}},{"$f":"IF(i_AppEquip=\"Manual-Trolley\",Trolley!E32+MHH!E32,IF(ISBLANK(INDEX(ay_OpExAOEM,MATCH(sys_KeyOperator&\"Hands\",key_AOEM,0),22)),10^(INDEX(ay_OpExAOEM,MATCH(sys_KeyOperator&\"Hands\",key_AOEM,0),19)+(LOG(i_AmountAS1)*INDEX(ay_OpExAOEM,MATCH(sys_KeyOperator&\"Hands\",key_AOEM,0),20))+IF(AND(i_AppMeth=\"Upward spraying\",LEFT(i_AppEquip,15)=\"Vehicle-mounted\",d_AppPfCaBfR=\"Yes\"),0,IF(AND(i_Season=\"late (dense foliage)\",i_AppMeth=\"Upward spraying\",OR(i_AppEquip=\"Manual-Hand held\",i_AppEquip=\"Manual-Knapsack\")),0,INDEX(ay_OpExAOEM,MATCH(sys_KeyOperator&\"Hands\",key_AOEM,0),21)))),MAX(INDEX(ay_OpExAOEM,MATCH(sys_KeyOperator&\"Hands\",key_AOEM,0),22),(INDEX(ay_OpExAOEM,MATCH(sys_KeyOperator&\"Hands\",key_AOEM,0),22)/d_PctExtrapolation)*i_AmountAS1)))","v":{"$error":"#N/A"}},{"$f":"IF(i_AppEquip=\"Manual-Trolley\",Trolley!F32+MHH!F32,IF(ISBLANK(INDEX(ay_OpExAOEM,MATCH(sys_KeyOperator&\"Hands\",key_AOEM,0),18)),10^(INDEX(ay_OpExAOEM,MATCH(sys_KeyOperator&\"Hands\",key_AOEM,0),15)+(LOG(i_AmountAS2)*INDEX(ay_OpExAOEM,MATCH(sys_KeyOperator&\"Hands\",key_AOEM,0),16))+  IF(AND(i_AppMeth=\"Upward spraying\",LEFT(i_AppEquip,15)=\"Vehicle-mounted\",d_AppPfCaBfR = \"Yes\"),0,IF(AND(i_Season = \"late (dense foliage)\",i_AppMeth=\"Upward spraying\",OR(i_AppEquip=\"Manual-Hand held\",i_AppEquip=\"Manual-Knapsack\")),0,INDEX(ay_OpExAOEM,MATCH(sys_KeyOperator&\"Hands\",key_AOEM,0),17)))   ),MAX(INDEX(ay_OpExAOEM,MATCH(sys_KeyOperator&\"Hands\",key_AOEM,0),18),(INDEX(ay_OpExAOEM,MATCH(sys_KeyOperator&\"Hands\",key_AOEM,0),18)/d_PctExtrapolation)*i_AmountAS2)))","v":{"$error":"#N/A"}},{"$f":"IF(i_AppEquip=\"Manual-Trolley\",Trolley!G32+MHH!G32,IF(ISBLANK(INDEX(ay_OpExAOEM,MATCH(sys_KeyOperator&\"Hands\",key_AOEM,0),22)),10^(INDEX(ay_OpExAOEM,MATCH(sys_KeyOperator&\"Hands\",key_AOEM,0),19)+(LOG(i_AmountAS2)*INDEX(ay_OpExAOEM,MATCH(sys_KeyOperator&\"Hands\",key_AOEM,0),20))+  IF(AND(i_AppMeth=\"Upward spraying\",LEFT(i_AppEquip,15)=\"Vehicle-mounted\",d_AppPfCaBfR = \"Yes\"),0,IF(AND(i_Season = \"late (dense foliage)\",i_AppMeth=\"Upward spraying\",OR(i_AppEquip=\"Manual-Hand held\",i_AppEquip=\"Manual-Knapsack\")),0,INDEX(ay_OpExAOEM,MATCH(sys_KeyOperator&\"Hands\",key_AOEM,0),21)))   ),MAX(INDEX(ay_OpExAOEM,MATCH(sys_KeyOperator&\"Hands\",key_AOEM,0),22),(INDEX(ay_OpExAOEM,MATCH(sys_KeyOperator&\"Hands\",key_AOEM,0),22)/d_PctExtrapolation)*i_AmountAS2)))","v":{"$error":"#N/A"}},{"$f":"IF(i_AppEquip=\"Manual-Trolley\",Trolley!H32+MHH!H32,IF(ISBLANK(INDEX(ay_OpExAOEM,MATCH(sys_KeyOperator&\"Hands\",key_AOEM,0),18)),10^(INDEX(ay_OpExAOEM,MATCH(sys_KeyOperator&\"Hands\",key_AOEM,0),15)+(LOG(i_AmountAS3)*INDEX(ay_OpExAOEM,MATCH(sys_KeyOperator&\"Hands\",key_AOEM,0),16))+  IF(AND(i_AppMeth=\"Upward spraying\",LEFT(i_AppEquip,15)=\"Vehicle-mounted\",d_AppPfCaBfR = \"Yes\"),0,IF(AND(i_Season = \"late (dense foliage)\",i_AppMeth=\"Upward spraying\",OR(i_AppEquip=\"Manual-Hand held\",i_AppEquip=\"Manual-Knapsack\")),0,INDEX(ay_OpExAOEM,MATCH(sys_KeyOperator&\"Hands\",key_AOEM,0),17)))   ),MAX(INDEX(ay_OpExAOEM,MATCH(sys_KeyOperator&\"Hands\",key_AOEM,0),18),(INDEX(ay_OpExAOEM,MATCH(sys_KeyOperator&\"Hands\",key_AOEM,0),18)/d_PctExtrapolation)*i_AmountAS3)))","v":{"$error":"#N/A"}},{"$f":"IF(i_AppEquip=\"Manual-Trolley\",Trolley!I32+MHH!I32,IF(ISBLANK(INDEX(ay_OpExAOEM,MATCH(sys_KeyOperator&\"Hands\",key_AOEM,0),22)),10^(INDEX(ay_OpExAOEM,MATCH(sys_KeyOperator&\"Hands\",key_AOEM,0),19)+(LOG(i_AmountAS3)*INDEX(ay_OpExAOEM,MATCH(sys_KeyOperator&\"Hands\",key_AOEM,0),20))+IF(AND(i_AppMeth=\"Upward spraying\",LEFT(i_AppEquip,15)=\"Vehicle-mounted\",d_AppPfCaBfR=\"Yes\"),0,IF(AND(i_Season=\"late (dense foliage)\",i_AppMeth=\"Upward spraying\",OR(i_AppEquip=\"Manual-Hand held\",i_AppEquip=\"Manual-Knapsack\")),0,INDEX(ay_OpExAOEM,MATCH(sys_KeyOperator&\"Hands\",key_AOEM,0),21)))),MAX(INDEX(ay_OpExAOEM,MATCH(sys_KeyOperator&\"Hands\",key_AOEM,0),22),(INDEX(ay_OpExAOEM,MATCH(sys_KeyOperator&\"Hands\",key_AOEM,0),22)/d_PctExtrapolation)*i_AmountAS3)))","v":{"$error":"#N/A"}},{"$f":"IF(i_AppEquip=\"Manual-Trolley\",Trolley!J32+MHH!J32,IF(ISBLANK(INDEX(ay_OpExAOEM,MATCH(sys_KeyOperator&\"Hands\",key_AOEM,0),18)),10^(INDEX(ay_OpExAOEM,MATCH(sys_KeyOperator&\"Hands\",key_AOEM,0),15)+(LOG(i_AmountAS4)*INDEX(ay_OpExAOEM,MATCH(sys_KeyOperator&\"Hands\",key_AOEM,0),16))+  IF(AND(i_AppMeth=\"Upward spraying\",LEFT(i_AppEquip,15)=\"Vehicle-mounted\",d_AppPfCaBfR = \"Yes\"),0,IF(AND(i_Season = \"late (dense foliage)\",i_AppMeth=\"Upward spraying\",OR(i_AppEquip=\"Manual-Hand held\",i_AppEquip=\"Manual-Knapsack\")),0,INDEX(ay_OpExAOEM,MATCH(sys_KeyOperator&\"Hands\",key_AOEM,0),17)))   ),MAX(INDEX(ay_OpExAOEM,MATCH(sys_KeyOperator&\"Hands\",key_AOEM,0),18),(INDEX(ay_OpExAOEM,MATCH(sys_KeyOperator&\"Hands\",key_AOEM,0),18)/d_PctExtrapolation)*i_AmountAS4)))","v":{"$error":"#N/A"}},{"$f":"IF(i_AppEquip=\"Manual-Trolley\",Trolley!K32+MHH!K32,IF(ISBLANK(INDEX(ay_OpExAOEM,MATCH(sys_KeyOperator&\"Hands\",key_AOEM,0),22)),10^(INDEX(ay_OpExAOEM,MATCH(sys_KeyOperator&\"Hands\",key_AOEM,0),19)+(LOG(i_AmountAS4)*INDEX(ay_OpExAOEM,MATCH(sys_KeyOperator&\"Hands\",key_AOEM,0),20))+IF(AND(i_AppMeth=\"Upward spraying\",LEFT(i_AppEquip,15)=\"Vehicle-mounted\",d_AppPfCaBfR=\"Yes\"),0,IF(AND(i_Season=\"late (dense foliage)\",i_AppMeth=\"Upward spraying\",OR(i_AppEquip=\"Manual-Hand held\",i_AppEquip=\"Manual-Knapsack\")),0,INDEX(ay_OpExAOEM,MATCH(sys_KeyOperator&\"Hands\",key_AOEM,0),21)))),MAX(INDEX(ay_OpExAOEM,MATCH(sys_KeyOperator&\"Hands\",key_AOEM,0),22),(INDEX(ay_OpExAOEM,MATCH(sys_KeyOperator&\"Hands\",key_AOEM,0),22)/d_PctExtrapolation)*i_AmountAS4)))","v":{"$error":"#N/A"}},"AOEM",{"$f":"IF(AND(d_AreaTreated=10,i_AppMeth=\"Downward spraying\"),IF(i_AppEquip=\"Vehicle-mounted-Drift Reduction\",\"Small area equipment and drift reduction cannot be selected together - drift reduction has not been applied\",\"This scenario assumes that small area equipment is used\"),IF(i_AppMeth=\"Upward spraying\", \"No data available for a drift reduction scenario\",\"\") )","v":""}]
[null,null,"Body",{"$f":"IF(i_AppEquip=\"Manual-Trolley\",Trolley!D33+MHH!D33,IF(ISBLANK(INDEX(ay_OpExAOEM,MATCH(sys_KeyOperator&\"Body\",key_AOEM,0),18)),10^(INDEX(ay_OpExAOEM,MATCH(sys_KeyOperator&\"Body\",key_AOEM,0),15)+(LOG(i_AmountAS1)*INDEX(ay_OpExAOEM,MATCH(sys_KeyOperator&\"Body\",key_AOEM,0),16))+  IF(AND(i_AppMeth=\"Upward spraying\",LEFT(i_AppEquip,15)=\"Vehicle-mounted\",d_AppPfCaBfR = \"Yes\"),0,IF(AND(i_Season = \"late (dense foliage)\",i_AppMeth=\"Upward spraying\",OR(i_AppEquip=\"Manual-Hand held\",i_AppEquip=\"Manual-Knapsack\")),0,INDEX(ay_OpExAOEM,MATCH(sys_KeyOperator&\"Body\",key_AOEM,0),17)))   ),MAX(INDEX(ay_OpExAOEM,MATCH(sys_KeyOperator&\"Body\",key_AOEM,0),18),(INDEX(ay_OpExAOEM,MATCH(sys_KeyOperator&\"Body\",key_AOEM,0),18)/d_PctExtrapolation)*i_AmountAS1)))","v":{"$error":"#N/A"}},{"$f":"IF(i_AppEquip=\"Manual-Trolley\",Trolley!E33+MHH!E33,IF(ISBLANK(INDEX(ay_OpExAOEM,MATCH(sys_KeyOperator&\"Body\",key_AOEM,0),22)),10^(INDEX(ay_OpExAOEM,MATCH(sys_KeyOperator&\"Body\",key_AOEM,0),19)+(LOG(i_AmountAS1)*INDEX(ay_OpExAOEM,MATCH(sys_KeyOperator&\"Body\",key_AOEM,0),20))+  IF(AND(i_AppMeth=\"Upward spraying\",LEFT(i_AppEquip,15)=\"Vehicle-mounted\",d_AppPfCaBfR = \"Yes\"),0,IF(AND(i_Season = \"late (dense foliage)\",i_AppMeth=\"Upward spraying\",OR(i_AppEquip=\"Manual-Hand held\",i_AppEquip=\"Manual-Knapsack\")),0,INDEX(ay_OpExAOEM,MATCH(sys_KeyOperator&\"Body\",key_AOEM,0),21)))   ),MAX(INDEX(ay_OpExAOEM,MATCH(sys_KeyOperator&\"Body\",key_AOEM,0),22),(INDEX(ay_OpExAOEM,MATCH(sys_KeyOperator&\"Body\",key_AOEM,0),22)/d_PctExtrapolation)*i_AmountAS1)))","v":{"$error":"#N/A"}},{"$f":"IF(i_AppEquip=\"Manual-Trolley\",Trolley!F33+MHH!F33,IF(ISBLANK(INDEX(ay_OpExAOEM,MATCH(sys_KeyOperator&\"Body\",key_AOEM,0),18)),10^(INDEX(ay_OpExAOEM,MATCH(sys_KeyOperator&\"Body\",key_AOEM,0),15)+(LOG(i_AmountAS2)*INDEX(ay_OpExAOEM,MATCH(sys_KeyOperator&\"Body\",key_AOEM,0),16))+IF(AND(i_AppMeth=\"Upward spraying\",LEFT(i_AppEquip,15)=\"Vehicle-mounted\",d_AppPfCaBfR=\"Yes\"),0,IF(AND(i_Season=\"late (dense foliage)\",i_AppMeth=\"Upward spraying\",OR(i_AppEquip=\"Manual-Hand held\",i_AppEquip=\"Manual-Knapsack\")),0,INDEX(ay_OpExAOEM,MATCH(sys_KeyOperator&\"Body\",key_AOEM,0),17)))),MAX(INDEX(ay_OpExAOEM,MATCH(sys_KeyOperator&\"Body\",key_AOEM,0),18),(INDEX(ay_OpExAOEM,MATCH(sys_KeyOperator&\"Body\",key_AOEM,0),18)/d_PctExtrapolation)*i_AmountAS2)))","v":{"$error":"#N/A"}},{"$f":"IF(i_AppEquip=\"Manual-Trolley\",Trolley!G33+MHH!G33,IF(ISBLANK(INDEX(ay_OpExAOEM,MATCH(sys_KeyOperator&\"Body\",key_AOEM,0),22)),10^(INDEX(ay_OpExAOEM,MATCH(sys_KeyOperator&\"Body\",key_AOEM,0),19)+(LOG(i_AmountAS2)*INDEX(ay_OpExAOEM,MATCH(sys_KeyOperator&\"Body\",key_AOEM,0),20))+IF(AND(i_AppMeth=\"Upward spraying\",LEFT(i_AppEquip,15)=\"Vehicle-mounted\",d_AppPfCaBfR=\"Yes\"),0,IF(AND(i_Season=\"late (dense foliage)\",i_AppMeth=\"Upward spraying\",OR(i_AppEquip=\"Manual-Hand held\",i_AppEquip=\"Manual-Knapsack\")),0,INDEX(ay_OpExAOEM,MATCH(sys_KeyOperator&\"Body\",key_AOEM,0),21)))),MAX(INDEX(ay_OpExAOEM,MATCH(sys_KeyOperator&\"Body\",key_AOEM,0),22),(INDEX(ay_OpExAOEM,MATCH(sys_KeyOperator&\"Body\",key_AOEM,0),22)/d_PctExtrapolation)*i_AmountAS2)))","v":{"$error":"#N/A"}},{"$f":"IF(i_AppEquip=\"Manual-Trolley\",Trolley!H33+MHH!H33,IF(ISBLANK(INDEX(ay_OpExAOEM,MATCH(sys_KeyOperator&\"Body\",key_AOEM,0),18)),10^(INDEX(ay_OpExAOEM,MATCH(sys_KeyOperator&\"Body\",key_AOEM,0),15)+(LOG(i_AmountAS3)*INDEX(ay_OpExAOEM,MATCH(sys_KeyOperator&\"Body\",key_AOEM,0),16))+IF(AND(i_AppMeth=\"Upward spraying\",LEFT(i_AppEquip,15)=\"Vehicle-mounted\",d_AppPfCaBfR=\"Yes\"),0,IF(AND(i_Season=\"late (dense foliage)\",i_AppMeth=\"Upward spraying\",OR(i_AppEquip=\"Manual-Hand held\",i_AppEquip=\"Manual-Knapsack\")),0,INDEX(ay_OpExAOEM,MATCH(sys_KeyOperator&\"Body\",key_AOEM,0),17)))),MAX(INDEX(ay_OpExAOEM,MATCH(sys_KeyOperator&\"Body\",key_AOEM,0),18),(INDEX(ay_OpExAOEM,MATCH(sys_KeyOperator&\"Body\",key_AOEM,0),18)/d_PctExtrapolation)*i_AmountAS3)))","v":{"$error":"#N/A"}},{"$f":"IF(i_AppEquip=\"Manual-Trolley\",Trolley!I33+MHH!I33,IF(ISBLANK(INDEX(ay_OpExAOEM,MATCH(sys_KeyOperator&\"Body\",key_AOEM,0),22)),10^(INDEX(ay_OpExAOEM,MATCH(sys_KeyOperator&\"Body\",key_AOEM,0),19)+(LOG(i_AmountAS3)*INDEX(ay_OpExAOEM,MATCH(sys_KeyOperator&\"Body\",key_AOEM,0),20))+IF(AND(i_AppMeth=\"Upward spraying\",LEFT(i_AppEquip,15)=\"Vehicle-mounted\",d_AppPfCaBfR=\"Yes\"),0,IF(AND(i_Season=\"late (dense foliage)\",i_AppMeth=\"Upward spraying\",OR(i_AppEquip=\"Manual-Hand held\",i_AppEquip=\"Manual-Knapsack\")),0,INDEX(ay_OpExAOEM,MATCH(sys_KeyOperator&\"Body\",key_AOEM,0),21)))),MAX(INDEX(ay_OpExAOEM,MATCH(sys_KeyOperator&\"Body\",key_AOEM,0),22),(INDEX(ay_OpExAOEM,MATCH(sys_KeyOperator&\"Body\",key_AOEM,0),22)/d_PctExtrapolation)*i_AmountAS3)))","v":{"$error":"#N/A"}},{"$f":"IF(i_AppEquip=\"Manual-Trolley\",Trolley!J33+MHH!J33,IF(ISBLANK(INDEX(ay_OpExAOEM,MATCH(sys_KeyOperator&\"Body\",key_AOEM,0),18)),10^(INDEX(ay_OpExAOEM,MATCH(sys_KeyOperator&\"Body\",key_AOEM,0),15)+(LOG(i_AmountAS4)*INDEX(ay_OpExAOEM,MATCH(sys_KeyOperator&\"Body\",key_AOEM,0),16))+IF(AND(i_AppMeth=\"Upward spraying\",LEFT(i_AppEquip,15)=\"Vehicle-mounted\",d_AppPfCaBfR=\"Yes\"),0,IF(AND(i_Season=\"late (dense foliage)\",i_AppMeth=\"Upward spraying\",OR(i_AppEquip=\"Manual-Hand held\",i_AppEquip=\"Manual-Knapsack\")),0,INDEX(ay_OpExAOEM,MATCH(sys_KeyOperator&\"Body\",key_AOEM,0),17)))),MAX(INDEX(ay_OpExAOEM,MATCH(sys_KeyOperator&\"Body\",key_AOEM,0),18),(INDEX(ay_OpExAOEM,MATCH(sys_KeyOperator&\"Body\",key_AOEM,0),18)/d_PctExtrapolation)*i_AmountAS4)))","v":{"$error":"#N/A"}},{"$f":"IF(i_AppEquip=\"Manual-Trolley\",Trolley!K33+MHH!K33,IF(ISBLANK(INDEX(ay_OpExAOEM,MATCH(sys_KeyOperator&\"Body\",key_AOEM,0),22)),10^(INDEX(ay_OpExAOEM,MATCH(sys_KeyOperator&\"Body\",key_AOEM,0),19)+(LOG(i_AmountAS4)*INDEX(ay_OpExAOEM,MATCH(sys_KeyOperator&\"Body\",key_AOEM,0),20))+IF(AND(i_AppMeth=\"Upward spraying\",LEFT(i_AppEquip,15)=\"Vehicle-mounted\",d_AppPfCaBfR=\"Yes\"),0,IF(AND(i_Season=\"late (dense foliage)\",i_AppMeth=\"Upward spraying\",OR(i_AppEquip=\"Manual-Hand held\",i_AppEquip=\"Manual-Knapsack\")),0,INDEX(ay_OpExAOEM,MATCH(sys_KeyOperator&\"Body\",key_AOEM,0),21)))),MAX(INDEX(ay_OpExAOEM,MATCH(sys_KeyOperator&\"Body\",key_AOEM,0),22),(INDEX(ay_OpExAOEM,MATCH(sys_KeyOperator&\"Body\",key_AOEM,0),22)/d_PctExtrapolation)*i_AmountAS4)))","v":{"$error":"#N/A"}},"AOEM"]
[null,null,"Head",{"$f":"IF(i_AppEquip=\"Manual-Trolley\",Trolley!D34+MHH!D34,IF(ISBLANK(INDEX(ay_OpExAOEM,MATCH(sys_KeyOperator&\"Head\",key_AOEM,0),18)),10^(INDEX(ay_OpExAOEM,MATCH(sys_KeyOperator&\"Head\",key_AOEM,0),15)+(LOG(i_AmountAS1)*INDEX(ay_OpExAOEM,MATCH(sys_KeyOperator&\"Head\",key_AOEM,0),16))+  IF(AND(i_AppMeth=\"Upward spraying\",LEFT(i_AppEquip,15)=\"Vehicle-mounted\",d_AppPfCaBfR = \"Yes\"),0,IF(AND(i_Season = \"late (dense foliage)\",i_AppMeth=\"Upward spraying\",OR(i_AppEquip=\"Manual-Hand held\",i_AppEquip=\"Manual-Knapsack\")),0,INDEX(ay_OpExAOEM,MATCH(sys_KeyOperator&\"Head\",key_AOEM,0),17)))   ),MAX(INDEX(ay_OpExAOEM,MATCH(sys_KeyOperator&\"Head\",key_AOEM,0),18),(INDEX(ay_OpExAOEM,MATCH(sys_KeyOperator&\"Head\",key_AOEM,0),18)/d_PctExtrapolation)*i_AmountAS1)))","v":{"$error":"#N/A"}},{"$f":"IF(i_AppEquip=\"Manual-Trolley\",Trolley!E34+MHH!E34,IF(ISBLANK(INDEX(ay_OpExAOEM,MATCH(sys_KeyOperator&\"Head\",key_AOEM,0),22)),10^(INDEX(ay_OpExAOEM,MATCH(sys_KeyOperator&\"Head\",key_AOEM,0),19)+(LOG(i_AmountAS1)*INDEX(ay_OpExAOEM,MATCH(sys_KeyOperator&\"Head\",key_AOEM,0),20))+  IF(AND(i_AppMeth=\"Upward spraying\",LEFT(i_AppEquip,15)=\"Vehicle-mounted\",d_AppPfCaBfR = \"Yes\"),0,IF(AND(i_Season = \"late (dense foliage)\",i_AppMeth=\"Upward spraying\",OR(i_AppEquip=\"Manual-Hand held\",i_AppEquip=\"Manual-Knapsack\")),0,INDEX(ay_OpExAOEM,MATCH(sys_KeyOperator&\"Head\",key_AOEM,0),21)))   ),MAX(INDEX(ay_OpExAOEM,MATCH(sys_KeyOperator&\"Head\",key_AOEM,0),22),(INDEX(ay_OpExAOEM,MATCH(sys_KeyOperator&\"Head\",key_AOEM,0),22)/d_PctExtrapolation)*i_AmountAS1)))","v":{"$error":"#N/A"}},{"$f":"IF(i_AppEquip=\"Manual-Trolley\",Trolley!F34+MHH!F34,IF(ISBLANK(INDEX(ay_OpExAOEM,MATCH(sys_KeyOperator&\"Head\",key_AOEM,0),18)),10^(INDEX(ay_OpExAOEM,MATCH(sys_KeyOperator&\"Head\",key_AOEM,0),15)+(LOG(i_AmountAS2)*INDEX(ay_OpExAOEM,MATCH(sys_KeyOperator&\"Head\",key_AOEM,0),16))+  IF(AND(i_AppMeth=\"Upward spraying\",LEFT(i_AppEquip,15)=\"Vehicle-mounted\",d_AppPfCaBfR = \"Yes\"),0,IF(AND(i_Season = \"late (dense foliage)\",i_AppMeth=\"Upward spraying\",OR(i_AppEquip=\"Manual-Hand held\",i_AppEquip=\"Manual-Knapsack\")),0,INDEX(ay_OpExAOEM,MATCH(sys_KeyOperator&\"Head\",key_AOEM,0),17)))   ),MAX(INDEX(ay_OpExAOEM,MATCH(sys_KeyOperator&\"Head\",key_AOEM,0),18),(INDEX(ay_OpExAOEM,MATCH(sys_KeyOperator&\"Head\",key_AOEM,0),18)/d_PctExtrapolation)*i_AmountAS2)))","v":{"$error":"#N/A"}},{"$f":"IF(i_AppEquip=\"Manual-Trolley\",Trolley!G34+MHH!G34,IF(ISBLANK(INDEX(ay_OpExAOEM,MATCH(sys_KeyOperator&\"Head\",key_AOEM,0),22)),10^(INDEX(ay_OpExAOEM,MATCH(sys_KeyOperator&\"Head\",key_AOEM,0),19)+(LOG(i_AmountAS2)*INDEX(ay_OpExAOEM,MATCH(sys_KeyOperator&\"Head\",key_AOEM,0),20))+  IF(AND(i_AppMeth=\"Upward spraying\",LEFT(i_AppEquip,15)=\"Vehicle-mounted\",d_AppPfCaBfR = \"Yes\"),0,IF(AND(i_Season = \"late (dense foliage)\",i_AppMeth=\"Upward spraying\",OR(i_AppEquip=\"Manual-Hand held\",i_AppEquip=\"Manual-Knapsack\")),0,INDEX(ay_OpExAOEM,MATCH(sys_KeyOperator&\"Head\",key_AOEM,0),21)))   ),MAX(INDEX(ay_OpExAOEM,MATCH(sys_KeyOperator&\"Head\",key_AOEM,0),22),(INDEX(ay_OpExAOEM,MATCH(sys_KeyOperator&\"Head\",key_AOEM,0),22)/d_PctExtrapolation)*i_AmountAS2)))","v":{"$error":"#N/A"}},{"$f":"IF(i_AppEquip=\"Manual-Trolley\",Trolley!H34+MHH!H34,IF(ISBLANK(INDEX(ay_OpExAOEM,MATCH(sys_KeyOperator&\"Head\",key_AOEM,0),18)),10^(INDEX(ay_OpExAOEM,MATCH(sys_KeyOperator&\"Head\",key_AOEM,0),15)+(LOG(i_AmountAS3)*INDEX(ay_OpExAOEM,MATCH(sys_KeyOperator&\"Head\",key_AOEM,0),16))+  IF(AND(i_AppMeth=\"Upward spraying\",LEFT(i_AppEquip,15)=\"Vehicle-mounted\",d_AppPfCaBfR = \"Yes\"),0,IF(AND(i_Season = \"late (dense foliage)\",i_AppMeth=\"Upward spraying\",OR(i_AppEquip=\"Manual-Hand held\",i_AppEquip=\"Manual-Knapsack\")),0,INDEX(ay_OpExAOEM,MATCH(sys_KeyOperator&\"Head\",key_AOEM,0),17)))   ),MAX(INDEX(ay_OpExAOEM,MATCH(sys_KeyOperator&\"Head\",key_AOEM,0),18),(INDEX(ay_OpExAOEM,MATCH(sys_KeyOperator&\"Head\",key_AOEM,0),18)/d_PctExtrapolation)*i_AmountAS3)))","v":{"$error":"#N/A"}},{"$f":"IF(i_AppEquip=\"Manual-Trolley\",Trolley!I34+MHH!I34,IF(ISBLANK(INDEX(ay_OpExAOEM,MATCH(sys_KeyOperator&\"Head\",key_AOEM,0),22)),10^(INDEX(ay_OpExAOEM,MATCH(sys_KeyOperator&\"Head\",key_AOEM,0),19)+(LOG(i_AmountAS3)*INDEX(ay_OpExAOEM,MATCH(sys_KeyOperator&\"Head\",key_AOEM,0),20))+IF(AND(i_AppMeth=\"Upward spraying\",LEFT(i_AppEquip,15)=\"Vehicle-mounted\",d_AppPfCaBfR=\"Yes\"),0,IF(AND(i_Season=\"late (dense foliage)\",i_AppMeth=\"Upward spraying\",OR(i_AppEquip=\"Manual-Hand held\",i_AppEquip=\"Manual-Knapsack\")),0,INDEX(ay_OpExAOEM,MATCH(sys_KeyOperator&\"Head\",key_AOEM,0),21)))),MAX(INDEX(ay_OpExAOEM,MATCH(sys_KeyOperator&\"Head\",key_AOEM,0),22),(INDEX(ay_OpExAOEM,MATCH(sys_KeyOperator&\"Head\",key_AOEM,0),22)/d_PctExtrapolation)*i_AmountAS3)))","v":{"$error":"#N/A"}},{"$f":"IF(i_AppEquip=\"Manual-Trolley\",Trolley!J34+MHH!J34,IF(ISBLANK(INDEX(ay_OpExAOEM,MATCH(sys_KeyOperator&\"Head\",key_AOEM,0),18)),10^(INDEX(ay_OpExAOEM,MATCH(sys_KeyOperator&\"Head\",key_AOEM,0),15)+(LOG(i_AmountAS4)*INDEX(ay_OpExAOEM,MATCH(sys_KeyOperator&\"Head\",key_AOEM,0),16))+IF(AND(i_AppMeth=\"Upward spraying\",LEFT(i_AppEquip,15)=\"Vehicle-mounted\",d_AppPfCaBfR=\"Yes\"),0,IF(AND(i_Season=\"late (dense foliage)\",i_AppMeth=\"Upward spraying\",OR(i_AppEquip=\"Manual-Hand held\",i_AppEquip=\"Manual-Knapsack\")),0,INDEX(ay_OpExAOEM,MATCH(sys_KeyOperator&\"Head\",key_AOEM,0),17)))),MAX(INDEX(ay_OpExAOEM,MATCH(sys_KeyOperator&\"Head\",key_AOEM,0),18),(INDEX(ay_OpExAOEM,MATCH(sys_KeyOperator&\"Head\",key_AOEM,0),18)/d_PctExtrapolation)*i_AmountAS4)))","v":{"$error":"#N/A"}},{"$f":"IF(i_AppEquip=\"Manual-Trolley\",Trolley!K34+MHH!K34,IF(ISBLANK(INDEX(ay_OpExAOEM,MATCH(sys_KeyOperator&\"Head\",key_AOEM,0),22)),10^(INDEX(ay_OpExAOEM,MATCH(sys_KeyOperator&\"Head\",key_AOEM,0),19)+(LOG(i_AmountAS4)*INDEX(ay_OpExAOEM,MATCH(sys_KeyOperator&\"Head\",key_AOEM,0),20))+IF(AND(i_AppMeth=\"Upward spraying\",LEFT(i_AppEquip,15)=\"Vehicle-mounted\",d_AppPfCaBfR=\"Yes\"),0,IF(AND(i_Season=\"late (dense foliage)\",i_AppMeth=\"Upward spraying\",OR(i_AppEquip=\"Manual-Hand held\",i_AppEquip=\"Manual-Knapsack\")),0,INDEX(ay_OpExAOEM,MATCH(sys_KeyOperator&\"Head\",key_AOEM,0),21)))),MAX(INDEX(ay_OpExAOEM,MATCH(sys_KeyOperator&\"Head\",key_AOEM,0),22),(INDEX(ay_OpExAOEM,MATCH(sys_KeyOperator&\"Head\",key_AOEM,0),22)/d_PctExtrapolation)*i_AmountAS4)))","v":{"$error":"#N/A"}},"AOEM"]
[null,null,"Protected hands",{"$f":"IF(i_AppEquip=\"Manual-Trolley\",Trolley!D35+MHH!D35,IF(ISBLANK(INDEX(ay_OpExAOEM,MATCH(sys_KeyOperator&\"Protected Hands\",key_AOEM,0),18)),10^(INDEX(ay_OpExAOEM,MATCH(sys_KeyOperator&\"Protected Hands\",key_AOEM,0),15)+(LOG(i_AmountAS1)*INDEX(ay_OpExAOEM,MATCH(sys_KeyOperator&\"Protected Hands\",key_AOEM,0),16))+  IF(AND(i_AppMeth=\"Upward spraying\",LEFT(i_AppEquip,15)=\"Vehicle-mounted\",d_AppPfCaBfR = \"Yes\"),0,IF(AND(i_Season = \"late (dense foliage)\",i_AppMeth=\"Upward spraying\",OR(i_AppEquip=\"Manual-Hand held\",i_AppEquip=\"Manual-Knapsack\")),0,INDEX(ay_OpExAOEM,MATCH(sys_KeyOperator&\"Protected Hands\",key_AOEM,0),17)))   ),MAX(INDEX(ay_OpExAOEM,MATCH(sys_KeyOperator&\"Protected Hands\",key_AOEM,0),18),(INDEX(ay_OpExAOEM,MATCH(sys_KeyOperator&\"Protected Hands\",key_AOEM,0),18)/d_PctExtrapolation)*i_AmountAS1)))","v":{"$error":"#N/A"}},{"$f":"IF(i_AppEquip=\"Manual-Trolley\",Trolley!E35+MHH!E35,IF(ISBLANK(INDEX(ay_OpExAOEM,MATCH(sys_KeyOperator&\"Protected Hands\",key_AOEM,0),22)),10^(INDEX(ay_OpExAOEM,MATCH(sys_KeyOperator&\"Protected Hands\",key_AOEM,0),19)+(LOG(i_AmountAS1)*INDEX(ay_OpExAOEM,MATCH(sys_KeyOperator&\"Protected Hands\",key_AOEM,0),20))+IF(AND(i_AppMeth=\"Upward spraying\",LEFT(i_AppEquip,15)=\"Vehicle-mounted\",d_AppPfCaBfR=\"Yes\"),0,IF(AND(i_Season=\"late (dense foliage)\",i_AppMeth=\"Upward spraying\",OR(i_AppEquip=\"Manual-Hand held\",i_AppEquip=\"Manual-Knapsack\")),0,INDEX(ay_OpExAOEM,MATCH(sys_KeyOperator&\"Protected Hands\",key_AOEM,0),21)))),MAX(INDEX(ay_OpExAOEM,MATCH(sys_KeyOperator&\"Protected Hands\",key_AOEM,0),22),(INDEX(ay_OpExAOEM,MATCH(sys_KeyOperator&\"Protected Hands\",key_AOEM,0),22)/d_PctExtrapolation)*i_AmountAS1)))","v":{"$error":"#N/A"}},{"$f":"IF(i_AppEquip=\"Manual-Trolley\",Trolley!F35+MHH!F35,IF(ISBLANK(INDEX(ay_OpExAOEM,MATCH(sys_KeyOperator&\"Protected Hands\",key_AOEM,0),18)),10^(INDEX(ay_OpExAOEM,MATCH(sys_KeyOperator&\"Protected Hands\",key_AOEM,0),15)+(LOG(i_AmountAS2)*INDEX(ay_OpExAOEM,MATCH(sys_KeyOperator&\"Protected Hands\",key_AOEM,0),16))+IF(AND(i_AppMeth=\"Upward spraying\",LEFT(i_AppEquip,15)=\"Vehicle-mounted\",d_AppPfCaBfR=\"Yes\"),0,IF(AND(i_Season=\"late (dense foliage)\",i_AppMeth=\"Upward spraying\",OR(i_AppEquip=\"Manual-Hand held\",i_AppEquip=\"Manual-Knapsack\")),0,INDEX(ay_OpExAOEM,MATCH(sys_KeyOperator&\"Protected Hands\",key_AOEM,0),17)))),MAX(INDEX(ay_OpExAOEM,MATCH(sys_KeyOperator&\"Protected Hands\",key_AOEM,0),18),(INDEX(ay_OpExAOEM,MATCH(sys_KeyOperator&\"Protected Hands\",key_AOEM,0),18)/d_PctExtrapolation)*i_AmountAS2)))","v":{"$error":"#N/A"}},{"$f":"IF(i_AppEquip=\"Manual-Trolley\",Trolley!G35+MHH!G35,IF(ISBLANK(INDEX(ay_OpExAOEM,MATCH(sys_KeyOperator&\"Protected Hands\",key_AOEM,0),22)),10^(INDEX(ay_OpExAOEM,MATCH(sys_KeyOperator&\"Protected Hands\",key_AOEM,0),19)+(LOG(i_AmountAS2)*INDEX(ay_OpExAOEM,MATCH(sys_KeyOperator&\"Protected Hands\",key_AOEM,0),20))+IF(AND(i_AppMeth=\"Upward spraying\",LEFT(i_AppEquip,15)=\"Vehicle-mounted\",d_AppPfCaBfR=\"Yes\"),0,IF(AND(i_Season=\"late (dense foliage)\",i_AppMeth=\"Upward spraying\",OR(i_AppEquip=\"Manual-Hand held\",i_AppEquip=\"Manual-Knapsack\")),0,INDEX(ay_OpExAOEM,MATCH(sys_KeyOperator&\"Protected Hands\",key_AOEM,0),21)))),MAX(INDEX(ay_OpExAOEM,MATCH(sys_KeyOperator&\"Protected Hands\",key_AOEM,0),22),(INDEX(ay_OpExAOEM,MATCH(sys_KeyOperator&\"Protected Hands\",key_AOEM,0),22)/d_PctExtrapolation)*i_AmountAS2)))","v":{"$error":"#N/A"}},{"$f":"IF(i_AppEquip=\"Manual-Trolley\",Trolley!H35+MHH!H35,IF(ISBLANK(INDEX(ay_OpExAOEM,MATCH(sys_KeyOperator&\"Protected Hands\",key_AOEM,0),18)),10^(INDEX(ay_OpExAOEM,MATCH(sys_KeyOperator&\"Protected Hands\",key_AOEM,0),15)+(LOG(i_AmountAS3)*INDEX(ay_OpExAOEM,MATCH(sys_KeyOperator&\"Protected Hands\",key_AOEM,0),16))+IF(AND(i_AppMeth=\"Upward spraying\",LEFT(i_AppEquip,15)=\"Vehicle-mounted\",d_AppPfCaBfR=\"Yes\"),0,IF(AND(i_Season=\"late (dense foliage)\",i_AppMeth=\"Upward spraying\",OR(i_AppEquip=\"Manual-Hand held\",i_AppEquip=\"Manual-Knapsack\")),0,INDEX(ay_OpExAOEM,MATCH(sys_KeyOperator&\"Protected Hands\",key_AOEM,0),17)))),MAX(INDEX(ay_OpExAOEM,MATCH(sys_KeyOperator&\"Protected Hands\",key_AOEM,0),18),(INDEX(ay_OpExAOEM,MATCH(sys_KeyOperator&\"Protected Hands\",key_AOEM,0),18)/d_PctExtrapolation)*i_AmountAS3)))","v":{"$error":"#N/A"}},{"$f":"IF(i_AppEquip=\"Manual-Trolley\",Trolley!I35+MHH!I35,IF(ISBLANK(INDEX(ay_OpExAOEM,MATCH(sys_KeyOperator&\"Protected Hands\",key_AOEM,0),22)),10^(INDEX(ay_OpExAOEM,MATCH(sys_KeyOperator&\"Protected Hands\",key_AOEM,0),19)+(LOG(i_AmountAS3)*INDEX(ay_OpExAOEM,MATCH(sys_KeyOperator&\"Protected Hands\",key_AOEM,0),20))+IF(AND(i_AppMeth=\"Upward spraying\",LEFT(i_AppEquip,15)=\"Vehicle-mounted\",d_AppPfCaBfR=\"Yes\"),0,IF(AND(i_Season=\"late (dense foliage)\",i_AppMeth=\"Upward spraying\",OR(i_AppEquip=\"Manual-Hand held\",i_AppEquip=\"Manual-Knapsack\")),0,INDEX(ay_OpExAOEM,MATCH(sys_KeyOperator&\"Protected Hands\",key_AOEM,0),21)))),MAX(INDEX(ay_OpExAOEM,MATCH(sys_KeyOperator&\"Protected Hands\",key_AOEM,0),22),(INDEX(ay_OpExAOEM,MATCH(sys_KeyOperator&\"Protected Hands\",key_AOEM,0),22)/d_PctExtrapolation)*i_AmountAS3)))","v":{"$error":"#N/A"}},{"$f":"IF(i_AppEquip=\"Manual-Trolley\",Trolley!J35+MHH!J35,IF(ISBLANK(INDEX(ay_OpExAOEM,MATCH(sys_KeyOperator&\"Protected Hands\",key_AOEM,0),18)),10^(INDEX(ay_OpExAOEM,MATCH(sys_KeyOperator&\"Protected Hands\",key_AOEM,0),15)+(LOG(i_AmountAS4)*INDEX(ay_OpExAOEM,MATCH(sys_KeyOperator&\"Protected Hands\",key_AOEM,0),16))+IF(AND(i_AppMeth=\"Upward spraying\",LEFT(i_AppEquip,15)=\"Vehicle-mounted\",d_AppPfCaBfR=\"Yes\"),0,IF(AND(i_Season=\"late (dense foliage)\",i_AppMeth=\"Upward spraying\",OR(i_AppEquip=\"Manual-Hand held\",i_AppEquip=\"Manual-Knapsack\")),0,INDEX(ay_OpExAOEM,MATCH(sys_KeyOperator&\"Protected Hands\",key_AOEM,0),17)))),MAX(INDEX(ay_OpExAOEM,MATCH(sys_KeyOperator&\"Protected Hands\",key_AOEM,0),18),(INDEX(ay_OpExAOEM,MATCH(sys_KeyOperator&\"Protected Hands\",key_AOEM,0),18)/d_PctExtrapolation)*i_AmountAS4)))","v":{"$error":"#N/A"}},{"$f":"IF(i_AppEquip=\"Manual-Trolley\",Trolley!K35+MHH!K35,IF(ISBLANK(INDEX(ay_OpExAOEM,MATCH(sys_KeyOperator&\"Protected Hands\",key_AOEM,0),22)),10^(INDEX(ay_OpExAOEM,MATCH(sys_KeyOperator&\"Protected Hands\",key_AOEM,0),19)+(LOG(i_AmountAS4)*INDEX(ay_OpExAOEM,MATCH(sys_KeyOperator&\"Protected Hands\",key_AOEM,0),20))+IF(AND(i_AppMeth=\"Upward spraying\",LEFT(i_AppEquip,15)=\"Vehicle-mounted\",d_AppPfCaBfR=\"Yes\"),0,IF(AND(i_Season=\"late (dense foliage)\",i_AppMeth=\"Upward spraying\",OR(i_AppEquip=\"Manual-Hand held\",i_AppEquip=\"Manual-Knapsack\")),0,INDEX(ay_OpExAOEM,MATCH(sys_KeyOperator&\"Protected Hands\",key_AOEM,0),21)))),MAX(INDEX(ay_OpExAOEM,MATCH(sys_KeyOperator&\"Protected Hands\",key_AOEM,0),22),(INDEX(ay_OpExAOEM,MATCH(sys_KeyOperator&\"Protected Hands\",key_AOEM,0),22)/d_PctExtrapolation)*i_AmountAS4)))","v":{"$error":"#N/A"}},"AOEM"]
[null,null,"Protected body",{"$f":"IF(i_AppEquip=\"Manual-Trolley\",Trolley!D36+MHH!D36,IF(ISBLANK(INDEX(ay_OpExAOEM,MATCH(sys_KeyOperator&\"Protected Body\",key_AOEM,0),18)),10^(INDEX(ay_OpExAOEM,MATCH(sys_KeyOperator&\"Protected Body\",key_AOEM,0),15)+(LOG(i_AmountAS1)*INDEX(ay_OpExAOEM,MATCH(sys_KeyOperator&\"Protected Body\",key_AOEM,0),16))+IF(AND(i_AppMeth=\"Upward spraying\",LEFT(i_AppEquip,15)=\"Vehicle-mounted\",d_AppPfCaBfR=\"Yes\"),0,IF(AND(i_Season=\"late (dense foliage)\",i_AppMeth=\"Upward spraying\",OR(i_AppEquip=\"Manual-Hand held\",i_AppEquip=\"Manual-Knapsack\")),0,INDEX(ay_OpExAOEM,MATCH(sys_KeyOperator&\"Protected Body\",key_AOEM,0),17)))),MAX(INDEX(ay_OpExAOEM,MATCH(sys_KeyOperator&\"Protected Body\",key_AOEM,0),18),(INDEX(ay_OpExAOEM,MATCH(sys_KeyOperator&\"Protected Body\",key_AOEM,0),18)/IF(I_PPE_appl=\"Rain trousers\",0.086,d_PctExtrapolation)*i_AmountAS1))))","v":{"$error":"#N/A"}},{"$f":"IF(i_AppEquip=\"Manual-Trolley\",Trolley!E36+MHH!E36,IF(ISBLANK(INDEX(ay_OpExAOEM,MATCH(sys_KeyOperator&\"Protected Body\",key_AOEM,0),22)),10^(INDEX(ay_OpExAOEM,MATCH(sys_KeyOperator&\"Protected Body\",key_AOEM,0),19)++(LOG(i_AmountAS1)*INDEX(ay_OpExAOEM,MATCH(sys_KeyOperator&\"Protected Body\",key_AOEM,0),20))+IF(AND(i_AppMeth=\"Upward spraying\",LEFT(i_AppEquip,15)=\"Vehicle-mounted\",d_AppPfCaBfR=\"Yes\"),0,IF(AND(i_Season=\"late (dense foliage)\",i_AppMeth=\"Upward spraying\",OR(i_AppEquip=\"Manual-Hand held\",i_AppEquip=\"Manual-Knapsack\")),0,INDEX(ay_OpExAOEM,MATCH(sys_KeyOperator&\"Protected Body\",key_AOEM,0),21)))),MAX(INDEX(ay_OpExAOEM,MATCH(sys_KeyOperator&\"Protected Body\",key_AOEM,0),22),(INDEX(ay_OpExAOEM,MATCH(sys_KeyOperator&\"Protected Body\",key_AOEM,0),22)/IF(I_PPE_appl=\"Rain trousers\",0.086,d_PctExtrapolation))*i_AmountAS1)))","v":{"$error":"#N/A"}},{"$f":"IF(i_AppEquip=\"Manual-Trolley\",Trolley!F36+MHH!F36,IF(ISBLANK(INDEX(ay_OpExAOEM,MATCH(sys_KeyOperator&\"Protected Body\",key_AOEM,0),18)),10^(INDEX(ay_OpExAOEM,MATCH(sys_KeyOperator&\"Protected Body\",key_AOEM,0),15)+(LOG(i_AmountAS2)*INDEX(ay_OpExAOEM,MATCH(sys_KeyOperator&\"Protected Body\",key_AOEM,0),16))+IF(AND(i_AppMeth=\"Upward spraying\",LEFT(i_AppEquip,15)=\"Vehicle-mounted\",d_AppPfCaBfR=\"Yes\"),0,IF(AND(i_Season=\"late (dense foliage)\",i_AppMeth=\"Upward spraying\",OR(i_AppEquip=\"Manual-Hand held\",i_AppEquip=\"Manual-Knapsack\")),0,INDEX(ay_OpExAOEM,MATCH(sys_KeyOperator&\"Protected Body\",key_AOEM,0),17)))),MAX(INDEX(ay_OpExAOEM,MATCH(sys_KeyOperator&\"Protected Body\",key_AOEM,0),18),(INDEX(ay_OpExAOEM,MATCH(sys_KeyOperator&\"Protected Body\",key_AOEM,0),18)/IF(I_PPE_appl=\"Rain trousers\",0.086,d_PctExtrapolation))*i_AmountAS2)))","v":{"$error":"#N/A"}},{"$f":"IF(i_AppEquip=\"Manual-Trolley\",Trolley!G36+MHH!G36,IF(ISBLANK(INDEX(ay_OpExAOEM,MATCH(sys_KeyOperator&\"Protected Body\",key_AOEM,0),22)),10^(INDEX(ay_OpExAOEM,MATCH(sys_KeyOperator&\"Protected Body\",key_AOEM,0),19)++(LOG(i_AmountAS2)*INDEX(ay_OpExAOEM,MATCH(sys_KeyOperator&\"Protected Body\",key_AOEM,0),20))+IF(AND(i_AppMeth=\"Upward spraying\",LEFT(i_AppEquip,15)=\"Vehicle-mounted\",d_AppPfCaBfR=\"Yes\"),0,IF(AND(i_Season=\"late (dense foliage)\",i_AppMeth=\"Upward spraying\",OR(i_AppEquip=\"Manual-Hand held\",i_AppEquip=\"Manual-Knapsack\")),0,INDEX(ay_OpExAOEM,MATCH(sys_KeyOperator&\"Protected Body\",key_AOEM,0),21)))),MAX(INDEX(ay_OpExAOEM,MATCH(sys_KeyOperator&\"Protected Body\",key_AOEM,0),22),(INDEX(ay_OpExAOEM,MATCH(sys_KeyOperator&\"Protected Body\",key_AOEM,0),22)/IF(I_PPE_appl=\"Rain trousers\",0.086,d_PctExtrapolation))*i_AmountAS2)))","v":{"$error":"#N/A"}},{"$f":"IF(i_AppEquip=\"Manual-Trolley\",Trolley!H36+MHH!H36,IF(ISBLANK(INDEX(ay_OpExAOEM,MATCH(sys_KeyOperator&\"Protected Body\",key_AOEM,0),18)),10^(INDEX(ay_OpExAOEM,MATCH(sys_KeyOperator&\"Protected Body\",key_AOEM,0),15)+(LOG(i_AmountAS3)*INDEX(ay_OpExAOEM,MATCH(sys_KeyOperator&\"Protected Body\",key_AOEM,0),16))+IF(AND(i_AppMeth=\"Upward spraying\",LEFT(i_AppEquip,15)=\"Vehicle-mounted\",d_AppPfCaBfR=\"Yes\"),0,IF(AND(i_Season=\"late (dense foliage)\",i_AppMeth=\"Upward spraying\",OR(i_AppEquip=\"Manual-Hand held\",i_AppEquip=\"Manual-Knapsack\")),0,INDEX(ay_OpExAOEM,MATCH(sys_KeyOperator&\"Protected Body\",key_AOEM,0),17)))),MAX(INDEX(ay_OpExAOEM,MATCH(sys_KeyOperator&\"Protected Body\",key_AOEM,0),18),(INDEX(ay_OpExAOEM,MATCH(sys_KeyOperator&\"Protected Body\",key_AOEM,0),18)/IF(I_PPE_appl=\"Rain trousers\",0.086,d_PctExtrapolation))*i_AmountAS3)))","v":{"$error":"#N/A"}},{"$f":"IF(i_AppEquip=\"Manual-Trolley\",Trolley!I36+MHH!I36,IF(ISBLANK(INDEX(ay_OpExAOEM,MATCH(sys_KeyOperator&\"Protected Body\",key_AOEM,0),22)),10^(INDEX(ay_OpExAOEM,MATCH(sys_KeyOperator&\"Protected Body\",key_AOEM,0),19)++(LOG(i_AmountAS3)*INDEX(ay_OpExAOEM,MATCH(sys_KeyOperator&\"Protected Body\",key_AOEM,0),20))+IF(AND(i_AppMeth=\"Upward spraying\",LEFT(i_AppEquip,15)=\"Vehicle-mounted\",d_AppPfCaBfR=\"Yes\"),0,IF(AND(i_Season=\"late (dense foliage)\",i_AppMeth=\"Upward spraying\",OR(i_AppEquip=\"Manual-Hand held\",i_AppEquip=\"Manual-Knapsack\")),0,INDEX(ay_OpExAOEM,MATCH(sys_KeyOperator&\"Protected Body\",key_AOEM,0),21)))),MAX(INDEX(ay_OpExAOEM,MATCH(sys_KeyOperator&\"Protected Body\",key_AOEM,0),22),(INDEX(ay_OpExAOEM,MATCH(sys_KeyOperator&\"Protected Body\",key_AOEM,0),22)/IF(I_PPE_appl=\"Rain trousers\",0.086,d_PctExtrapolation))*i_AmountAS3)))","v":{"$error":"#N/A"}},{"$f":"IF(i_AppEquip=\"Manual-Trolley\",Trolley!J36+MHH!J36,IF(ISBLANK(INDEX(ay_OpExAOEM,MATCH(sys_KeyOperator&\"Protected Body\",key_AOEM,0),18)),10^(INDEX(ay_OpExAOEM,MATCH(sys_KeyOperator&\"Protected Body\",key_AOEM,0),15)+(LOG(i_AmountAS4)*INDEX(ay_OpExAOEM,MATCH(sys_KeyOperator&\"Protected Body\",key_AOEM,0),16))+IF(AND(i_AppMeth=\"Upward spraying\",LEFT(i_AppEquip,15)=\"Vehicle-mounted\",d_AppPfCaBfR=\"Yes\"),0,IF(AND(i_Season=\"late (dense foliage)\",i_AppMeth=\"Upward spraying\",OR(i_AppEquip=\"Manual-Hand held\",i_AppEquip=\"Manual-Knapsack\")),0,INDEX(ay_OpExAOEM,MATCH(sys_KeyOperator&\"Protected Body\",key_AOEM,0),17)))),MAX(INDEX(ay_OpExAOEM,MATCH(sys_KeyOperator&\"Protected Body\",key_AOEM,0),18),(INDEX(ay_OpExAOEM,MATCH(sys_KeyOperator&\"Protected Body\",key_AOEM,0),18)/IF(I_PPE_appl=\"Rain trousers\",0.086,d_PctExtrapolation))*i_AmountAS4)))","v":{"$error":"#N/A"}},{"$f":"IF(i_AppEquip=\"Manual-Trolley\",Trolley!K36+MHH!K36,IF(ISBLANK(INDEX(ay_OpExAOEM,MATCH(sys_KeyOperator&\"Protected Body\",key_AOEM,0),22)),10^(INDEX(ay_OpExAOEM,MATCH(sys_KeyOperator&\"Protected Body\",key_AOEM,0),19)++(LOG(i_AmountAS4)*INDEX(ay_OpExAOEM,MATCH(sys_KeyOperator&\"Protected Body\",key_AOEM,0),20))+IF(AND(i_AppMeth=\"Upward spraying\",LEFT(i_AppEquip,15)=\"Vehicle-mounted\",d_AppPfCaBfR=\"Yes\"),0,IF(AND(i_Season=\"late (dense foliage)\",i_AppMeth=\"Upward spraying\",OR(i_AppEquip=\"Manual-Hand held\",i_AppEquip=\"Manual-Knapsack\")),0,INDEX(ay_OpExAOEM,MATCH(sys_KeyOperator&\"Protected Body\",key_AOEM,0),21)))),MAX(INDEX(ay_OpExAOEM,MATCH(sys_KeyOperator&\"Protected Body\",key_AOEM,0),22),(INDEX(ay_OpExAOEM,MATCH(sys_KeyOperator&\"Protected Body\",key_AOEM,0),22)/IF(I_PPE_appl=\"Rain trousers\",0.086,d_PctExtrapolation))*i_AmountAS4)))","v":{"$error":"#N/A"}},"AOEM"]
[null,null,"Inhalation",{"$f":"IF(i_AppEquip=\"Manual-Trolley\",Trolley!D37+MHH!D37,IF(ISBLANK(INDEX(ay_OpExAOEM,MATCH(sys_KeyOperator&\"Inhalation\",key_AOEM,0),18)),10^(INDEX(ay_OpExAOEM,MATCH(sys_KeyOperator&\"Inhalation\",key_AOEM,0),15)+(LOG(i_AmountAS1)*INDEX(ay_OpExAOEM,MATCH(sys_KeyOperator&\"Inhalation\",key_AOEM,0),16))+IF(AND(i_AppMeth=\"Upward spraying\",LEFT(i_AppEquip,15)=\"Vehicle-mounted\",d_AppPfCaBfR=\"Yes\"),0,IF(AND(i_Season=\"late (dense foliage)\",i_AppMeth=\"Upward spraying\",OR(i_AppEquip=\"Manual-Hand held\",i_AppEquip=\"Manual-Knapsack\")),0,INDEX(ay_OpExAOEM,MATCH(sys_KeyOperator&\"Inhalation\",key_AOEM,0),17)))),MAX(INDEX(ay_OpExAOEM,MATCH(sys_KeyOperator&\"Inhalation\",key_AOEM,0),18),(INDEX(ay_OpExAOEM,MATCH(sys_KeyOperator&\"Inhalation\",key_AOEM,0),18)/d_PctExtrapolation)*i_AmountAS1)))","v":{"$error":"#N/A"}},{"$f":"IF(i_AppEquip=\"Manual-Trolley\",Trolley!E37+MHH!E37,IF(ISBLANK(INDEX(ay_OpExAOEM,MATCH(sys_KeyOperator&\"Inhalation\",key_AOEM,0),22)),10^(INDEX(ay_OpExAOEM,MATCH(sys_KeyOperator&\"Inhalation\",key_AOEM,0),19)+(LOG(i_AmountAS1)*INDEX(ay_OpExAOEM,MATCH(sys_KeyOperator&\"Inhalation\",key_AOEM,0),20))+IF(AND(i_AppMeth=\"Upward spraying\",LEFT(i_AppEquip,15)=\"Vehicle-mounted\",d_AppPfCaBfR=\"Yes\"),0,IF(AND(i_Season=\"late (dense foliage)\",i_AppMeth=\"Upward spraying\",OR(i_AppEquip=\"Manual-Hand held\",i_AppEquip=\"Manual-Knapsack\")),0,INDEX(ay_OpExAOEM,MATCH(sys_KeyOperator&\"Inhalation\",key_AOEM,0),21)))),MAX(INDEX(ay_OpExAOEM,MATCH(sys_KeyOperator&\"Inhalation\",key_AOEM,0),22),(INDEX(ay_OpExAOEM,MATCH(sys_KeyOperator&\"Inhalation\",key_AOEM,0),22)/d_PctExtrapolation)*i_AmountAS1)))","v":{"$error":"#N/A"}},{"$f":"IF(i_AppEquip=\"Manual-Trolley\",Trolley!F37+MHH!F37,IF(ISBLANK(INDEX(ay_OpExAOEM,MATCH(sys_KeyOperator&\"Inhalation\",key_AOEM,0),18)),10^(INDEX(ay_OpExAOEM,MATCH(sys_KeyOperator&\"Inhalation\",key_AOEM,0),15)+(LOG(i_AmountAS2)*INDEX(ay_OpExAOEM,MATCH(sys_KeyOperator&\"Inhalation\",key_AOEM,0),16))+IF(AND(i_AppMeth=\"Upward spraying\",LEFT(i_AppEquip,15)=\"Vehicle-mounted\",d_AppPfCaBfR=\"Yes\"),0,IF(AND(i_Season=\"late (dense foliage)\",i_AppMeth=\"Upward spraying\",OR(i_AppEquip=\"Manual-Hand held\",i_AppEquip=\"Manual-Knapsack\")),0,INDEX(ay_OpExAOEM,MATCH(sys_KeyOperator&\"Inhalation\",key_AOEM,0),17)))),MAX(INDEX(ay_OpExAOEM,MATCH(sys_KeyOperator&\"Inhalation\",key_AOEM,0),18),(INDEX(ay_OpExAOEM,MATCH(sys_KeyOperator&\"Inhalation\",key_AOEM,0),18)/d_PctExtrapolation)*i_AmountAS2)))","v":{"$error":"#N/A"}},{"$f":"IF(i_AppEquip=\"Manual-Trolley\",Trolley!G37+MHH!G37,IF(ISBLANK(INDEX(ay_OpExAOEM,MATCH(sys_KeyOperator&\"Inhalation\",key_AOEM,0),22)),10^(INDEX(ay_OpExAOEM,MATCH(sys_KeyOperator&\"Inhalation\",key_AOEM,0),19)+(LOG(i_AmountAS2)*INDEX(ay_OpExAOEM,MATCH(sys_KeyOperator&\"Inhalation\",key_AOEM,0),20))+IF(AND(i_AppMeth=\"Upward spraying\",LEFT(i_AppEquip,15)=\"Vehicle-mounted\",d_AppPfCaBfR=\"Yes\"),0,IF(AND(i_Season=\"late (dense foliage)\",i_AppMeth=\"Upward spraying\",OR(i_AppEquip=\"Manual-Hand held\",i_AppEquip=\"Manual-Knapsack\")),0,INDEX(ay_OpExAOEM,MATCH(sys_KeyOperator&\"Inhalation\",key_AOEM,0),21)))),MAX(INDEX(ay_OpExAOEM,MATCH(sys_KeyOperator&\"Inhalation\",key_AOEM,0),22),(INDEX(ay_OpExAOEM,MATCH(sys_KeyOperator&\"Inhalation\",key_AOEM,0),22)/d_PctExtrapolation)*i_AmountAS2)))","v":{"$error":"#N/A"}},{"$f":"IF(i_AppEquip=\"Manual-Trolley\",Trolley!H37+MHH!H37,IF(ISBLANK(INDEX(ay_OpExAOEM,MATCH(sys_KeyOperator&\"Inhalation\",key_AOEM,0),18)),10^(INDEX(ay_OpExAOEM,MATCH(sys_KeyOperator&\"Inhalation\",key_AOEM,0),15)+(LOG(i_AmountAS3)*INDEX(ay_OpExAOEM,MATCH(sys_KeyOperator&\"Inhalation\",key_AOEM,0),16))+IF(AND(i_AppMeth=\"Upward spraying\",LEFT(i_AppEquip,15)=\"Vehicle-mounted\",d_AppPfCaBfR=\"Yes\"),0,IF(AND(i_Season=\"late (dense foliage)\",i_AppMeth=\"Upward spraying\",OR(i_AppEquip=\"Manual-Hand held\",i_AppEquip=\"Manual-Knapsack\")),0,INDEX(ay_OpExAOEM,MATCH(sys_KeyOperator&\"Inhalation\",key_AOEM,0),17)))),MAX(INDEX(ay_OpExAOEM,MATCH(sys_KeyOperator&\"Inhalation\",key_AOEM,0),18),(INDEX(ay_OpExAOEM,MATCH(sys_KeyOperator&\"Inhalation\",key_AOEM,0),18)/d_PctExtrapolation)*i_AmountAS3)))","v":{"$error":"#N/A"}},{"$f":"IF(i_AppEquip=\"Manual-Trolley\",Trolley!I37+MHH!I37,IF(ISBLANK(INDEX(ay_OpExAOEM,MATCH(sys_KeyOperator&\"Inhalation\",key_AOEM,0),22)),10^(INDEX(ay_OpExAOEM,MATCH(sys_KeyOperator&\"Inhalation\",key_AOEM,0),19)+(LOG(i_AmountAS3)*INDEX(ay_OpExAOEM,MATCH(sys_KeyOperator&\"Inhalation\",key_AOEM,0),20))+IF(AND(i_AppMeth=\"Upward spraying\",LEFT(i_AppEquip,15)=\"Vehicle-mounted\",d_AppPfCaBfR=\"Yes\"),0,IF(AND(i_Season=\"late (dense foliage)\",i_AppMeth=\"Upward spraying\",OR(i_AppEquip=\"Manual-Hand held\",i_AppEquip=\"Manual-Knapsack\")),0,INDEX(ay_OpExAOEM,MATCH(sys_KeyOperator&\"Inhalation\",key_AOEM,0),21)))),MAX(INDEX(ay_OpExAOEM,MATCH(sys_KeyOperator&\"Inhalation\",key_AOEM,0),22),(INDEX(ay_OpExAOEM,MATCH(sys_KeyOperator&\"Inhalation\",key_AOEM,0),22)/d_PctExtrapolation)*i_AmountAS3)))","v":{"$error":"#N/A"}},{"$f":"IF(i_AppEquip=\"Manual-Trolley\",Trolley!J37+MHH!J37,IF(ISBLANK(INDEX(ay_OpExAOEM,MATCH(sys_KeyOperator&\"Inhalation\",key_AOEM,0),18)),10^(INDEX(ay_OpExAOEM,MATCH(sys_KeyOperator&\"Inhalation\",key_AOEM,0),15)+(LOG(i_AmountAS4)*INDEX(ay_OpExAOEM,MATCH(sys_KeyOperator&\"Inhalation\",key_AOEM,0),16))+IF(AND(i_AppMeth=\"Upward spraying\",LEFT(i_AppEquip,15)=\"Vehicle-mounted\",d_AppPfCaBfR=\"Yes\"),0,IF(AND(i_Season=\"late (dense foliage)\",i_AppMeth=\"Upward spraying\",OR(i_AppEquip=\"Manual-Hand held\",i_AppEquip=\"Manual-Knapsack\")),0,INDEX(ay_OpExAOEM,MATCH(sys_KeyOperator&\"Inhalation\",key_AOEM,0),17)))),MAX(INDEX(ay_OpExAOEM,MATCH(sys_KeyOperator&\"Inhalation\",key_AOEM,0),18),(INDEX(ay_OpExAOEM,MATCH(sys_KeyOperator&\"Inhalation\",key_AOEM,0),18)/d_PctExtrapolation)*i_AmountAS4)))","v":{"$error":"#N/A"}},{"$f":"IF(i_AppEquip=\"Manual-Trolley\",Trolley!K37+MHH!K37,IF(ISBLANK(INDEX(ay_OpExAOEM,MATCH(sys_KeyOperator&\"Inhalation\",key_AOEM,0),22)),10^(INDEX(ay_OpExAOEM,MATCH(sys_KeyOperator&\"Inhalation\",key_AOEM,0),19)+(LOG(i_AmountAS4)*INDEX(ay_OpExAOEM,MATCH(sys_KeyOperator&\"Inhalation\",key_AOEM,0),20))+IF(AND(i_AppMeth=\"Upward spraying\",LEFT(i_AppEquip,15)=\"Vehicle-mounted\",d_AppPfCaBfR=\"Yes\"),0,IF(AND(i_Season=\"late (dense foliage)\",i_AppMeth=\"Upward spraying\",OR(i_AppEquip=\"Manual-Hand held\",i_AppEquip=\"Manual-Knapsack\")),0,INDEX(ay_OpExAOEM,MATCH(sys_KeyOperator&\"Inhalation\",key_AOEM,0),21)))),MAX(INDEX(ay_OpExAOEM,MATCH(sys_KeyOperator&\"Inhalation\",key_AOEM,0),22),(INDEX(ay_OpExAOEM,MATCH(sys_KeyOperator&\"Inhalation\",key_AOEM,0),22)/d_PctExtrapolation)*i_AmountAS4)))","v":{"$error":"#N/A"}},"AOEM"]
[null,null,"Protective Equipment","Select for inclusion",null,null,null,null,null,null,null,"Penetration factor","Inhalation Protection factor"]
[null,null,"Gloves","No",null,null,null,null,null,null,null,{"$f":"IF(D39=\"Yes\",\"Incl. in AOEM model\",\"\")","v":""}]
[null,null,"Clothing","Work wear - arms, body and legs covered",null,null,null,null,null,null,null,"Incl. in AOEM model"]
[null,null,"Head and respiratory PPE","None",null,null,null,null,null,null,null,{"$f":"INDEX(ay_MixPPEHead,MATCH(D41,key_MixPPEHead,0),2)","v":1},{"$f":"IF(OR(D41=\"Hood and face shield\",D41=\"Hood\"),1,INDEX(ay_MixRPE,MATCH(D41,key_MixRPE,0),2))","v":1}]
[null,null,"Cabin","Not relevant",null,null,null,null,null,null,null,{"$f":"IF(i_AppEquip&i_AppMeth<>\"Vehicle-mountedUpward spraying\",\"Vehicle-mounted upward spraying only\",\"\")","v":"Vehicle-mounted upward spraying only"}]
[]
[null,"1. Total",null,{"$f":"i_SubstName1","v":0},null,{"$f":"i_SubstName2","v":0},null,{"$f":"i_SubstName3","v":0},null,{"$f":"i_SubstName4","v":0},null,"Combined"]
[null,null,null,"Without RPE/PPE","With RPE/PPE ","Without RPE/PPE","With RPE/PPE ","Without RPE/PPE","With RPE/PPE ","Without RPE/PPE","With RPE/PPE ","Without RPE/PPE","With RPE/PPE "]
[null,"Short-term"]
[null,"Total systemic exposure from ML and application (mg a.s./day)",null,{"$f":"(D63+D79)","v":{"$error":"#N/A"}},{"$f":"(D70+D85)","v":{"$error":"#N/A"}},{"$f":"(F63+F79)","v":{"$error":"#N/A"}},{"$f":"(F70+F85)","v":{"$error":"#N/A"}},{"$f":"(H63+H79)","v":{"$error":"#N/A"}},{"$f":"(H70+H85)","v":{"$error":"#N/A"}},{"$f":"(J63+J79)","v":{"$error":"#N/A"}},{"$f":"(J70+J85)","v":{"$error":"#N/A"}}]
[null,"Total systemic dose from ML and application per kg body weight (mg/kg bw/day)",null,{"$f":"D47/d_BwAdult","v":{"$error":"#N/A"}},{"$error":"#N/A"},{"$error":"#N/A"},{"$error":"#N/A"},{"$error":"#N/A"},{"$error":"#N/A"},{"$error":"#N/A"},{"$error":"#N/A"},"Hazard index"]
[null,"% of AOEL",null,{"$f":"IFERROR(D48/i_AOEL1,0)","v":0},{"$f":"IFERROR(E48/i_AOEL1,0)","v":0},{"$f":"IFERROR(F48/i_AOEL2,0)","v":0},{"$f":"IFERROR(G48/i_AOEL2,0)","v":0},{"$f":"IFERROR(H48/i_AOEL3,0)","v":0},{"$f":"IFERROR(I48/i_AOEL3,0)","v":0},{"$f":"IFERROR(J48/i_AOEL4,0)","v":0},{"$f":"IFERROR(K48/i_AOEL4,0)","v":0},{"$f":"IF(COUNTA('Data entry'!D26:G26)<2,\"N/A\",FIXED(D49+F49+H49+J49,3))","v":"N/A"},{"$f":"IF(COUNTA('Data entry'!D26:G26)<2,\"N/A\",FIXED(E49+G49+I49+K49,3))","v":"N/A"}]
[null,"Acute "]
[null,"Total systemic exposure from ML and application (mg a.s./day)",null,{"$f":"(D95+D111)","v":{"$error":"#N/A"}},{"$f":"(D102+D117)","v":{"$error":"#N/A"}},{"$f":"(F95+F111)","v":{"$error":"#N/A"}},{"$f":"(F102+F117)","v":{"$error":"#N/A"}},{"$f":"(H95+H111)","v":{"$error":"#N/A"}},{"$f":"(H102+H117)","v":{"$error":"#N/A"}},{"$f":"(J95+J111)","v":{"$error":"#N/A"}},{"$f":"(J102+J117)","v":{"$error":"#N/A"}}]
[null,"Total systemic dose from ML and application per kg body weight (mg/kg bw/day)",null,{"$f":"D51/d_BwAdult","v":{"$error":"#N/A"}},{"$error":"#N/A"},{"$error":"#N/A"},{"$error":"#N/A"},{"$error":"#N/A"},{"$error":"#N/A"},{"$error":"#N/A"},{"$error":"#N/A"},"Hazard index"]
[null,"% of AAOEL",null,{"$f":"IFERROR(D52/i_AAOEL1,0)","v":0},{"$f":"IFERROR(E52/i_AAOEL1,0)","v":0},{"$f":"IFERROR(F52/i_AAOEL2,0)","v":0},{"$f":"IFERROR(G52/i_AAOEL2,0)","v":0},{"$f":"IFERROR(H52/i_AAOEL3,0)","v":0},{"$f":"IFERROR(I52/i_AAOEL3,0)","v":0},{"$f":"IFERROR(J52/i_AAOEL4,0)","v":0},{"$f":"IFERROR(K52/i_AAOEL4,0)","v":0},{"$f":"IF(COUNTA('Data entry'!D27:G27)<2,\"N/A\",FIXED(D53+F53+H53+J53,3))","v":"N/A"},{"$f":"IF(COUNTA('Data entry'!D27:G28)<2,\"N/A\",FIXED(E53+G53+I53+K53,3))","v":"N/A"}]
[]
[null,"2. Short-term exposure"]
[null,"2.1 Mixing and loading",null,{"$f":"i_SubstName1","v":0},null,{"$f":"i_SubstName2","v":0},null,{"$f":"i_SubstName3","v":0},null,{"$f":"i_SubstName4","v":0}]
[null,null,null,"Systemic exposure [mg a.s. /day]","Systemic dose [mg a.s./kg bw/day]","Systemic exposure [mg a.s. /day]","Systemic dose [mg a.s./kg bw/day]","Systemic exposure [mg a.s. /day]","Systemic dose [mg a.s./kg bw/day]","Systemic exposure [mg a.s. /day]","Systemic dose [mg a.s./kg bw/day]"]
[null,"Without RPE/PPE"]
[null,"Hands",null,{"$f":"D17*i_AbsorpProduct1/1000","v":{"$error":"#N/A"}},{"$f":"D59/d_BwAdult","v":{"$error":"#N/A"}},{"$f":"F17*i_AbsorpProduct2/1000","v":{"$error":"#N/A"}},{"$f":"F59/d_BwAdult","v":{"$error":"#N/A"}},{"$f":"H17*i_AbsorpProduct3/1000","v":{"$error":"#N/A"}},{"$f":"H59/d_BwAdult","v":{"$error":"#N/A"}},{"$f":"J17*i_AbsorpProduct4/1000","v":{"$error":"#N/A"}},{"$f":"J59/d_BwAdult","v":{"$error":"#N/A"}},null,null,{"$f":"E59*1000","v":{"$error":"#N/A"}},null,{"$f":"G59*1000","v":{"$error":"#N/A"}}]
[null,"Body",null,{"$f":"D18*i_AbsorpProduct1/1000","v":{"$error":"#N/A"}},{"$f":"D60/d_BwAdult","v":{"$error":"#N/A"}},{"$f":"F18*i_AbsorpProduct2/1000","v":{"$error":"#N/A"}},{"$f":"F60/d_BwAdult","v":{"$error":"#N/A"}},{"$f":"H18*i_AbsorpProduct3/1000","v":{"$error":"#N/A"}},{"$f":"H60/d_BwAdult","v":{"$error":"#N/A"}},{"$f":"J18*i_AbsorpProduct4/1000","v":{"$error":"#N/A"}},{"$f":"J60/d_BwAdult","v":{"$error":"#N/A"}},null,null,{"$f":"E60*1000","v":{"$error":"#N/A"}},null,{"$f":"G60*1000","v":{"$error":"#N/A"}}]
[null,"Head",null,{"$f":"D19*i_AbsorpProduct1/1000","v":{"$error":"#N/A"}},{"$f":"D61/d_BwAdult","v":{"$error":"#N/A"}},{"$f":"F19*i_AbsorpProduct2/1000","v":{"$error":"#N/A"}},{"$f":"F61/d_BwAdult","v":{"$error":"#N/A"}},{"$f":"H19*i_AbsorpProduct3/1000","v":{"$error":"#N/A"}},{"$f":"H61/d_BwAdult","v":{"$error":"#N/A"}},{"$f":"J19*i_AbsorpProduct4/1000","v":{"$error":"#N/A"}},{"$f":"J61/d_BwAdult","v":{"$error":"#N/A"}},null,null,{"$f":"E61*1000","v":{"$error":"#N/A"}},null,{"$f":"G61*1000","v":{"$error":"#N/A"}}]
[null,"Inhalation",null,{"$f":"D23*i_AbsorpInhalation1/1000","v":{"$error":"#N/A"}},{"$f":"D62/d_BwAdult","v":{"$error":"#N/A"}},{"$f":"F23*i_AbsorpInhalation2/1000","v":{"$error":"#N/A"}},{"$f":"F62/d_BwAdult","v":{"$error":"#N/A"}},{"$f":"H23*i_AbsorpInhalation3/1000","v":{"$error":"#N/A"}},{"$f":"H62/d_BwAdult","v":{"$error":"#N/A"}},{"$f":"J23*i_AbsorpInhalation4/1000","v":{"$error":"#N/A"}},{"$f":"J62/d_BwAdult","v":{"$error":"#N/A"}},null,null,{"$f":"E62*1000","v":{"$error":"#N/A"}},null,{"$f":"G62*1000","v":{"$error":"#N/A"}}]
[null,"Sum ",null,{"$f":"D59+D60+D61+D62","v":{"$error":"#N/A"}},{"$f":"D63/d_BwAdult","v":{"$error":"#N/A"}},{"$f":"F59+F60+F61+F62","v":{"$error":"#N/A"}},{"$f":"F63/d_BwAdult","v":{"$error":"#N/A"}},{"$f":"H59+H60+H61+H62","v":{"$error":"#N/A"}},{"$f":"H63/d_BwAdult","v":{"$error":"#N/A"}},{"$f":"J59+J60+J61+J62","v":{"$error":"#N/A"}},{"$f":"J63/d_BwAdult","v":{"$error":"#N/A"}},null,null,{"$f":"E63*1000","v":{"$error":"#N/A"}},null,{"$f":"G63*1000","v":{"$error":"#N/A"}}]
[null,"With RPE/PPE (as selected above)"]
[null,"Hands",null,{"$f":"IF(D25=\"Yes\", D20,D17)*i_AbsorpProduct1/1000","v":{"$error":"#N/A"}},{"$f":"D65/d_BwAdult","v":{"$error":"#N/A"}},{"$f":"IF(D25=\"Yes\", F20,F17)*i_AbsorpProduct2/1000","v":{"$error":"#N/A"}},{"$f":"F65/d_BwAdult","v":{"$error":"#N/A"}},{"$f":"IF(D25=\"Yes\", H20,H17)*i_AbsorpProduct3/1000","v":{"$error":"#N/A"}},{"$f":"H65/d_BwAdult","v":{"$error":"#N/A"}},{"$f":"IF(D25=\"Yes\", J20,J17)*i_AbsorpProduct4/1000","v":{"$error":"#N/A"}},{"$f":"J65/d_BwAdult","v":{"$error":"#N/A"}},null,null,{"$f":"E65*1000","v":{"$error":"#N/A"}},null,{"$f":"G65*1000","v":{"$error":"#N/A"}}]
[null,"Body",null,{"$f":"IF($D$26<>\"Potential exposure\",D21,D18)*i_AbsorpProduct1/1000","v":{"$error":"#N/A"}},{"$error":"#N/A"},{"$f":"IF(D26<>\"Potential exposure\",F21,F18)*i_AbsorpProduct2/1000","v":{"$error":"#N/A"}},{"$error":"#N/A"},{"$f":"IF(D26<>\"Potential exposure\",H21,H18)*i_AbsorpProduct3/1000","v":{"$error":"#N/A"}},{"$error":"#N/A"},{"$f":"IF(D26<>\"Potential exposure\",J21,J18)*i_AbsorpProduct4/1000","v":{"$error":"#N/A"}},{"$error":"#N/A"},null,null,{"$f":"E66*1000","v":{"$error":"#N/A"}},null,{"$f":"G66*1000","v":{"$error":"#N/A"}}]
[null,"Head",null,{"$f":"IF($D27<>\"None\",D22*i_AbsorpProduct1,D19*i_AbsorpProduct1)/1000","v":{"$error":"#N/A"}},{"$error":"#N/A"},{"$f":"IF($D27<>\"None\",F22*i_AbsorpProduct2,F19*i_AbsorpProduct2)/1000","v":{"$error":"#N/A"}},{"$error":"#N/A"},{"$f":"IF($D27<>\"None\",H22*i_AbsorpProduct3,H19*i_AbsorpProduct3)/1000","v":{"$error":"#N/A"}},{"$error":"#N/A"},{"$f":"IF($D27<>\"None\",J22*i_AbsorpProduct4,J19*i_AbsorpProduct4)/1000","v":{"$error":"#N/A"}},{"$error":"#N/A"},null,null,{"$f":"E67*1000","v":{"$error":"#N/A"}},null,{"$f":"G67*1000","v":{"$error":"#N/A"}}]
[null,"Inhalation",null,{"$f":"D23*i_AbsorpInhalation1*$M27/1000","v":{"$error":"#N/A"}},{"$error":"#N/A"},{"$f":"F23*i_AbsorpInhalation2*$M27/1000","v":{"$error":"#N/A"}},{"$error":"#N/A"},{"$f":"H23*i_AbsorpInhalation3*$M27/1000","v":{"$error":"#N/A"}},{"$error":"#N/A"},{"$f":"J23*i_AbsorpInhalation4*$M27/1000","v":{"$error":"#N/A"}},{"$error":"#N/A"},null,null,{"$f":"E68*1000","v":{"$error":"#N/A"}},null,{"$f":"G68*1000","v":{"$error":"#N/A"}}]
[null,"Sum ",null,{"$f":"SUM(D65:D68)","v":{"$error":"#N/A"}},{"$error":"#N/A"},{"$f":"SUM(F65:F68)","v":{"$error":"#N/A"}},{"$error":"#N/A"},{"$f":"SUM(H65:H68)","v":{"$error":"#N/A"}},{"$error":"#N/A"},{"$f":"SUM(J65:J68)","v":{"$error":"#N/A"}},{"$error":"#N/A"},null,null,{"$f":"E69*1000","v":{"$error":"#N/A"}},null,{"$f":"G69*1000","v":{"$error":"#N/A"}}]
[null,"Water soluble bag",null,{"$f":"D69*$L28","v":{"$error":"#N/A"}},{"$error":"#N/A"},{"$f":"F69*$L28","v":{"$error":"#N/A"}},{"$error":"#N/A"},{"$f":"H69*$L28","v":{"$error":"#N/A"}},{"$error":"#N/A"},{"$f":"J69*$L28","v":{"$error":"#N/A"}},{"$error":"#N/A"}]
[]
[null,"2.2 Application",null,{"$f":"i_SubstName1","v":0},null,{"$f":"i_SubstName2","v":0},null,{"$f":"i_SubstName3","v":0},null,{"$f":"i_SubstName4","v":0}]
[null,null,null,"Systemic exposure [mg a.s. /day]","Systemic dose [mg a.s./kg bw/day]","Systemic exposure [mg a.s. /day]","Systemic dose [mg a.s./kg bw/day]","Systemic exposure [mg a.s. /day]","Systemic dose [mg a.s./kg bw/day]","Systemic exposure [mg a.s. /day]","Systemic dose [mg a.s./kg bw/day]"]
[null,"Without RPE/PPE"]
[null,"Hands",null,{"$f":"D32*i_AbsorpInuse1/1000","v":{"$error":"#N/A"}},{"$f":"D75/d_BwAdult","v":{"$error":"#N/A"}},{"$f":"F32*i_AbsorpInuse2/1000","v":{"$error":"#N/A"}},{"$f":"F75/d_BwAdult","v":{"$error":"#N/A"}},{"$f":"H32*i_AbsorpInuse3/1000","v":{"$error":"#N/A"}},{"$f":"H75/d_BwAdult","v":{"$error":"#N/A"}},{"$f":"J32*i_AbsorpInuse4/1000","v":{"$error":"#N/A"}},{"$f":"J75/d_BwAdult","v":{"$error":"#N/A"}},null,null,{"$f":"E75*1000","v":{"$error":"#N/A"}},null,{"$f":"G75*1000","v":{"$error":"#N/A"}}]
[null,"Body",null,{"$f":"D33*i_AbsorpInuse1/1000","v":{"$error":"#N/A"}},{"$f":"D76/d_BwAdult","v":{"$error":"#N/A"}},{"$f":"F33*i_AbsorpInuse2/1000","v":{"$error":"#N/A"}},{"$f":"F76/d_BwAdult","v":{"$error":"#N/A"}},{"$f":"H33*i_AbsorpInuse3/1000","v":{"$error":"#N/A"}},{"$f":"H76/d_BwAdult","v":{"$error":"#N/A"}},{"$f":"J33*i_AbsorpInuse4/1000","v":{"$error":"#N/A"}},{"$f":"J76/d_BwAdult","v":{"$error":"#N/A"}},null,null,{"$f":"E76*1000","v":{"$error":"#N/A"}},null,{"$f":"G76*1000","v":{"$error":"#N/A"}}]
[null,"Head",null,{"$f":"D34*i_AbsorpInuse1/1000","v":{"$error":"#N/A"}},{"$f":"D77/d_BwAdult","v":{"$error":"#N/A"}},{"$f":"F34*i_AbsorpInuse2/1000","v":{"$error":"#N/A"}},{"$f":"F77/d_BwAdult","v":{"$error":"#N/A"}},{"$f":"H34*i_AbsorpInuse3/1000","v":{"$error":"#N/A"}},{"$f":"H77/d_BwAdult","v":{"$error":"#N/A"}},{"$f":"J34*i_AbsorpInuse4/1000","v":{"$error":"#N/A"}},{"$f":"J77/d_BwAdult","v":{"$error":"#N/A"}},null,null,{"$f":"E77*1000","v":{"$error":"#N/A"}},null,{"$f":"G77*1000","v":{"$error":"#N/A"}}]
[null,"Inhalation",null,{"$f":"D37*i_AbsorpInhalation1/1000","v":{"$error":"#N/A"}},{"$f":"D78/d_BwAdult","v":{"$error":"#N/A"}},{"$f":"F37*i_AbsorpInhalation2/1000","v":{"$error":"#N/A"}},{"$f":"F78/d_BwAdult","v":{"$error":"#N/A"}},{"$f":"H37*i_AbsorpInhalation3/1000","v":{"$error":"#N/A"}},{"$f":"H78/d_BwAdult","v":{"$error":"#N/A"}},{"$f":"J37*i_AbsorpInhalation4/1000","v":{"$error":"#N/A"}},{"$f":"J78/d_BwAdult","v":{"$error":"#N/A"}},null,null,{"$f":"E78*1000","v":{"$error":"#N/A"}},null,{"$f":"G78*1000","v":{"$error":"#N/A"}}]
[null,"Sum ",null,{"$f":"D75+D76+D77+D78","v":{"$error":"#N/A"}},{"$f":"D79/d_BwAdult","v":{"$error":"#N/A"}},{"$f":"F75+F76+F77+F78","v":{"$error":"#N/A"}},{"$f":"F79/d_BwAdult","v":{"$error":"#N/A"}},{"$f":"H75+H76+H77+H78","v":{"$error":"#N/A"}},{"$f":"H79/d_BwAdult","v":{"$error":"#N/A"}},{"$f":"J75+J76+J77+J78","v":{"$error":"#N/A"}},{"$f":"J79/d_BwAdult","v":{"$error":"#N/A"}},null,null,{"$f":"E79*1000","v":{"$error":"#N/A"}},null,{"$f":"G79*1000","v":{"$error":"#N/A"}}]
[null,"With RPE/PPE (as selected above)"]
[null,"Hands",null,{"$f":"IF(D39=\"Yes\", D35,D32)*i_AbsorpInuse1/1000","v":{"$error":"#N/A"}},{"$f":"D81/d_BwAdult","v":{"$error":"#N/A"}},{"$f":"IF(D39=\"Yes\", F35,F32)*i_AbsorpInuse2/1000","v":{"$error":"#N/A"}},{"$f":"F81/d_BwAdult","v":{"$error":"#N/A"}},{"$f":"IF(D39=\"Yes\", H35,H32)*i_AbsorpInuse3/1000","v":{"$error":"#N/A"}},{"$f":"H81/d_BwAdult","v":{"$error":"#N/A"}},{"$f":"IF(D39=\"Yes\", J35,J32)*i_AbsorpInuse4/1000","v":{"$error":"#N/A"}},{"$f":"J81/d_BwAdult","v":{"$error":"#N/A"}},null,null,{"$f":"E81*1000","v":{"$error":"#N/A"}},null,{"$f":"G81*1000","v":{"$error":"#N/A"}}]
[null,"Body",null,{"$f":"IF(D40<>\"Potential exposure\",D36,D33)*i_AbsorpInuse1/1000","v":{"$error":"#N/A"}},{"$f":"D82/d_BwAdult","v":{"$error":"#N/A"}},{"$f":"IF(D40<>\"Potential exposure\",F36,F33)*i_AbsorpInuse2/1000","v":{"$error":"#N/A"}},{"$f":"F82/d_BwAdult","v":{"$error":"#N/A"}},{"$f":"IF(D40<>\"Potential exposure\",H36,H33)*i_AbsorpInuse3/1000","v":{"$error":"#N/A"}},{"$f":"H82/d_BwAdult","v":{"$error":"#N/A"}},{"$f":"IF(D40<>\"Potential exposure\",J36,J33)*i_AbsorpInuse4/1000","v":{"$error":"#N/A"}},{"$f":"J82/d_BwAdult","v":{"$error":"#N/A"}},null,null,{"$f":"E82*1000","v":{"$error":"#N/A"}},null,{"$f":"G82*1000","v":{"$error":"#N/A"}}]
[null,"Head",null,{"$f":"D34*i_AbsorpInuse1*$L41/1000","v":{"$error":"#N/A"}},{"$f":"D83/d_BwAdult","v":{"$error":"#N/A"}},{"$f":"F34*i_AbsorpInuse2*L41/1000","v":{"$error":"#N/A"}},{"$f":"F83/d_BwAdult","v":{"$error":"#N/A"}},{"$f":"H34*i_AbsorpInuse3*L41/1000","v":{"$error":"#N/A"}},{"$f":"H83/d_BwAdult","v":{"$error":"#N/A"}},{"$f":"J34*i_AbsorpInuse4*L41/1000","v":{"$error":"#N/A"}},{"$f":"J83/d_BwAdult","v":{"$error":"#N/A"}},null,null,{"$f":"E83*1000","v":{"$error":"#N/A"}},null,{"$f":"G83*1000","v":{"$error":"#N/A"}}]
[null,"Inhalation",null,{"$f":"D37*i_AbsorpInhalation1*$M41/1000","v":{"$error":"#N/A"}},{"$f":"D84/d_BwAdult","v":{"$error":"#N/A"}},{"$f":"F37*i_AbsorpInhalation2*$M41/1000","v":{"$error":"#N/A"}},{"$f":"F84/d_BwAdult","v":{"$error":"#N/A"}},{"$f":"H37*i_AbsorpInhalation3*$M41/1000","v":{"$error":"#N/A"}},{"$f":"H84/d_BwAdult","v":{"$error":"#N/A"}},{"$f":"J37*i_AbsorpInhalation4*$M41/1000","v":{"$error":"#N/A"}},{"$f":"J84/d_BwAdult","v":{"$error":"#N/A"}},null,null,{"$f":"E84*1000","v":{"$error":"#N/A"}},null,{"$f":"G84*1000","v":{"$error":"#N/A"}}]
[null,"Sum ",null,{"$f":"SUM(D81:D84)","v":{"$error":"#N/A"}},{"$f":"D85/d_BwAdult","v":{"$error":"#N/A"}},{"$f":"SUM(F81:F84)","v":{"$error":"#N/A"}},{"$f":"F85/d_BwAdult","v":{"$error":"#N/A"}},{"$f":"SUM(H81:H84)","v":{"$error":"#N/A"}},{"$f":"H85/d_BwAdult","v":{"$error":"#N/A"}},{"$f":"SUM(J81:J84)","v":{"$error":"#N/A"}},{"$f":"J85/d_BwAdult","v":{"$error":"#N/A"}},null,null,{"$f":"E85*1000","v":{"$error":"#N/A"}},null,{"$f":"G85*1000","v":{"$error":"#N/A"}}]
[]
[null,"3. Acute exposure"]
[null,"3.1 Mixing and loading",null,{"$f":"i_SubstName1","v":0},null,{"$f":"i_SubstName2","v":0},null,{"$f":"i_SubstName3","v":0},null,{"$f":"i_SubstName4","v":0}]
[null,null,null,"Systemic exposure [mg a.s. /day]","Systemic dose [mg a.s./kg bw/day]","Systemic exposure [mg a.s. /day]","Systemic dose [mg a.s./kg bw/day]","Systemic exposure [mg a.s. /day]","Systemic dose [mg a.s./kg bw/day]","Systemic exposure [mg a.s. /day]","Systemic dose [mg a.s./kg bw/day]"]
[null,"Without RPE/PPE"]
[null,"Hands",null,{"$f":"E17*i_AbsorpProduct1/1000","v":{"$error":"#N/A"}},{"$f":"D91/d_BwAdult","v":{"$error":"#N/A"}},{"$f":"G17*i_AbsorpProduct2/1000","v":{"$error":"#N/A"}},{"$f":"F91/d_BwAdult","v":{"$error":"#N/A"}},{"$f":"I17*i_AbsorpProduct3/1000","v":{"$error":"#N/A"}},{"$f":"H91/d_BwAdult","v":{"$error":"#N/A"}},{"$f":"K17*i_AbsorpProduct4/1000","v":{"$error":"#N/A"}},{"$f":"J91/d_BwAdult","v":{"$error":"#N/A"}},null,null,{"$f":"E91*1000","v":{"$error":"#N/A"}},null,{"$f":"G91*1000","v":{"$error":"#N/A"}}]
[null,"Body",null,{"$f":"E18*i_AbsorpProduct1/1000","v":{"$error":"#N/A"}},{"$f":"D92/d_BwAdult","v":{"$error":"#N/A"}},{"$f":"G18*i_AbsorpProduct2/1000","v":{"$error":"#N/A"}},{"$f":"F92/d_BwAdult","v":{"$error":"#N/A"}},{"$f":"I18*i_AbsorpProduct3/1000","v":{"$error":"#N/A"}},{"$f":"H92/d_BwAdult","v":{"$error":"#N/A"}},{"$f":"K18*i_AbsorpProduct4/1000","v":{"$error":"#N/A"}},{"$f":"J92/d_BwAdult","v":{"$error":"#N/A"}},null,null,{"$f":"E92*1000","v":{"$error":"#N/A"}},null,{"$f":"G92*1000","v":{"$error":"#N/A"}}]
[null,"Head",null,{"$f":"E19*i_AbsorpProduct1/1000","v":{"$error":"#N/A"}},{"$f":"D93/d_BwAdult","v":{"$error":"#N/A"}},{"$f":"G19*i_AbsorpProduct2/1000","v":{"$error":"#N/A"}},{"$f":"F93/d_BwAdult","v":{"$error":"#N/A"}},{"$f":"I19*i_AbsorpProduct3/1000","v":{"$error":"#N/A"}},{"$f":"H93/d_BwAdult","v":{"$error":"#N/A"}},{"$f":"K19*i_AbsorpProduct4/1000","v":{"$error":"#N/A"}},{"$f":"J93/d_BwAdult","v":{"$error":"#N/A"}},null,null,{"$f":"E93*1000","v":{"$error":"#N/A"}},null,{"$f":"G93*1000","v":{"$error":"#N/A"}}]
[null,"Inhalation",null,{"$f":"E23*i_AbsorpInhalation1/1000","v":{"$error":"#N/A"}},{"$f":"D94/d_BwAdult","v":{"$error":"#N/A"}},{"$f":"G23*i_AbsorpInhalation2/1000","v":{"$error":"#N/A"}},{"$f":"F94/d_BwAdult","v":{"$error":"#N/A"}},{"$f":"I23*i_AbsorpInhalation3/1000","v":{"$error":"#N/A"}},{"$f":"H94/d_BwAdult","v":{"$error":"#N/A"}},{"$f":"K23*i_AbsorpInhalation4/1000","v":{"$error":"#N/A"}},{"$f":"J94/d_BwAdult","v":{"$error":"#N/A"}},null,null,{"$f":"E94*1000","v":{"$error":"#N/A"}},null,{"$f":"G94*1000","v":{"$error":"#N/A"}}]
[null,"Sum ",null,{"$f":"D91+D92+D93+D94","v":{"$error":"#N/A"}},{"$f":"D95/d_BwAdult","v":{"$error":"#N/A"}},{"$f":"F91+F92+F93+F94","v":{"$error":"#N/A"}},{"$f":"F95/d_BwAdult","v":{"$error":"#N/A"}},{"$f":"H91+H92+H93+H94","v":{"$error":"#N/A"}},{"$f":"H95/d_BwAdult","v":{"$error":"#N/A"}},{"$f":"J91+J92+J93+J94","v":{"$error":"#N/A"}},{"$f":"J95/d_BwAdult","v":{"$error":"#N/A"}},null,null,{"$f":"E95*1000","v":{"$error":"#N/A"}},null,{"$f":"G95*1000","v":{"$error":"#N/A"}}]
[null,"With RPE/PPE (as selected above)"]
[null,"Hands",null,{"$f":"IF(D25=\"Yes\", E20,E17)*i_AbsorpProduct1/1000","v":{"$error":"#N/A"}},{"$f":"D97/d_BwAdult","v":{"$error":"#N/A"}},{"$f":"IF(D25=\"Yes\", G20,G17)*i_AbsorpProduct2/1000","v":{"$error":"#N/A"}},{"$f":"F97/d_BwAdult","v":{"$error":"#N/A"}},{"$f":"IF(D25=\"Yes\", I20,I17)*i_AbsorpProduct3/1000","v":{"$error":"#N/A"}},{"$f":"H97/d_BwAdult","v":{"$error":"#N/A"}},{"$f":"IF(D25=\"Yes\", K20,K17)*i_AbsorpProduct4/1000","v":{"$error":"#N/A"}},{"$f":"J97/d_BwAdult","v":{"$error":"#N/A"}},null,null,{"$f":"E97*1000","v":{"$error":"#N/A"}},null,{"$f":"G97*1000","v":{"$error":"#N/A"}}]
[null,"Body",null,{"$f":"IF($D$26<>\"Potential exposure\",E21,E18)*i_AbsorpProduct1/1000","v":{"$error":"#N/A"}},{"$error":"#N/A"},{"$f":"IF($D$26<>\"Potential exposure\",G21,G18)*i_AbsorpProduct2/1000","v":{"$error":"#N/A"}},{"$error":"#N/A"},{"$f":"IF($D$26<>\"Potential exposure\",I21,I18)*i_AbsorpProduct3/1000","v":{"$error":"#N/A"}},{"$error":"#N/A"},{"$f":"IF($D$26<>\"Potential exposure\",K21,K18)*i_AbsorpProduct4/1000","v":{"$error":"#N/A"}},{"$error":"#N/A"},null,null,{"$f":"E98*1000","v":{"$error":"#N/A"}},null,{"$f":"G98*1000","v":{"$error":"#N/A"}}]
[null,"Head",null,{"$f":"IF($D27<>\"None\",E22*i_AbsorpProduct1,E19*i_AbsorpProduct1)/1000","v":{"$error":"#N/A"}},{"$error":"#N/A"},{"$f":"IF($D27<>\"None\",G22*i_AbsorpProduct2,G19*i_AbsorpProduct2)/1000","v":{"$error":"#N/A"}},{"$error":"#N/A"},{"$f":"IF($D27<>\"None\",I22*i_AbsorpProduct3,I19*i_AbsorpProduct3)/1000","v":{"$error":"#N/A"}},{"$error":"#N/A"},{"$f":"IF($D27<>\"None\",K22*i_AbsorpProduct4,K19*i_AbsorpProduct4)/1000","v":{"$error":"#N/A"}},{"$error":"#N/A"},null,null,{"$f":"E99*1000","v":{"$error":"#N/A"}},null,{"$f":"G99*1000","v":{"$error":"#N/A"}}]
[null,"Inhalation",null,{"$f":"E23*i_AbsorpInhalation1*$M27/1000","v":{"$error":"#N/A"}},{"$error":"#N/A"},{"$f":"G23*i_AbsorpInhalation2*$M27/1000","v":{"$error":"#N/A"}},{"$error":"#N/A"},{"$f":"I23*i_AbsorpInhalation3*$M27/1000","v":{"$error":"#N/A"}},{"$error":"#N/A"},{"$f":"K23*i_AbsorpInhalation4*$M27/1000","v":{"$error":"#N/A"}},{"$error":"#N/A"},null,null,{"$f":"E100*1000","v":{"$error":"#N/A"}},null,{"$f":"G100*1000","v":{"$error":"#N/A"}}]
[null,"Sum ",null,{"$f":"SUM(D97:D100)","v":{"$error":"#N/A"}},{"$error":"#N/A"},{"$f":"SUM(F97:F100)","v":{"$error":"#N/A"}},{"$error":"#N/A"},{"$f":"SUM(H97:H100)","v":{"$error":"#N/A"}},{"$error":"#N/A"},{"$f":"SUM(J97:J100)","v":{"$error":"#N/A"}},{"$error":"#N/A"},null,null,{"$f":"E101*1000","v":{"$error":"#N/A"}},null,{"$f":"G101*1000","v":{"$error":"#N/A"}}]
[null,"Water soluble bag",null,{"$f":"D101*$L28","v":{"$error":"#N/A"}},{"$error":"#N/A"},{"$f":"F101*$L28","v":{"$error":"#N/A"}},{"$error":"#N/A"},{"$f":"H101*$L28","v":{"$error":"#N/A"}},{"$error":"#N/A"},{"$f":"J101*$L28","v":{"$error":"#N/A"}},{"$error":"#N/A"}]
[]
[null,"2.2 Application",null,{"$f":"i_SubstName1","v":0},null,{"$f":"i_SubstName2","v":0},null,{"$f":"i_SubstName3","v":0},null,{"$f":"i_SubstName4","v":0}]
[null,null,null,"Systemic exposure [mg a.s. /day]","Systemic dose [mg a.s./kg bw/day]","Systemic exposure [mg a.s. /day]","Systemic dose [mg a.s./kg bw/day]","Systemic exposure [mg a.s. /day]","Systemic dose [mg a.s./kg bw/day]","Systemic exposure [mg a.s. /day]","Systemic dose [mg a.s./kg bw/day]"]
[null,"Without RPE/PPE"]
[null,"Hands",null,{"$f":"E32*i_AbsorpInuse1/1000","v":{"$error":"#N/A"}},{"$f":"D107/d_BwAdult","v":{"$error":"#N/A"}},{"$f":"G32*i_AbsorpInuse2/1000","v":{"$error":"#N/A"}},{"$f":"F107/d_BwAdult","v":{"$error":"#N/A"}},{"$f":"I32*i_AbsorpInuse3/1000","v":{"$error":"#N/A"}},{"$f":"H107/d_BwAdult","v":{"$error":"#N/A"}},{"$f":"K32*i_AbsorpInuse4/1000","v":{"$error":"#N/A"}},{"$f":"J107/d_BwAdult","v":{"$error":"#N/A"}},null,null,{"$f":"E107*1000","v":{"$error":"#N/A"}},null,{"$f":"G107*1000","v":{"$error":"#N/A"}}]
[null,"Body",null,{"$f":"E33*i_AbsorpInuse1/1000","v":{"$error":"#N/A"}},{"$f":"D108/d_BwAdult","v":{"$error":"#N/A"}},{"$f":"G33*i_AbsorpInuse2/1000","v":{"$error":"#N/A"}},{"$f":"F108/d_BwAdult","v":{"$error":"#N/A"}},{"$f":"I33*i_AbsorpInuse3/1000","v":{"$error":"#N/A"}},{"$f":"H108/d_BwAdult","v":{"$error":"#N/A"}},{"$f":"K33*i_AbsorpInuse4/1000","v":{"$error":"#N/A"}},{"$f":"J108/d_BwAdult","v":{"$error":"#N/A"}},null,null,{"$f":"E108*1000","v":{"$error":"#N/A"}},null,{"$f":"G108*1000","v":{"$error":"#N/A"}}]
[null,"Head",null,{"$f":"E34*i_AbsorpInuse1/1000","v":{"$error":"#N/A"}},{"$f":"D109/d_BwAdult","v":{"$error":"#N/A"}},{"$f":"G34*i_AbsorpInuse2/1000","v":{"$error":"#N/A"}},{"$f":"F109/d_BwAdult","v":{"$error":"#N/A"}},{"$f":"I34*i_AbsorpInuse3/1000","v":{"$error":"#N/A"}},{"$f":"H109/d_BwAdult","v":{"$error":"#N/A"}},{"$f":"K34*i_AbsorpInuse4/1000","v":{"$error":"#N/A"}},{"$f":"J109/d_BwAdult","v":{"$error":"#N/A"}},null,null,{"$f":"E109*1000","v":{"$error":"#N/A"}},null,{"$f":"G109*1000","v":{"$error":"#N/A"}}]
[null,"Inhalation",null,{"$f":"E37*i_AbsorpInhalation1/1000","v":{"$error":"#N/A"}},{"$f":"D110/d_BwAdult","v":{"$error":"#N/A"}},{"$f":"G37*i_AbsorpInhalation2/1000","v":{"$error":"#N/A"}},{"$f":"F110/d_BwAdult","v":{"$error":"#N/A"}},{"$f":"I37*i_AbsorpInhalation3/1000","v":{"$error":"#N/A"}},{"$f":"H110/d_BwAdult","v":{"$error":"#N/A"}},{"$f":"K37*i_AbsorpInhalation4/1000","v":{"$error":"#N/A"}},{"$f":"J110/d_BwAdult","v":{"$error":"#N/A"}},null,null,{"$f":"E110*1000","v":{"$error":"#N/A"}},null,{"$f":"G110*1000","v":{"$error":"#N/A"}}]
[null,"Sum ",null,{"$f":"D107+D108+D109+D110","v":{"$error":"#N/A"}},{"$f":"D111/d_BwAdult","v":{"$error":"#N/A"}},{"$f":"F107+F108+F109+F110","v":{"$error":"#N/A"}},{"$f":"F111/d_BwAdult","v":{"$error":"#N/A"}},{"$f":"H107+H108+H109+H110","v":{"$error":"#N/A"}},{"$f":"H111/d_BwAdult","v":{"$error":"#N/A"}},{"$f":"J107+J108+J109+J110","v":{"$error":"#N/A"}},{"$f":"J111/d_BwAdult","v":{"$error":"#N/A"}},null,null,{"$f":"E111*1000","v":{"$error":"#N/A"}},null,{"$f":"G111*1000","v":{"$error":"#N/A"}}]
[null,"With RPE/PPE (as selected above)"]
[null,"Hands",null,{"$f":"IF(D39=\"Yes\",E35,E32)*i_AbsorpInuse1/1000","v":{"$error":"#N/A"}},{"$f":"D113/d_BwAdult","v":{"$error":"#N/A"}},{"$f":"IF(D39=\"Yes\",G35,G32)*i_AbsorpInuse2/1000","v":{"$error":"#N/A"}},{"$f":"F113/d_BwAdult","v":{"$error":"#N/A"}},{"$f":"IF(D39=\"Yes\",I35,I32)*i_AbsorpInuse3/1000","v":{"$error":"#N/A"}},{"$f":"H113/d_BwAdult","v":{"$error":"#N/A"}},{"$f":"IF(D39=\"Yes\",K35,K32)*i_AbsorpInuse4/1000","v":{"$error":"#N/A"}},{"$f":"J113/d_BwAdult","v":{"$error":"#N/A"}},null,null,{"$f":"E113*1000","v":{"$error":"#N/A"}},null,{"$f":"G113*1000","v":{"$error":"#N/A"}}]
[null,"Body",null,{"$f":"IF(D40<>\"Potential exposure\",E36,E33)*i_AbsorpInuse1/1000","v":{"$error":"#N/A"}},{"$f":"D114/d_BwAdult","v":{"$error":"#N/A"}},{"$f":"IF(D40<>\"Potential exposure\",G36,G33)*i_AbsorpInuse2/1000","v":{"$error":"#N/A"}},{"$f":"F114/d_BwAdult","v":{"$error":"#N/A"}},{"$f":"IF(D40<>\"Potential exposure\",I36,I33)*i_AbsorpInuse3/1000","v":{"$error":"#N/A"}},{"$f":"H114/d_BwAdult","v":{"$error":"#N/A"}},{"$f":"IF(D40<>\"Potential exposure\",K36,K33)*i_AbsorpInuse4/1000","v":{"$error":"#N/A"}},{"$f":"J114/d_BwAdult","v":{"$error":"#N/A"}},null,null,{"$f":"E114*1000","v":{"$error":"#N/A"}},null,{"$f":"G114*1000","v":{"$error":"#N/A"}}]
[null,"Head",null,{"$f":"E34*i_AbsorpInuse1*$L41/1000","v":{"$error":"#N/A"}},{"$f":"D115/d_BwAdult","v":{"$error":"#N/A"}},{"$f":"G34*i_AbsorpInuse2*$L41/1000","v":{"$error":"#N/A"}},{"$f":"F115/d_BwAdult","v":{"$error":"#N/A"}},{"$f":"I34*i_AbsorpInuse3*$L41/1000","v":{"$error":"#N/A"}},{"$f":"H115/d_BwAdult","v":{"$error":"#N/A"}},{"$f":"K34*i_AbsorpInuse4*$L41/1000","v":{"$error":"#N/A"}},{"$f":"J115/d_BwAdult","v":{"$error":"#N/A"}},null,null,{"$f":"E115*1000","v":{"$error":"#N/A"}},null,{"$f":"G115*1000","v":{"$error":"#N/A"}}]
[null,"Inhalation",null,{"$f":"E37*i_AbsorpInhalation1*$M41/1000","v":{"$error":"#N/A"}},{"$f":"D116/d_BwAdult","v":{"$error":"#N/A"}},{"$f":"G37*i_AbsorpInhalation2*$M41/1000","v":{"$error":"#N/A"}},{"$f":"F116/d_BwAdult","v":{"$error":"#N/A"}},{"$f":"I37*i_AbsorpInhalation3*$M41/1000","v":{"$error":"#N/A"}},{"$f":"H116/d_BwAdult","v":{"$error":"#N/A"}},{"$f":"K37*i_AbsorpInhalation4*$M41/1000","v":{"$error":"#N/A"}},{"$f":"J116/d_BwAdult","v":{"$error":"#N/A"}},null,null,{"$f":"E116*1000","v":{"$error":"#N/A"}},null,{"$f":"G116*1000","v":{"$error":"#N/A"}}]
[null,"Sum ",null,{"$f":"SUM(D113:D116)","v":{"$error":"#N/A"}},{"$f":"D117/d_BwAdult","v":{"$error":"#N/A"}},{"$f":"SUM(F113:F116)","v":{"$error":"#N/A"}},{"$f":"F117/d_BwAdult","v":{"$error":"#N/A"}},{"$f":"SUM(H113:H116)","v":{"$error":"#N/A"}},{"$f":"H117/d_BwAdult","v":{"$error":"#N/A"}},{"$f":"SUM(J113:J116)","v":{"$error":"#N/A"}},{"$f":"J117/d_BwAdult","v":{"$error":"#N/A"}},null,null,{"$f":"E117*1000","v":{"$error":"#N/A"}},null,{"$f":"G117*1000","v":{"$error":"#N/A"}}]

{"sheet":"Operator Granules","index":11,"n_rows":99,"n_cols":12,"rows_kept":99,"cut":false,"hidden":false,"merged":[[30,6,30,7],[30,8,30,9],[11,2,11,3],[17,10,18,11],[26,10,27,11],[11,11,12,11],[16,2,16,3],[17,2,17,3],[18,2,18,3],[20,10,21,10],[20,2,20,3],[25,2,25,3],[26,2,26,3],[11,0,19,0],[11,1,12,1],[11,10,12,10],[19,2,19,3],[20,0,28,0],[42,4,42,5],[41,4,41,5],[5,2,5,3],[6,2,6,3],[7,2,7,3],[8,2,8,3],[9,2,9,3],[30,2,30,3],[30,4,30,5],[86,2,86,3],[86,4,86,5],[86,6,86,7],[86,8,86,9],[43,8,43,9],[57,2,57,3],[57,4,57,5],[57,6,57,7],[57,8,57,9],[43,4,43,5],[43,2,43,3],[43,6,43,7],[72,2,72,3],[72,4,72,5],[72,6,72,7],[72,8,72,9],[1,2,1,3],[1,4,1,5],[1,6,1,7],[1,8,1,9],[2,6,2,7],[2,8,2,9],[2,4,2,5],[2,2,2,3],[35,10,35,11],[39,10,39,11],[3,2,3,3],[4,2,4,3],[3,8,3,9],[4,8,4,9],[3,6,3,7],[4,6,4,7],[3,4,3,5],[4,4,4,5],[10,1,10,2],[20,11,21,11],[30,10,30,11],[27,2,27,3],[28,2,28,3],[20,1,21,1]]}
[null,{"$f":"\"Operator exposure for \"&i_ProductName & \" granular applications\"","v":"Operator exposure for  granular applications"},null,null,{"$f":"IF(i_FormVal = \"Granules, fine granules\",\"\",\"This sheet is only for granular applications\")","v":"This sheet is only for granular applications"}]
[null,null,{"$f":"i_SubstName1","v":0},null,{"$f":"i_SubstName2","v":0},null,{"$f":"i_SubstName3","v":0},null,{"$f":"i_SubstName4","v":0}]
[null,"Application rate of active substance",{"$f":"i_AppRateAS1","v":0},null,{"$f":"i_AppRateAS2","v":0},null,{"$f":"i_AppRateAS3","v":0},null,{"$f":"i_AppRateAS4","v":0},null,"kg a.s./ha","i_AppRateAS"]
[null,"Amount of active substance applied",{"$f":"C10*i_AppRateAS1","v":0},null,{"$f":"C10*i_AppRateAS2","v":0},null,{"$f":"C10*i_AppRateAS3","v":0},null,{"$f":"C10*i_AppRateAS4","v":0},null,"kg a.s./day","i_AmountAS"]
[null,"Dermal absorption of the product",{"$f":"i_AbsorpProduct1","v":0},null,{"$f":"i_AbsorpProduct2","v":0},null,{"$f":"i_AbsorpProduct3","v":0},null,{"$f":"i_AbsorpProduct4","v":0},null,null,"i_AbsorpProduct"]
[null,"Formulation type",{"$f":"i_FormVal","v":0}]
[null,"Indoor or Outdoor application",{"$f":"'Data entry'!D8","v":0}]
[null,"Application method",{"$f":"i_AppMeth","v":0}]
[null,"Application equipment",{"$f":"i_AppEquip","v":0}]
[null,"Assumed area treated",{"$f":"d_AreaTreated","v":1},null,null,null,null,null,null,null,"ha/day","d_AreaTreated"]
[]
["M & L","Exposure values ","mg exposure/kg a.s. mixed and loaded",null,null,null,null,null,null,null,"Reference ","Comment"]
[null,null,"75th centile","95th centile "]
[null,"Hands",{"$f":"INDEX(ay_OpExpVal,MATCH(i_IndoorOutdoor&i_FormVal&i_AppMeth&i_AppEquip&\"Hands\",key_OpExpMixL,0),7)","v":{"$error":"#N/A"}},{"$f":"INDEX(ay_OpExpVal,MATCH(i_IndoorOutdoor&i_FormVal&i_AppMeth&i_AppEquip&\"Hands\",key_OpExpMixL,0),8)","v":{"$error":"#N/A"}},null,null,null,null,null,null,{"$f":"IF(INDEX(ay_OpExpVal,MATCH(i_IndoorOutdoor&C6&i_AppMeth&i_AppEquip&\"hands\",key_OpExpMixL,0),10)=0,\"\",INDEX(ay_OpExpVal,MATCH(i_IndoorOutdoor&C6&i_AppMeth&i_AppEquip&\"Hands\",key_OpExpMixL,0),10))","v":{"$error":"#N/A"}},{"$f":"IF(INDEX(ay_OpExpVal,MATCH(i_IndoorOutdoor&i_FormVal&i_AppMeth&i_AppEquip&\"Hands\",key_OpExpMixL,0),9)=0,\"\",INDEX(ay_OpExpVal,MATCH(i_IndoorOutdoor&i_FormVal&i_AppMeth&i_AppEquip&\"Hands\",key_OpExpMixL,0),9))","v":{"$error":"#N/A"}}]
[null,"Body",{"$f":"INDEX(ay_OpExpVal,MATCH(i_IndoorOutdoor&i_FormVal&i_AppMeth&i_AppEquip&\"Body\",key_OpExpMixL,0),7)","v":{"$error":"#N/A"}},{"$f":"INDEX(ay_OpExpVal,MATCH(i_IndoorOutdoor&i_FormVal&i_AppMeth&i_AppEquip&\"Body\",key_OpExpMixL,0),8)","v":{"$error":"#N/A"}},null,null,null,null,null,null,{"$f":"IF(INDEX(ay_OpExpVal,MATCH(i_IndoorOutdoor&i_FormVal&i_AppMeth&i_AppEquip&\"Body\",key_OpExpMixL,0),10)=0,\"\",INDEX(ay_OpExpVal,MATCH(i_IndoorOutdoor&i_FormVal&i_AppMeth&i_AppEquip&\"Body\",key_OpExpMixL,0),10))","v":{"$error":"#N/A"}},{"$f":"IF(INDEX(ay_OpExpVal,MATCH(i_IndoorOutdoor&i_FormVal&i_AppMeth&i_AppEquip&\"Body\",key_OpExpMixL,0),9)=0,\"\",INDEX(ay_OpExpVal,MATCH(i_IndoorOutdoor&i_FormVal&i_AppMeth&i_AppEquip&\"Body\",key_OpExpMixL,0),9))","v":{"$error":"#N/A"}}]
[null,"Inhalation",{"$f":"INDEX(ay_OpExpVal,MATCH(i_IndoorOutdoor&i_FormVal&i_AppMeth&i_AppEquip&\"Inhalation\",key_OpExpMixL,0),7)","v":{"$error":"#N/A"}},{"$f":"INDEX(ay_OpExpVal,MATCH(i_IndoorOutdoor&i_FormVal&i_AppMeth&i_AppEquip&\"Inhalation\",key_OpExpMixL,0),8)","v":{"$error":"#N/A"}},null,null,null,null,null,null,{"$f":"IF(INDEX(ay_OpExpVal,MATCH(i_IndoorOutdoor&C6&i_AppMeth&i_AppEquip&\"inhalation\",key_OpExpMixL,0),10)=0,\"\",INDEX(ay_OpExpVal,MATCH(i_IndoorOutdoor&C6&i_AppMeth&i_AppEquip&\"Inhalation\",key_OpExpMixL,0),10))","v":{"$error":"#N/A"}},{"$f":"IF(INDEX(ay_OpExpVal,MATCH(i_IndoorOutdoor&i_FormVal&i_AppMeth&i_AppEquip&\"Inhalation\",key_OpExpMixL,0),9)=0,\"\",INDEX(ay_OpExpVal,MATCH(i_IndoorOutdoor&i_FormVal&i_AppMeth&i_AppEquip&\"Inhalation\",key_OpExpMixL,0),9))","v":{"$error":"#N/A"}}]
[null,"Protective Equipment","Choose item ",null,null,null,null,null,null,null,"Penetration factor"]
[null,"Gloves","None",null,null,null,null,null,null,null,{"$f":"\"Protection for granules exposure is based on measured values\"","v":"Protection for granules exposure is based on measured values"}]
[null,"Body PPE","Potential exposure"]
[null,"RPE","None",null,null,null,null,null,null,null,{"$f":"INDEX(ay_MixRPE,MATCH(C20,key_MixRPE,0),2)","v":1}]
["Application","Exposure values ","None",null,null,null,null,null,null,null,"Reference ","Comment"]
[null,null,"75th centile","95th centile "]
[null,"Hands",{"$f":"INDEX(ay_OpExpVal,MATCH(i_IndoorOutdoor&i_FormVal&i_AppMeth&i_AppEquip&\"Hands\",key_OpExpMixL,0),11)","v":{"$error":"#N/A"}},{"$f":"INDEX(ay_OpExpVal,MATCH(i_IndoorOutdoor&i_FormVal&i_AppMeth&i_AppEquip&\"Hands\",key_OpExpMixL,0),12)","v":{"$error":"#N/A"}},null,null,null,null,null,null,{"$f":"IF(INDEX(ay_OpExpVal,MATCH(i_IndoorOutdoor&C6&i_AppMeth&i_AppEquip&\"hands\",key_OpExpMixL,0),14)=0,\"\",INDEX(ay_OpExpVal,MATCH(i_IndoorOutdoor&C6&i_AppMeth&i_AppEquip&\"Hands\",key_OpExpMixL,0),14))","v":{"$error":"#N/A"}},{"$f":"IF(INDEX(ay_OpExpVal,MATCH(i_IndoorOutdoor&i_FormVal&i_AppMeth&i_AppEquip&\"Hands\",key_OpExpMixL,0),13)=0,\"\",INDEX(ay_OpExpVal,MATCH(i_IndoorOutdoor&i_FormVal&i_AppMeth&i_AppEquip&\"Hands\",key_OpExpMixL,0),13))","v":{"$error":"#N/A"}}]
[null,"Body",{"$f":"INDEX(ay_OpExpVal,MATCH(i_IndoorOutdoor&i_FormVal&i_AppMeth&i_AppEquip&\"Body\",key_OpExpMixL,0),11)","v":{"$error":"#N/A"}},{"$f":"INDEX(ay_OpExpVal,MATCH(i_IndoorOutdoor&i_FormVal&i_AppMeth&i_AppEquip&\"Body\",key_OpExpMixL,0),12)","v":{"$error":"#N/A"}},null,null,null,null,null,null,{"$f":"IF(INDEX(ay_OpExpVal,MATCH(i_IndoorOutdoor&C6&i_AppMeth&i_AppEquip&\"Body\",key_OpExpMixL,0),14)=0,\"\",INDEX(ay_OpExpVal,MATCH(i_IndoorOutdoor&C6&i_AppMeth&i_AppEquip&\"Body\",key_OpExpMixL,0),14))","v":{"$error":"#N/A"}},{"$f":"IF(INDEX(ay_OpExpVal,MATCH(i_IndoorOutdoor&i_FormVal&i_AppMeth&i_AppEquip&\"Body\",key_OpExpMixL,0),13)=0,\"\",INDEX(ay_OpExpVal,MATCH(i_IndoorOutdoor&i_FormVal&i_AppMeth&i_AppEquip&\"Body\",key_OpExpMixL,0),13))","v":{"$error":"#N/A"}}]
[null,"Inhalation",{"$f":"INDEX(ay_OpExpVal,MATCH(i_IndoorOutdoor&i_FormVal&i_AppMeth&i_AppEquip&\"Inhalation\",key_OpExpMixL,0),11)","v":{"$error":"#N/A"}},{"$f":"INDEX(ay_OpExpVal,MATCH(i_IndoorOutdoor&i_FormVal&i_AppMeth&i_AppEquip&\"Inhalation\",key_OpExpMixL,0),12)","v":{"$error":"#N/A"}},null,null,null,null,null,null,{"$f":"IF(INDEX(ay_OpExpVal,MATCH(i_IndoorOutdoor&C6&i_AppMeth&i_AppEquip&\"inhalation\",key_OpExpMixL,0),14)=0,\"\",INDEX(ay_OpExpVal,MATCH(i_IndoorOutdoor&C6&i_AppMeth&i_AppEquip&\"Inhalation\",key_OpExpMixL,0),14))","v":{"$error":"#N/A"}},{"$f":"IF(INDEX(ay_OpExpVal,MATCH(i_IndoorOutdoor&i_FormVal&i_AppMeth&i_AppEquip&\"Inhalation\",key_OpExpMixL,0),13)=0,\"\",INDEX(ay_OpExpVal,MATCH(i_IndoorOutdoor&i_FormVal&i_AppMeth&i_AppEquip&\"Inhalation\",key_OpExpMixL,0),13))","v":{"$error":"#N/A"}}]
[null,"Protective Equipment","Choose item ",null,null,null,null,null,null,null,"Penetration factor"]
[null,"Gloves","None",null,null,null,null,null,null,null,{"$f":"\"Protection for granules exposure is based on measured values\"","v":"Protection for granules exposure is based on measured values"}]
[null,"Body PPE","Potential exposure"]
[null,"RPE","None",null,null,null,null,null,null,null,{"$f":"INDEX(ay_MixRPE,MATCH(C29,key_MixRPE,0),2)","v":1}]
[null,{"$f":"i_IndoorOutdoor&i_FormVal&i_AppMeth&i_AppEquip&\"Hands\"","v":"Hands"}]
[null,"1. Total",{"$f":"i_SubstName1","v":0},null,{"$f":"i_SubstName2","v":0},null,{"$f":"i_SubstName3","v":0},null,{"$f":"i_SubstName4","v":0},null,"Combined"]
[null,null,"Without RPE/PPE","With RPE/PPE ","Without RPE/PPE","With RPE/PPE ","Without RPE/PPE","With RPE/PPE ","Without RPE/PPE","With RPE/PPE ","Without RPE/PPE","With RPE/PPE "]
[]
[null,"Short term"]
[null,"Total systemic exposure from ML and application (mg a.s./day)",{"$f":"C51+C65","v":{"$error":"#N/A"}},{"$f":"C56+C70","v":{"$error":"#N/A"}},{"$f":"E51+E65","v":{"$error":"#N/A"}},{"$f":"E56+E70","v":{"$error":"#N/A"}},{"$f":"G51+G65","v":{"$error":"#N/A"}},{"$f":"G56+G70","v":{"$error":"#N/A"}},{"$f":"I51+I65","v":{"$error":"#N/A"}},{"$f":"I56+I70","v":{"$error":"#N/A"}}]
[null,"Total systemic dose from ML and application per kg body weight (mg/kg bw/day)",{"$f":"C35/d_BwAdult","v":{"$error":"#N/A"}},{"$error":"#N/A"},{"$error":"#N/A"},{"$error":"#N/A"},{"$error":"#N/A"},{"$error":"#N/A"},{"$error":"#N/A"},{"$error":"#N/A"},"Hazard index"]
[null,"% of AOEL",{"$f":"IFERROR(C36/i_AOEL1,0)","v":0},{"$f":"IFERROR(D36/i_AOEL1,0)","v":0},{"$f":"IFERROR(E36/i_AOEL2,0)","v":0},{"$f":"IFERROR(F36/i_AOEL2,0)","v":0},{"$f":"IFERROR(G36/i_AOEL3,0)","v":0},{"$f":"IFERROR(H36/i_AOEL3,0)","v":0},{"$f":"IFERROR(I36/i_AOEL4,0)","v":0},{"$f":"IFERROR(J36/i_AOEL4,0)","v":0},{"$f":"FIXED(C37+E37+G37+I37,3)","v":"0.000"},{"$f":"FIXED(D37+F37+H37+J37,3)","v":"0.000"}]
[null,"Acute "]
[null,"Total systemic exposure from ML and application (mg a.s./day)",{"$f":"C80+C94","v":{"$error":"#N/A"}},{"$f":"C85+C99","v":{"$error":"#N/A"}},{"$f":"E80+E94","v":{"$error":"#N/A"}},{"$f":"E85+E99","v":{"$error":"#N/A"}},{"$f":"G80+G94","v":{"$error":"#N/A"}},{"$f":"G85+G99","v":{"$error":"#N/A"}},{"$f":"I80+I94","v":{"$error":"#N/A"}},{"$f":"I85+I99","v":{"$error":"#N/A"}}]
[null,"Total systemic dose from ML and application per kg body weight (mg/kg bw/day)",{"$f":"C39/d_BwAdult","v":{"$error":"#N/A"}},{"$error":"#N/A"},{"$error":"#N/A"},{"$error":"#N/A"},{"$error":"#N/A"},{"$error":"#N/A"},{"$error":"#N/A"},{"$error":"#N/A"},"Hazard index"]
[null,"% of AAOEL",{"$f":"IFERROR(C40/i_AAOEL1,0)","v":0},{"$f":"IFERROR(D40/i_AAOEL1,0)","v":0},{"$f":"IFERROR(E40/i_AAOEL2,0)","v":0},{"$f":"IFERROR(F40/i_AAOEL2,0)","v":0},{"$f":"IFERROR(G40/i_AAOEL3,0)","v":0},{"$f":"IFERROR(H40/i_AAOEL3,0)","v":0},{"$f":"IFERROR(I40/i_AAOEL4,0)","v":0},{"$f":"IFERROR(J40/i_AAOEL4,0)","v":0},{"$f":"FIXED(C41+E41+G41+I41,3)","v":"0.000"},{"$f":"FIXED(D41+F41+H41+J41,3)","v":"0.000"}]
[]
[null,"2. Longer term exposure"]
[null,"2.1 Mixing and loading",{"$f":"i_SubstName1","v":0},null,{"$f":"i_SubstName2","v":0},null,{"$f":"i_SubstName3","v":0},null,{"$f":"i_SubstName4","v":0}]
[null,null,"Systemic exposure [mg a.s. /day]","Systemic dose [mg a.s./kg bw/day]","Systemic exposure [mg a.s. /day]","Systemic dose [mg a.s./kg bw/day]","Systemic exposure [mg a.s. /day]","Systemic dose [mg a.s./kg bw/day]","Systemic exposure [mg a.s. /day]","Systemic dose [mg a.s./kg bw/day]"]
[]
[null,"Without RPE/PPE"]
[null,"Hands",{"$f":"($C14*100)*C4*C5","v":{"$error":"#N/A"}},{"$f":"C48/d_BwAdult","v":{"$error":"#N/A"}},{"$f":"($C14*100)*i_AmountAS2*i_AbsorpProduct2","v":{"$error":"#N/A"}},{"$f":"E48/d_BwAdult","v":{"$error":"#N/A"}},{"$f":"($C14*100)*i_AmountAS3*i_AbsorpProduct3","v":{"$error":"#N/A"}},{"$f":"G48/d_BwAdult","v":{"$error":"#N/A"}},{"$f":"($C14*100)*i_AmountAS4*i_AbsorpProduct4","v":{"$error":"#N/A"}},{"$f":"I48/d_BwAdult","v":{"$error":"#N/A"}}]
[null,"Body",{"$f":"($C15*100)*C4*C5","v":{"$error":"#N/A"}},{"$f":"C49/d_BwAdult","v":{"$error":"#N/A"}},{"$f":"($C15*100)*i_AmountAS2*i_AbsorpProduct2","v":{"$error":"#N/A"}},{"$f":"E49/d_BwAdult","v":{"$error":"#N/A"}},{"$f":"($C15*100)*i_AmountAS3*i_AbsorpProduct3","v":{"$error":"#N/A"}},{"$f":"G49/d_BwAdult","v":{"$error":"#N/A"}},{"$f":"($C15*100)*i_AmountAS4*i_AbsorpProduct4","v":{"$error":"#N/A"}},{"$f":"I49/d_BwAdult","v":{"$error":"#N/A"}}]
[null,"Inhalation",{"$f":"$C16*i_AmountAS1*i_AbsorpInhalation1","v":{"$error":"#N/A"}},{"$f":"C50/d_BwAdult","v":{"$error":"#N/A"}},{"$f":"$C16*i_AmountAS2*i_AbsorpInhalation2","v":{"$error":"#N/A"}},{"$f":"E50/d_BwAdult","v":{"$error":"#N/A"}},{"$f":"$C16*i_AmountAS3*i_AbsorpInhalation3","v":{"$error":"#N/A"}},{"$f":"G50/d_BwAdult","v":{"$error":"#N/A"}},{"$f":"$C16*i_AmountAS4*i_AbsorpInhalation4","v":{"$error":"#N/A"}},{"$f":"I50/d_BwAdult","v":{"$error":"#N/A"}}]
[null,"Sum ",{"$f":"C48+C49+C50","v":{"$error":"#N/A"}},{"$f":"C51/d_BwAdult","v":{"$error":"#N/A"}},{"$f":"E48+E49+E50","v":{"$error":"#N/A"}},{"$f":"E51/d_BwAdult","v":{"$error":"#N/A"}},{"$f":"G48+G49+G50","v":{"$error":"#N/A"}},{"$f":"G51/d_BwAdult","v":{"$error":"#N/A"}},{"$f":"I48+I49+I50","v":{"$error":"#N/A"}},{"$f":"I51/d_BwAdult","v":{"$error":"#N/A"}}]
[null,"With RPE/PPE (as selected above)"]
[null,"Hands",{"$f":"IF($C18=\"None\",C48,$C14*C4*C5)","v":{"$error":"#N/A"}},{"$f":"C53/d_BwAdult","v":{"$error":"#N/A"}},{"$f":"IF($C18=\"None\",E48,$C14*i_AmountAS2*i_AbsorpProduct2)","v":{"$error":"#N/A"}},{"$f":"E53/d_BwAdult","v":{"$error":"#N/A"}},{"$f":"IF($C18=\"None\",G48,$C14*i_AmountAS3*i_AbsorpProduct3)","v":{"$error":"#N/A"}},{"$f":"G53/d_BwAdult","v":{"$error":"#N/A"}},{"$f":"IF($C18=\"None\",I48,$C14*i_AmountAS4*i_AbsorpProduct4)","v":{"$error":"#N/A"}},{"$f":"I53/d_BwAdult","v":{"$error":"#N/A"}}]
[null,"Body",{"$f":"IF($C19=\"Potential exposure\",C49,$C15*i_AmountAS1*i_AbsorpProduct1)","v":{"$error":"#N/A"}},{"$f":"C54/d_BwAdult","v":{"$error":"#N/A"}},{"$f":"IF($C19=\"Potential exposure\",E49,$C15*i_AmountAS2*i_AbsorpProduct2)","v":{"$error":"#N/A"}},{"$f":"E54/d_BwAdult","v":{"$error":"#N/A"}},{"$f":"IF($C19=\"Potential exposure\",G49,$C15*i_AmountAS3*i_AbsorpProduct3)","v":{"$error":"#N/A"}},{"$f":"G54/d_BwAdult","v":{"$error":"#N/A"}},{"$f":"IF($C19=\"Potential exposure\",I49,$C15*i_AmountAS4*i_AbsorpProduct4)","v":{"$error":"#N/A"}},{"$f":"I54/d_BwAdult","v":{"$error":"#N/A"}}]
[null,"Inhalation",{"$f":"$C16*C4*i_AbsorpInhalation1*MLPenFactorPHED","v":{"$error":"#N/A"}},{"$f":"C55/d_BwAdult","v":{"$error":"#N/A"}},{"$f":"$C16*E4*i_AbsorpInhalation2*MLPenFactorPHED","v":{"$error":"#N/A"}},{"$f":"E55/d_BwAdult","v":{"$error":"#N/A"}},{"$f":"$C16*G4*i_AbsorpInhalation3*MLPenFactorPHED","v":{"$error":"#N/A"}},{"$f":"G55/d_BwAdult","v":{"$error":"#N/A"}},{"$f":"$C16*I4*i_AbsorpInhalation4*MLPenFactorPHED","v":{"$error":"#N/A"}},{"$f":"I55/d_BwAdult","v":{"$error":"#N/A"}}]
[null,"Sum ",{"$f":"SUM(C53,C54,C55)","v":{"$error":"#N/A"}},{"$f":"C56/d_BwAdult","v":{"$error":"#N/A"}},{"$f":"SUM(E53,E54,E55)","v":{"$error":"#N/A"}},{"$f":"E56/d_BwAdult","v":{"$error":"#N/A"}},{"$f":"SUM(G53,G54,G55)","v":{"$error":"#N/A"}},{"$f":"G56/d_BwAdult","v":{"$error":"#N/A"}},{"$f":"SUM(I53,I54,I55)","v":{"$error":"#N/A"}},{"$f":"I56/d_BwAdult","v":{"$error":"#N/A"}}]
[]
[null,"2.2 Application",{"$f":"i_SubstName1","v":0},null,{"$f":"i_SubstName2","v":0},null,{"$f":"i_SubstName3","v":0},null,{"$f":"i_SubstName4","v":0}]
[null,null,"Systemic exposure [mg a.s. /day]","Systemic dose [mg a.s./kg bw/day]","Systemic exposure [mg a.s. /day]","Systemic dose [mg a.s./kg bw/day]","Systemic exposure [mg a.s. /day]","Systemic dose [mg a.s./kg bw/day]","Systemic exposure [mg a.s. /day]","Systemic dose [mg a.s./kg bw/day]"]
[]
[null,"Without RPE/PPE"]
[null,"Hands",{"$f":"($C23*100)*i_AmountAS1*i_AbsorpProduct1","v":{"$error":"#N/A"}},{"$f":"C62/d_BwAdult","v":{"$error":"#N/A"}},{"$f":"($C23*100)*i_AmountAS2*i_AbsorpProduct2","v":{"$error":"#N/A"}},{"$f":"E62/d_BwAdult","v":{"$error":"#N/A"}},{"$f":"($C23*100)*i_AmountAS3*i_AbsorpProduct3","v":{"$error":"#N/A"}},{"$f":"G62/d_BwAdult","v":{"$error":"#N/A"}},{"$f":"($C23*100)*i_AmountAS4*i_AbsorpProduct4","v":{"$error":"#N/A"}},{"$f":"I62/d_BwAdult","v":{"$error":"#N/A"}}]
[null,"Body",{"$f":"($C24*100)*i_AmountAS1*i_AbsorpProduct1","v":{"$error":"#N/A"}},{"$f":"C63/d_BwAdult","v":{"$error":"#N/A"}},{"$f":"($C24*100)*i_AmountAS2*i_AbsorpProduct2","v":{"$error":"#N/A"}},{"$f":"E63/d_BwAdult","v":{"$error":"#N/A"}},{"$f":"($C24*100)*i_AmountAS3*i_AbsorpProduct3","v":{"$error":"#N/A"}},{"$f":"G63/d_BwAdult","v":{"$error":"#N/A"}},{"$f":"($C24*100)*i_AmountAS4*i_AbsorpProduct4","v":{"$error":"#N/A"}},{"$f":"I63/d_BwAdult","v":{"$error":"#N/A"}}]
[null,"Inhalation",{"$f":"($C25)*i_AmountAS1*i_AbsorpInhalation1","v":{"$error":"#N/A"}},{"$f":"C64/d_BwAdult","v":{"$error":"#N/A"}},{"$f":"($C25)*i_AmountAS2*i_AbsorpInhalation2","v":{"$error":"#N/A"}},{"$f":"E64/d_BwAdult","v":{"$error":"#N/A"}},{"$f":"($C25)*i_AmountAS3*i_AbsorpInhalation3","v":{"$error":"#N/A"}},{"$f":"G64/d_BwAdult","v":{"$error":"#N/A"}},{"$f":"($C25)*i_AmountAS4*i_AbsorpInhalation4","v":{"$error":"#N/A"}},{"$f":"I64/d_BwAdult","v":{"$error":"#N/A"}}]
[null,"Sum",{"$f":"C62+C63+C64","v":{"$error":"#N/A"}},{"$f":"C65/d_BwAdult","v":{"$error":"#N/A"}},{"$f":"E62+E63+E64","v":{"$error":"#N/A"}},{"$f":"E65/d_BwAdult","v":{"$error":"#N/A"}},{"$f":"G62+G63+G64","v":{"$error":"#N/A"}},{"$f":"G65/d_BwAdult","v":{"$error":"#N/A"}},{"$f":"I62+I63+I64","v":{"$error":"#N/A"}},{"$f":"I65/d_BwAdult","v":{"$error":"#N/A"}}]
[null,"With RPE/PPE (as selected above)"]
[null,"Hands",{"$f":"IF($C27=\"None\",C62,$C23*i_AmountAS1*i_AbsorpProduct1)","v":{"$error":"#N/A"}},{"$f":"C67/d_BwAdult","v":{"$error":"#N/A"}},{"$f":"IF($C27=\"None\",E62,$C23*i_AmountAS2*i_AbsorpProduct2)","v":{"$error":"#N/A"}},{"$f":"E67/d_BwAdult","v":{"$error":"#N/A"}},{"$f":"IF($C27=\"None\",G62,$C23*i_AmountAS3*i_AbsorpProduct3)","v":{"$error":"#N/A"}},{"$f":"G67/d_BwAdult","v":{"$error":"#N/A"}},{"$f":"IF($C27=\"None\",I62,$C23*i_AmountAS4*i_AbsorpProduct4)","v":{"$error":"#N/A"}},{"$f":"I67/d_BwAdult","v":{"$error":"#N/A"}}]
[null,"Body",{"$f":"IF($C28=\"Potential exposure\",C63,$C24*i_AmountAS1*i_AbsorpProduct1)","v":{"$error":"#N/A"}},{"$f":"C68/d_BwAdult","v":{"$error":"#N/A"}},{"$f":"IF($C28=\"Potential exposure\",E63,$C24*i_AmountAS2*i_AbsorpProduct2)","v":{"$error":"#N/A"}},{"$f":"E68/d_BwAdult","v":{"$error":"#N/A"}},{"$f":"IF($C28=\"Potential exposure\",G63,$C24*i_AmountAS3*i_AbsorpProduct3)","v":{"$error":"#N/A"}},{"$f":"G68/d_BwAdult","v":{"$error":"#N/A"}},{"$f":"IF($C28=\"Potential exposure\",I63,$C24*i_AmountAS4*i_AbsorpProduct4)","v":{"$error":"#N/A"}},{"$f":"I68/d_BwAdult","v":{"$error":"#N/A"}}]
[null,"Inhalation",{"$f":"$C25*i_AmountAS1*i_AbsorpInhalation1*AppPenFactorPHED","v":{"$error":"#N/A"}},{"$f":"C69/d_BwAdult","v":{"$error":"#N/A"}},{"$f":"$C25*i_AmountAS2*i_AbsorpInhalation2*AppPenFactorPHED","v":{"$error":"#N/A"}},{"$f":"E69/d_BwAdult","v":{"$error":"#N/A"}},{"$f":"$C25*i_AmountAS3*i_AbsorpInhalation3*AppPenFactorPHED","v":{"$error":"#N/A"}},{"$f":"G69/d_BwAdult","v":{"$error":"#N/A"}},{"$f":"$C25*i_AmountAS4*i_AbsorpInhalation4*AppPenFactorPHED","v":{"$error":"#N/A"}},{"$f":"I69/d_BwAdult","v":{"$error":"#N/A"}}]
[null,"Sum ",{"$f":"SUM(C67:C69)","v":{"$error":"#N/A"}},{"$f":"C70/d_BwAdult","v":{"$error":"#N/A"}},{"$f":"SUM(E67:E69)","v":{"$error":"#N/A"}},{"$f":"E70/d_BwAdult","v":{"$error":"#N/A"}},{"$f":"SUM(G67:G69)","v":{"$error":"#N/A"}},{"$f":"G70/d_BwAdult","v":{"$error":"#N/A"}},{"$f":"SUM(I67:I69)","v":{"$error":"#N/A"}},{"$f":"I70/d_BwAdult","v":{"$error":"#N/A"}}]
[]
[null,"3. Acute exposure"]
[null,"3.1 Mixing and loading",{"$f":"i_SubstName1","v":0},null,{"$f":"i_SubstName2","v":0},null,{"$f":"i_SubstName3","v":0},null,{"$f":"i_SubstName4","v":0}]
[null,null,"Systemic exposure [mg a.s. /day]","Systemic dose [mg a.s./kg bw/day]","Systemic exposure [mg a.s. /day]","Systemic dose [mg a.s./kg bw/day]","Systemic exposure [mg a.s. /day]","Systemic dose [mg a.s./kg bw/day]","Systemic exposure [mg a.s. /day]","Systemic dose [mg a.s./kg bw/day]"]
[]
[null,"Without RPE/PPE"]
[null,"Hands",{"$f":"($D14*100)*i_AmountAS1*i_AbsorpProduct1","v":{"$error":"#N/A"}},{"$f":"C77/d_BwAdult","v":{"$error":"#N/A"}},{"$f":"($D14*100)*i_AmountAS2*i_AbsorpProduct2","v":{"$error":"#N/A"}},{"$f":"E77/d_BwAdult","v":{"$error":"#N/A"}},{"$f":"($D14*100)*i_AmountAS3*i_AbsorpProduct3","v":{"$error":"#N/A"}},{"$f":"G77/d_BwAdult","v":{"$error":"#N/A"}},{"$f":"($D14*100)*i_AmountAS4*i_AbsorpProduct4","v":{"$error":"#N/A"}},{"$f":"I77/d_BwAdult","v":{"$error":"#N/A"}}]
[null,"Body",{"$f":"($D15*100)*i_AmountAS1*i_AbsorpProduct1","v":{"$error":"#N/A"}},{"$f":"C78/d_BwAdult","v":{"$error":"#N/A"}},{"$f":"($D15*100)*i_AmountAS2*i_AbsorpProduct2","v":{"$error":"#N/A"}},{"$f":"E78/d_BwAdult","v":{"$error":"#N/A"}},{"$f":"($D15*100)*i_AmountAS3*i_AbsorpProduct3","v":{"$error":"#N/A"}},{"$f":"G78/d_BwAdult","v":{"$error":"#N/A"}},{"$f":"($D15*100)*i_AmountAS4*i_AbsorpProduct4","v":{"$error":"#N/A"}},{"$f":"I78/d_BwAdult","v":{"$error":"#N/A"}}]
[null,"Inhalation",{"$f":"$D16*i_AmountAS1*i_AbsorpInhalation1","v":{"$error":"#N/A"}},{"$f":"C79/d_BwAdult","v":{"$error":"#N/A"}},{"$f":"$D16*i_AmountAS2*i_AbsorpInhalation1","v":{"$error":"#N/A"}},{"$f":"E79/d_BwAdult","v":{"$error":"#N/A"}},{"$f":"$D16*i_AmountAS3*i_AbsorpInhalation1","v":{"$error":"#N/A"}},{"$f":"G79/d_BwAdult","v":{"$error":"#N/A"}},{"$f":"$D16*i_AmountAS4*i_AbsorpInhalation1","v":{"$error":"#N/A"}},{"$f":"I79/d_BwAdult","v":{"$error":"#N/A"}}]
[null,"Sum ",{"$f":"C77+C78+C79","v":{"$error":"#N/A"}},{"$f":"C80/d_BwAdult","v":{"$error":"#N/A"}},{"$f":"E77+E78+E79","v":{"$error":"#N/A"}},{"$f":"E80/d_BwAdult","v":{"$error":"#N/A"}},{"$f":"G77+G78+G79","v":{"$error":"#N/A"}},{"$f":"G80/d_BwAdult","v":{"$error":"#N/A"}},{"$f":"I77+I78+I79","v":{"$error":"#N/A"}},{"$f":"I80/d_BwAdult","v":{"$error":"#N/A"}}]
[null,"With RPE/PPE (as selected above)"]
[null,"Hands",{"$f":"IF($C18=\"None\",C77,$D14*i_AmountAS1*i_AbsorpProduct1)","v":{"$error":"#N/A"}},{"$f":"C82/d_BwAdult","v":{"$error":"#N/A"}},{"$f":"IF($C18=\"None\",E77,$D14*i_AmountAS2*i_AbsorpProduct2)","v":{"$error":"#N/A"}},{"$f":"E82/d_BwAdult","v":{"$error":"#N/A"}},{"$f":"IF($C18=\"None\",G77,$D14*i_AmountAS3*i_AbsorpProduct3)","v":{"$error":"#N/A"}},{"$f":"G82/d_BwAdult","v":{"$error":"#N/A"}},{"$f":"IF($C18=\"None\",I77,$D14*i_AmountAS4*i_AbsorpProduct4)","v":{"$error":"#N/A"}},{"$f":"I82/d_BwAdult","v":{"$error":"#N/A"}}]
[null,"Body",{"$f":"IF($C19=\"Potential exposure\",C78,$D15*i_AmountAS1*i_AbsorpProduct1)","v":{"$error":"#N/A"}},{"$f":"C83/d_BwAdult","v":{"$error":"#N/A"}},{"$f":"IF($C19=\"Potential exposure\",E78,$D15*i_AmountAS2*i_AbsorpProduct2)","v":{"$error":"#N/A"}},{"$f":"E83/d_BwAdult","v":{"$error":"#N/A"}},{"$f":"IF($C19=\"Potential exposure\",G78,$D15*i_AmountAS3*i_AbsorpProduct3)","v":{"$error":"#N/A"}},{"$f":"G83/d_BwAdult","v":{"$error":"#N/A"}},{"$f":"IF($C19=\"Potential exposure\",I78,$D15*i_AmountAS4*i_AbsorpProduct4)","v":{"$error":"#N/A"}},{"$f":"I83/d_BwAdult","v":{"$error":"#N/A"}}]
[null,"Inhalation",{"$f":"$D16*i_AmountAS1*i_AbsorpInhalation1*MLPenFactorPHED","v":{"$error":"#N/A"}},{"$f":"C84/d_BwAdult","v":{"$error":"#N/A"}},{"$f":"$D16*i_AmountAS2*i_AbsorpInhalation2*MLPenFactorPHED","v":{"$error":"#N/A"}},{"$f":"E84/d_BwAdult","v":{"$error":"#N/A"}},{"$f":"$D16*i_AmountAS3*i_AbsorpInhalation1*MLPenFactorPHED","v":{"$error":"#N/A"}},{"$f":"G84/d_BwAdult","v":{"$error":"#N/A"}},{"$f":"$D16*i_AmountAS4*i_AbsorpInhalation1*MLPenFactorPHED","v":{"$error":"#N/A"}},{"$f":"I84/d_BwAdult","v":{"$error":"#N/A"}}]
[null,"Sum ",{"$f":"SUM(C82:C84)","v":{"$error":"#N/A"}},{"$f":"C85/d_BwAdult","v":{"$error":"#N/A"}},{"$f":"SUM(E82:E84)","v":{"$error":"#N/A"}},{"$f":"E85/d_BwAdult","v":{"$error":"#N/A"}},{"$f":"SUM(G82:G84)","v":{"$error":"#N/A"}},{"$f":"G85/d_BwAdult","v":{"$error":"#N/A"}},{"$f":"SUM(I82:I84)","v":{"$error":"#N/A"}},{"$f":"I85/d_BwAdult","v":{"$error":"#N/A"}}]
[]
[null,"3.2 Application",{"$f":"i_SubstName1","v":0},null,{"$f":"i_SubstName2","v":0},null,{"$f":"i_SubstName3","v":0},null,{"$f":"i_SubstName4","v":0}]
[null,null,"Systemic exposure [mg a.s. /day]","Systemic dose [mg a.s./kg bw/day]","Systemic exposure [mg a.s. /day]","Systemic dose [mg a.s./kg bw/day]","Systemic exposure [mg a.s. /day]","Systemic dose [mg a.s./kg bw/day]","Systemic exposure [mg a.s. /day]","Systemic dose [mg a.s./kg bw/day]"]
[]
[null,"Without RPE/PPE"]
[null,"Hands",{"$f":"($D23*100)*i_AmountAS1*i_AbsorpProduct1","v":{"$error":"#N/A"}},{"$f":"C91/d_BwAdult","v":{"$error":"#N/A"}},{"$f":"($D23*100)*i_AmountAS2*i_AbsorpProduct2","v":{"$error":"#N/A"}},{"$f":"E91/d_BwAdult","v":{"$error":"#N/A"}},{"$f":"($D23*100)*i_AmountAS3*i_AbsorpProduct3","v":{"$error":"#N/A"}},{"$f":"G91/d_BwAdult","v":{"$error":"#N/A"}},{"$f":"($D23*100)*i_AmountAS4*i_AbsorpProduct4","v":{"$error":"#N/A"}},{"$f":"I91/d_BwAdult","v":{"$error":"#N/A"}}]
[null,"Body",{"$f":"($D24*100)*i_AmountAS1*i_AbsorpProduct1","v":{"$error":"#N/A"}},{"$f":"C92/d_BwAdult","v":{"$error":"#N/A"}},{"$f":"($D24*100)*i_AmountAS2*i_AbsorpProduct2","v":{"$error":"#N/A"}},{"$f":"E92/d_BwAdult","v":{"$error":"#N/A"}},{"$f":"($D24*100)*i_AmountAS3*i_AbsorpProduct3","v":{"$error":"#N/A"}},{"$f":"G92/d_BwAdult","v":{"$error":"#N/A"}},{"$f":"($D24*100)*i_AmountAS4*i_AbsorpProduct4","v":{"$error":"#N/A"}},{"$f":"I92/d_BwAdult","v":{"$error":"#N/A"}}]
[null,"Inhalation",{"$f":"($D25)*i_AmountAS1*i_AbsorpInhalation1","v":{"$error":"#N/A"}},{"$f":"C93/d_BwAdult","v":{"$error":"#N/A"}},{"$f":"($D25)*i_AmountAS2*i_AbsorpInhalation2","v":{"$error":"#N/A"}},{"$f":"E93/d_BwAdult","v":{"$error":"#N/A"}},{"$f":"($D25)*i_AmountAS3*i_AbsorpInhalation3","v":{"$error":"#N/A"}},{"$f":"G93/d_BwAdult","v":{"$error":"#N/A"}},{"$f":"($D25)*i_AmountAS4*i_AbsorpInhalation4","v":{"$error":"#N/A"}},{"$f":"I93/d_BwAdult","v":{"$error":"#N/A"}}]
[null,"Sum",{"$f":"C91+C92+C93","v":{"$error":"#N/A"}},{"$f":"C94/d_BwAdult","v":{"$error":"#N/A"}},{"$f":"E91+E92+E93","v":{"$error":"#N/A"}},{"$f":"E94/d_BwAdult","v":{"$error":"#N/A"}},{"$f":"G91+G92+G93","v":{"$error":"#N/A"}},{"$f":"G94/d_BwAdult","v":{"$error":"#N/A"}},{"$f":"I91+I92+I93","v":{"$error":"#N/A"}},{"$f":"I94/d_BwAdult","v":{"$error":"#N/A"}}]
[null,"With RPE/PPE (as selected above)"]
[null,"Hands",{"$f":"IF($C27=\"None\",C91,$D23*i_AmountAS1*i_AbsorpProduct1)","v":{"$error":"#N/A"}},{"$f":"C96/d_BwAdult","v":{"$error":"#N/A"}},{"$f":"IF($C27=\"None\",E91,$D23*i_AmountAS2*i_AbsorpProduct2)","v":{"$error":"#N/A"}},{"$f":"E96/d_BwAdult","v":{"$error":"#N/A"}},{"$f":"IF($C27=\"None\",G91,$D23*i_AmountAS3*i_AbsorpProduct3)","v":{"$error":"#N/A"}},{"$f":"G96/d_BwAdult","v":{"$error":"#N/A"}},{"$f":"IF($C27=\"None\",I91,$D23*i_AmountAS4*i_AbsorpProduct4)","v":{"$error":"#N/A"}},{"$f":"I96/d_BwAdult","v":{"$error":"#N/A"}}]
[null,"Body",{"$f":"IF($C28=\"Potential exposure\",C92,$D24*i_AmountAS1*i_AbsorpProduct1)","v":{"$error":"#N/A"}},{"$f":"C97/d_BwAdult","v":{"$error":"#N/A"}},{"$f":"IF($C28=\"Potential exposure\",E92,$D24*i_AmountAS2*i_AbsorpProduct2)","v":{"$error":"#N/A"}},{"$f":"E97/d_BwAdult","v":{"$error":"#N/A"}},{"$f":"IF($C28=\"Potential exposure\",G92,$D24*i_AmountAS3*i_AbsorpProduct3)","v":{"$error":"#N/A"}},{"$f":"G97/d_BwAdult","v":{"$error":"#N/A"}},{"$f":"IF($C28=\"Potential exposure\",I92,$D24*i_AmountAS4*i_AbsorpProduct4)","v":{"$error":"#N/A"}},{"$f":"I97/d_BwAdult","v":{"$error":"#N/A"}}]
[null,"Inhalation",{"$f":"$D25*i_AmountAS1*i_AbsorpInhalation1*AppPenFactorPHED","v":{"$error":"#N/A"}},{"$f":"C98/d_BwAdult","v":{"$error":"#N/A"}},{"$f":"$D25*i_AmountAS2*i_AbsorpInhalation2*AppPenFactorPHED","v":{"$error":"#N/A"}},{"$f":"E98/d_BwAdult","v":{"$error":"#N/A"}},{"$f":"$D25*i_AmountAS3*i_AbsorpInhalation3*AppPenFactorPHED","v":{"$error":"#N/A"}},{"$f":"G98/d_BwAdult","v":{"$error":"#N/A"}},{"$f":"$D25*i_AmountAS4*i_AbsorpInhalation4*AppPenFactorPHED","v":{"$error":"#N/A"}},{"$f":"I98/d_BwAdult","v":{"$error":"#N/A"}}]
[null,"Sum ",{"$f":"SUM(C96:C98)","v":{"$error":"#N/A"}},{"$f":"C99/d_BwAdult","v":{"$error":"#N/A"}},{"$f":"SUM(E96:E98)","v":{"$error":"#N/A"}},{"$f":"E99/d_BwAdult","v":{"$error":"#N/A"}},{"$f":"SUM(G96:G98)","v":{"$error":"#N/A"}},{"$f":"G99/d_BwAdult","v":{"$error":"#N/A"}},{"$f":"SUM(I96:I98)","v":{"$error":"#N/A"}},{"$f":"I99/d_BwAdult","v":{"$error":"#N/A"}}]

{"sheet":"Operator_exposure_values_AOEM","index":12,"n_rows":326,"n_cols":22,"rows_kept":326,"cut":false,"hidden":true,"merged":[]}
[1,2,3,4,5,6,7,8,9,10,11,12,13,14,15,16,17,18,19,20,21,22]
["Match AOEM","Outdoor/Indoor","Formulation type","Application method","Application equipment","Type of exposure","ML 75th Intercept","ML 75th Applied Amount Factor","ML 75th Scenario Factor","ML 75th Percentile AOEM","ML 95th Intercept","ML 95th Applied Amount Factor","ML 95th Scenario Factor","ML 95th Percentile AOEM","Application 75th Intercept","Application 75th Applied Amount Factor","Application 75th Scenario Factor","Application 75th Percentile AOEM","Application 95th Intercept","Application 95th Applied Amount Factor","Application 95th Scenario Factor","Application 95th Percentile AOEM"]
[{"$f":"B3&C3&D3&E3&F3","v":"IndoorSoluble concentrates, emulsifiable concentrate, etc.Downward sprayingManual-Hand heldBody"},"Indoor","Soluble concentrates, emulsifiable concentrate, etc.","Downward spraying","Manual-Hand held","Body",3.04,0.74,0.52,null,3.87,0.69,0.72,null,null,null,null,16797,null,null,null,28082]
["OutdoorSoluble concentrates, emulsifiable concentrate, etc.Upward sprayingManual-Hand heldBody","Outdoor","Soluble concentrates, emulsifiable concentrate, etc.","Upward spraying","Manual-Hand held","Body",3.04,0.74,0.52,null,3.87,0.69,0.72,null,6.08,0.16,-1.29,null,6.34,0.01,-1.0900000000000001]
["IndoorWettable granules, soluble granulesDownward sprayingManual-Hand heldBody","Indoor","Wettable granules, soluble granules","Downward spraying","Manual-Hand held","Body",3.04,0.74,null,null,3.87,0.69,null,null,null,null,null,16797,null,null,null,28082]
["IndoorSoluble concentrates, emulsifiable concentrate, etc.Upward sprayingManual-Hand heldBody","Indoor","Soluble concentrates, emulsifiable concentrate, etc.","Upward spraying","Manual-Hand held","Body",3.04,0.74,0.52,null,3.87,0.69,0.72,null,{"$f":"5.59","v":5.59},1,null,null,6.1,{"$f":"opex_indoor95_hm!C$35","v":"1"}]
["OutdoorSoluble concentrates, emulsifiable concentrate, etc.Downward sprayingManual-Hand heldHands","Outdoor","Soluble concentrates, emulsifiable concentrate, etc.","Downward spraying","Manual-Hand held","Hands",3.27,0.64,0.64,null,3.74,0.69,0.71,null,null,null,null,1544,null,null,null,4213]
["OutdoorSoluble concentrates, emulsifiable concentrate, etc.Downward sprayingManual-KnapsackHands","Outdoor","Soluble concentrates, emulsifiable concentrate, etc.","Downward spraying","Manual-Knapsack","Hands",null,null,null,9497,null,null,null,25490,null,null,null,1544,null,null,null,4213]
["OutdoorSoluble concentrates, emulsifiable concentrate, etc.Upward sprayingManual-KnapsackHands","Outdoor","Soluble concentrates, emulsifiable concentrate, etc.","Upward spraying","Manual-Knapsack","Hands",null,null,null,9497,null,null,null,25490,4.26,0.84,-0.83,null,4.41,0.77,-0.47]
["OutdoorWettable granules, soluble granulesDownward sprayingManual-KnapsackHands","Outdoor","Wettable granules, soluble granules","Downward spraying","Manual-Knapsack","Hands",null,null,null,9497,null,null,null,25490,null,null,null,1544,null,null,null,4213]
["OutdoorWettable granules, soluble granulesUpward sprayingManual-KnapsackHands","Outdoor","Wettable granules, soluble granules","Upward spraying","Manual-Knapsack","Hands",null,null,null,9497,null,null,null,25490,4.26,0.84,-0.83,null,4.41,0.77,-0.47]
["OutdoorWettable powder, soluble powderDownward sprayingManual-KnapsackHands","Outdoor","Wettable powder, soluble powder","Downward spraying","Manual-Knapsack","Hands",null,null,null,9497,null,null,null,25490,null,null,null,1544,null,null,null,4213]
["OutdoorWettable powder, soluble powderUpward sprayingManual-KnapsackHands","Outdoor","Wettable powder, soluble powder","Upward spraying","Manual-Knapsack","Hands",null,null,null,9497,null,null,null,25490,4.26,0.84,-0.83,null,4.41,0.77,-0.47]
["OutdoorSoluble concentrates, emulsifiable concentrate, etc.Downward sprayingVehicle-mountedBody","Outdoor","Soluble concentrates, emulsifiable concentrate, etc.","Downward spraying","Vehicle-mounted","Body",3.04,0.74,0.52,null,3.87,0.69,0.72,null,2.54,1,{"$f":"0.81+IF(d_AreaTreated>10,-1.43,0)","v":0.81},null,1.94,1,{"$f":"1.51+IF(d_AreaTreated>10,-0.82,0)","v":1.51}]
["OutdoorSoluble concentrates, emulsifiable concentrate, etc.Upward sprayingVehicle-mountedBody","Outdoor","Soluble concentrates, emulsifiable concentrate, etc.","Upward spraying","Vehicle-mounted","Body",3.04,0.74,0.52,null,3.87,0.69,0.72,null,3.47,1,0.48,null,3.92,1,0.79]
["OutdoorWettable granules, soluble granulesDownward sprayingVehicle-mountedBody","Outdoor","Wettable granules, soluble granules","Downward spraying","Vehicle-mounted","Body",3.04,0.74,null,null,3.87,0.69,null,null,2.54,1,{"$f":"0.81+IF(d_AreaTreated>10,-1.43,0)","v":0.81},null,1.94,1,{"$f":"1.51+IF(d_AreaTreated>10,-0.82,0)","v":1.51}]
["IndoorSoluble concentrates, emulsifiable concentrate, etc.Upward sprayingManual-TrolleyBody","Indoor","Soluble concentrates, emulsifiable concentrate, etc.","Upward spraying","Manual-Trolley","Body",3.04,0.74,0.52,null,3.87,0.69,0.72,null,{"$f":"5.59","v":5.59},1,-0.81,null,6.1,{"$f":"opex_indoor95_hm!C$35","v":"1"},-0.92]
["IndoorSoluble concentrates, emulsifiable concentrate, etc.Downward sprayingManual-KnapsackBody","Indoor","Soluble concentrates, emulsifiable concentrate, etc.","Downward spraying","Manual-Knapsack","Body",null,null,null,803,null,null,null,2787,null,null,null,16797,null,null,null,28082]
["IndoorDenseSoluble concentrates, emulsifiable concentrate, etc.Upward sprayingManual-Hand heldBody","IndoorDense","Soluble concentrates, emulsifiable concentrate, etc.","Upward spraying","Manual-Hand held","Body",3.04,0.74,0.52,null,3.87,0.69,0.72,null,5.59,1,0.67,null,6.1,1,0.48]
["OutdoorWettable powder, soluble powderDownward sprayingVehicle-mountedBody","Outdoor","Wettable powder, soluble powder","Downward spraying","Vehicle-mounted","Body",3.04,0.74,1.85,null,3.87,0.69,1.29,null,2.54,1,{"$f":"0.81+IF(d_AreaTreated>10,-1.43,0)","v":0.81},null,1.94,1,{"$f":"1.51+IF(d_AreaTreated>10,-0.82,0)","v":1.51}]
["OutdoorSoluble concentrates, emulsifiable concentrate, etc.Upward sprayingVehicle-mountedHands","Outdoor","Soluble concentrates, emulsifiable concentrate, etc.","Upward spraying","Vehicle-mounted","Hands",3.27,0.64,0.64,null,3.74,0.69,0.71,null,3.12,0.89,0.28000000000000003,null,3.32,1,0.48]
["OutdoorSoluble concentrates, emulsifiable concentrate, etc.Upward sprayingManual-Hand heldHands","Outdoor","Soluble concentrates, emulsifiable concentrate, etc.","Upward spraying","Manual-Hand held","Hands",3.27,0.64,0.64,null,3.74,0.69,0.71,null,4.26,0.84,-0.83,null,4.41,0.77,-0.47]
["OutdoorSoluble concentrates, emulsifiable concentrate, etc.Downward sprayingVehicle-mounted-Drift ReductionBody","Outdoor","Soluble concentrates, emulsifiable concentrate, etc.","Downward spraying","Vehicle-mounted-Drift Reduction","Body",3.04,0.74,0.52,null,3.87,0.69,0.72,null,2.54,1,{"$f":"IF(d_AreaTreated>10,-1.43,0)","v":0},null,1.94,1,{"$f":"IF(d_AreaTreated>10,-0.82,0)","v":0}]
["IndoorSoluble concentrates, emulsifiable concentrate, etc.Upward sprayingManual-Hand heldHands","Indoor","Soluble concentrates, emulsifiable concentrate, etc.","Upward spraying","Manual-Hand held","Hands",3.27,0.64,0.64,null,3.74,0.69,0.71,null,{"$f":"opex_indoor75_hm!B$33","v":"4.4"},{"$f":"opex_indoor75_hm!C$33","v":"0.83"},null,null,{"$f":"opex_indoor95_hm!B$33","v":"4.81"},{"$f":"opex_indoor95_hm!C$33","v":"0.84"}]
["IndoorSoluble concentrates, emulsifiable concentrate, etc.Downward sprayingManual-Hand heldHands","Indoor","Soluble concentrates, emulsifiable concentrate, etc.","Downward spraying","Manual-Hand held","Hands",3.27,0.64,0.64,null,3.74,0.69,0.71,null,null,null,null,1323,null,null,null,4159]
["IndoorSoluble concentrates, emulsifiable concentrate, etc.Upward sprayingManual-TrolleyHands","Indoor","Soluble concentrates, emulsifiable concentrate, etc.","Upward spraying","Manual-Trolley","Hands",3.27,0.64,0.64,null,3.74,0.69,0.71,null,{"$f":"opex_indoor75_hm!B$33","v":"4.4"},{"$f":"opex_indoor75_hm!C$33","v":"0.83"},-0.62,null,{"$f":"opex_indoor95_hm!B$33","v":"4.81"},{"$f":"opex_indoor95_hm!C$33","v":"0.84"},-0.82]
["IndoorDenseSoluble concentrates, emulsifiable concentrate, etc.Upward sprayingManual-TrolleyBody","IndoorDense","Soluble concentrates, emulsifiable concentrate, etc.","Upward spraying","Manual-Trolley","Body",3.04,0.74,0.52,null,3.87,0.69,null,null,5.59,1,{"$f":"0.67-0.81","v":-0.14000000000000001},null,6.1,1,{"$f":"0.48-0.92","v":-0.44000000000000006}]
["OutdoorWettable granules, soluble granulesDownward sprayingVehicle-mounted-Drift ReductionBody","Outdoor","Wettable granules, soluble granules","Downward spraying","Vehicle-mounted-Drift Reduction","Body",3.04,0.74,null,null,3.87,0.69,null,null,2.54,1,{"$f":"IF(d_AreaTreated>10,-1.43,0)","v":0},null,1.94,1,{"$f":"IF(d_AreaTreated>10,-0.82,0)","v":0}]
["IndoorWettable granules, soluble granulesDownward sprayingManual-KnapsackBody","Indoor","Wettable granules, soluble granules","Downward spraying","Manual-Knapsack","Body",null,null,null,803,null,null,null,2787,null,null,null,16797,null,null,null,28082]
["OutdoorWettable powder, soluble powderDownward sprayingVehicle-mounted-Drift ReductionBody","Outdoor","Wettable powder, soluble powder","Downward spraying","Vehicle-mounted-Drift Reduction","Body",3.04,0.74,1.85,null,3.87,0.69,1.29,null,2.54,1,{"$f":"IF(d_AreaTreated>10,-1.43,0)","v":0},null,1.94,1,{"$f":"IF(d_AreaTreated>10,-0.82,0)","v":0}]
["OutdoorSoluble concentrates, emulsifiable concentrate, etc.Upward sprayingVehicle-mountedHead","Outdoor","Soluble concentrates, emulsifiable concentrate, etc.","Upward spraying","Vehicle-mounted","Head",1.46,1,{"$f":"0.34","v":0.34},null,2.19,1,0.39,null,1.17,1,1.89,null,2.29,1,1.56]
["OutdoorSoluble concentrates, emulsifiable concentrate, etc.Downward sprayingManual-KnapsackProtected Hands","Outdoor","Soluble concentrates, emulsifiable concentrate, etc.","Downward spraying","Manual-Knapsack","Protected Hands",null,null,null,21,null,null,null,164,null,null,null,5,null,null,null,22]
["OutdoorSoluble concentrates, emulsifiable concentrate, etc.Upward sprayingManual-KnapsackProtected Hands","Outdoor","Soluble concentrates, emulsifiable concentrate, etc.","Upward spraying","Manual-Knapsack","Protected Hands",null,null,null,21,null,null,null,164,2.2599999999999998,1,-0.88,null,2.61,1,-0.51]
["OutdoorWettable granules, soluble granulesDownward sprayingManual-KnapsackProtected Hands","Outdoor","Wettable granules, soluble granules","Downward spraying","Manual-Knapsack","Protected Hands",null,null,null,21,null,null,null,164,null,null,null,5,null,null,null,22]
["OutdoorWettable granules, soluble granulesUpward sprayingManual-KnapsackProtected Hands","Outdoor","Wettable granules, soluble granules","Upward spraying","Manual-Knapsack","Protected Hands",null,null,null,21,null,null,null,164,2.2599999999999998,1,-0.88,null,2.61,1,-0.51]
["OutdoorWettable powder, soluble powderDownward sprayingManual-KnapsackProtected Hands","Outdoor","Wettable powder, soluble powder","Downward spraying","Manual-Knapsack","Protected Hands",null,null,null,21,null,null,null,164,null,null,null,5,null,null,null,22]
["OutdoorWettable powder, soluble powderUpward sprayingManual-KnapsackProtected Hands","Outdoor","Wettable powder, soluble powder","Upward spraying","Manual-Knapsack","Protected Hands",null,null,null,21,null,null,null,164,2.2599999999999998,1,-0.88,null,2.61,1,-0.51]
["OutdoorSoluble concentrates, emulsifiable concentrate, etc.Downward sprayingManual-Hand heldHead","Outdoor","Soluble concentrates, emulsifiable concentrate, etc.","Downward spraying","Manual-Hand held","Head",1.46,1,{"$f":"0.34","v":0.34},null,2.19,1,0.39,null,null,null,null,12,null,null,null,85]
["OutdoorSoluble concentrates, emulsifiable concentrate, etc.Upward sprayingManual-Hand heldHead","Outdoor","Soluble concentrates, emulsifiable concentrate, etc.","Upward spraying","Manual-Hand held","Head",1.46,1,{"$f":"0.34","v":0.34},null,2.19,1,0.39,null,3.27,0.32,-1.0900000000000001,null,3.5,0.33,-0.59]
["OutdoorSoluble concentrates, emulsifiable concentrate, etc.Downward sprayingVehicle-mountedHands","Outdoor","Soluble concentrates, emulsifiable concentrate, etc.","Downward spraying","Vehicle-mounted","Hands",3.27,0.64,0.64,null,3.74,0.69,0.71,null,2.84,1,{"$f":"0.37+IF(d_AreaTreated>10,-1.04,0)","v":0.37},null,2.96,0.73,{"$f":"0.61+IF(d_AreaTreated>10,-0.21,0)","v":0.61}]
["OutdoorWettable granules, soluble granulesDownward sprayingVehicle-mountedHands","Outdoor","Wettable granules, soluble granules","Downward spraying","Vehicle-mounted","Hands",3.27,0.64,0,null,3.74,0.69,0,null,2.84,1,{"$f":"0.37+IF(d_AreaTreated>10,-1.04,0)","v":0.37},null,2.96,0.73,{"$f":"0.61+IF(d_AreaTreated>10,-0.21,0)","v":0.61}]
["IndoorDenseSoluble concentrates, emulsifiable concentrate, etc.Upward sprayingManual-Hand heldHands","IndoorDense","Soluble concentrates, emulsifiable concentrate, etc.","Upward spraying","Manual-Hand held","Hands",3.27,0.64,0.64,null,3.74,0.69,0.71,null,4.4000000000000004,0.83,0.17,null,4.8099999999999996,0.84,0.14000000000000001]
["OutdoorSoluble concentrates, emulsifiable concentrate, etc.Downward sprayingManual-Hand heldProtected Hands","Outdoor","Soluble concentrates, emulsifiable concentrate, etc.","Downward spraying","Manual-Hand held","Protected Hands",1.46,0.46,0.32,null,2.29,0.53,0.83,null,null,null,null,5,null,null,null,22]
["OutdoorWettable granules, soluble granulesUpward sprayingVehicle-mountedBody","Outdoor","Wettable granules, soluble granules","Upward spraying","Vehicle-mounted","Body",3.04,0.74,null,null,3.87,0.69,null,null,3.47,1,0.48,null,3.92,1,0.79]
["OutdoorSoluble concentrates, emulsifiable concentrate, etc.Upward sprayingVehicle-mountedInhalation","Outdoor","Soluble concentrates, emulsifiable concentrate, etc.","Upward spraying","Vehicle-mounted","Inhalation",1.38,0.38,-0.87,null,1.81,0.49,-0.92,null,0.99,0.56999999999999995,0.82,null,1.32,1,0.6]
["OutdoorSoluble concentrates, emulsifiable concentrate, etc.Downward sprayingManual-Hand heldInhalation","Outdoor","Soluble concentrates, emulsifiable concentrate, etc.","Downward spraying","Manual-Hand held","Inhalation",1.38,0.38,-0.87,null,1.81,0.49,-0.92,null,null,null,null,26,null,null,null,26]
["OutdoorSoluble concentrates, emulsifiable concentrate, etc.Upward sprayingManual-Hand heldInhalation","Outdoor","Soluble concentrates, emulsifiable concentrate, etc.","Upward spraying","Manual-Hand held","Inhalation",1.38,0.38,-0.87,null,1.81,0.49,-0.92,null,2.17,0.83,-0.26,null,2.52,0.6,-0.26]
["OutdoorWettable powder, soluble powderDownward sprayingVehicle-mountedHands","Outdoor","Wettable powder, soluble powder","Downward spraying","Vehicle-mounted","Hands",3.27,0.64,1.28,null,3.74,0.69,1.21,null,2.84,1,{"$f":"0.37+IF(d_AreaTreated>10,-1.04,0)","v":0.37},null,2.96,0.73,{"$f":"0.61+IF(d_AreaTreated>10,-0.21,0)","v":0.61}]
["IndoorWettable powder, soluble powderDownward sprayingManual-KnapsackBody","Indoor","Wettable powder, soluble powder","Downward spraying","Manual-Knapsack","Body",null,null,null,803,null,null,null,2787,null,null,null,16797,null,null,null,28082]
["IndoorSoluble concentrates, emulsifiable concentrate, etc.Upward sprayingManual-KnapsackBody","Indoor","Soluble concentrates, emulsifiable concentrate, etc.","Upward spraying","Manual-Knapsack","Body",null,null,{"$f":"0.34+IF([0]!Hole_D25=\"Hood and face shield\",-1.67,0)","v":0.34},803,null,null,null,2787,{"$f":"5.59","v":5.59},1,null,null,6.1,{"$f":"opex_indoor95_hm!C$35","v":"1"}]
["IndoorDenseSoluble concentrates, emulsifiable concentrate, etc.Upward sprayingManual-TrolleyHands","IndoorDense","Soluble concentrates, emulsifiable concentrate, etc.","Upward spraying","Manual-Trolley","Hands",3.27,0.64,0.64,null,3.74,0.69,0.71,null,4.4000000000000004,0.83,{"$f":"0.17-0.62","v":-0.44999999999999996},null,4.8099999999999996,0.84,{"$f":"0.14-0.82","v":-0.67999999999999994}]
["IndoorSoluble concentrates, emulsifiable concentrate, etc.Downward sprayingManual-Hand heldHead","Indoor","Soluble concentrates, emulsifiable concentrate, etc.","Downward spraying","Manual-Hand held","Head",1.46,1,{"$f":"0.34","v":0.34},null,2.19,1,0.39,null,null,null,null,21,null,null,null,39]
["OutdoorSoluble concentrates, emulsifiable concentrate, etc.Downward sprayingManual-Hand heldProtected Body","Outdoor","Soluble concentrates, emulsifiable concentrate, etc.","Downward spraying","Manual-Hand held","Protected Body",1.58,0.62,0.12,null,2.09,0.78,0.44,null,null,null,null,8903,null,null,null,62630]
["OutdoorSoluble concentrates, emulsifiable concentrate, etc.Downward sprayingVehicle-mounted-Drift ReductionHands","Outdoor","Soluble concentrates, emulsifiable concentrate, etc.","Downward spraying","Vehicle-mounted-Drift Reduction","Hands",3.27,0.64,0.64,null,3.74,0.69,0.71,null,2.84,1,{"$f":"IF(d_AreaTreated>10,-1.04,0)","v":0},null,2.96,0.73,{"$f":"IF(d_AreaTreated>10,-0.21,0)","v":0}]
["IndoorWettable powder, soluble powderDownward sprayingManual-Hand heldBody","Indoor","Wettable powder, soluble powder","Downward spraying","Manual-Hand held","Body",3.04,0.74,1.85,null,3.87,0.69,1.29,null,null,null,null,16797,null,null,null,28082]
["OutdoorSoluble concentrates, emulsifiable concentrate, etc.Upward sprayingManual-KnapsackBody","Outdoor","Soluble concentrates, emulsifiable concentrate, etc.","Upward spraying","Manual-Knapsack","Body",null,null,null,803,null,null,null,2787,6.08,0.16,-1.29,null,6.34,0.01,-1.0900000000000001]
["IndoorDenseSoluble concentrates, emulsifiable concentrate, etc.Downward sprayingManual-Hand heldBody","IndoorDense","Soluble concentrates, emulsifiable concentrate, etc.","Downward spraying","Manual-Hand held","Body",3.04,0.74,0.52,null,3.87,0.69,0.72,null,null,null,null,55521,null,null,null,85382]
["OutdoorWettable granules, soluble granulesUpward sprayingManual-KnapsackBody","Outdoor","Wettable granules, soluble granules","Upward spraying","Manual-Knapsack","Body",null,null,null,803,null,null,null,2787,6.08,0.16,-1.29,null,6.34,0.01,-1.0900000000000001]
["IndoorDenseWettable granules, soluble granulesDownward sprayingManual-Hand heldBody","IndoorDense","Wettable granules, soluble granules","Downward spraying","Manual-Hand held","Body",3.04,0.74,null,null,3.87,0.69,null,null,null,null,null,55521,null,null,null,85382]
["OutdoorWettable powder, soluble powderUpward sprayingManual-KnapsackBody","Outdoor","Wettable powder, soluble powder","Upward spraying","Manual-Knapsack","Body",null,null,null,803,null,null,null,2787,6.08,0.16,-1.29,null,6.34,0.01,-1.0900000000000001]
["OutdoorSoluble concentrates, emulsifiable concentrate, etc.Upward sprayingManual-Hand heldProtected Body","Outdoor","Soluble concentrates, emulsifiable concentrate, etc.","Upward spraying","Manual-Hand held","Protected Body",1.58,0.62,0.12,null,2.09,0.78,0.44,null,4.6500000000000004,null,-1.64,null,5.27,null,-1.99]
["OutdoorSoluble concentrates, emulsifiable concentrate, etc.Upward sprayingVehicle-mountedProtected Body","Outdoor","Soluble concentrates, emulsifiable concentrate, etc.","Upward spraying","Vehicle-mounted","Protected Body",1.58,0.62,0.12,null,2.09,0.78,0.44,null,1.83,1,0.23,null,2.21,1,0.15]
["IndoorWettable granules, soluble granulesUpward sprayingManual-KnapsackBody","Indoor","Wettable granules, soluble granules","Upward spraying","Manual-Knapsack","Body",null,null,null,803,null,null,null,2787,{"$f":"5.59","v":5.59},1,null,null,6.1,{"$f":"opex_indoor95_hm!C$35","v":"1"}]
["OutdoorWettable granules, soluble granulesDownward sprayingVehicle-mounted-Drift ReductionHands","Outdoor","Wettable granules, soluble granules","Downward spraying","Vehicle-mounted-Drift Reduction","Hands",3.27,0.64,0,null,3.74,0.69,0,null,2.84,1,{"$f":"IF(d_AreaTreated>10,-1.04,0)","v":0},null,2.96,0.73,{"$f":"IF(d_AreaTreated>10,-0.21,0)","v":0}]
["OutdoorSoluble concentrates, emulsifiable concentrate, etc.Upward sprayingManual-Hand heldProtected Hands","Outdoor","Soluble concentrates, emulsifiable concentrate, etc.","Upward spraying","Manual-Hand held","Protected Hands",1.46,0.46,0.32,null,2.29,0.53,0.83,null,2.2599999999999998,1,-0.88,null,2.61,1,-0.51]
["IndoorSoluble concentrates, emulsifiable concentrate, etc.Upward sprayingManual-Hand heldHead","Indoor","Soluble concentrates, emulsifiable concentrate, etc.","Upward spraying","Manual-Hand held","Head",1.46,1,{"$f":"0.34","v":0.34},null,2.19,1,0.39,null,2.7,0.18,null,null,3.1,0.33]
[{"$f":"B67&C67&D67&E67&F67","v":"IndoorWettable granules, soluble granulesUpward sprayingManual-Hand heldBody"},"Indoor","Wettable granules, soluble granules","Upward spraying","Manual-Hand held","Body",3.04,0.74,null,null,3.87,0.69,null,null,{"$f":"5.59","v":5.59},1,null,null,6.1,{"$f":"opex_indoor95_hm!C$35","v":"1"}]
["OutdoorWettable powder, soluble powderDownward sprayingVehicle-mounted-Drift ReductionHands","Outdoor","Wettable powder, soluble powder","Downward spraying","Vehicle-mounted-Drift Reduction","Hands",3.27,0.64,1.28,null,3.74,0.69,1.21,null,2.84,1,{"$f":"IF(d_AreaTreated>10,-1.04,0)","v":0},null,2.96,0.73,{"$f":"IF(d_AreaTreated>10,-0.21,0)","v":0}]
["OutdoorSoluble concentrates, emulsifiable concentrate, etc.Upward sprayingVehicle-mountedProtected Hands","Outdoor","Soluble concentrates, emulsifiable concentrate, etc.","Upward spraying","Vehicle-mounted","Protected Hands",1.46,0.46,0.32,null,2.29,0.53,0.83,null,1.55,1,null,null,2.88,1,0.08]
["IndoorDenseSoluble concentrates, emulsifiable concentrate, etc.Downward sprayingManual-KnapsackBody","IndoorDense","Soluble concentrates, emulsifiable concentrate, etc.","Downward spraying","Manual-Knapsack","Body",null,null,null,803,null,null,null,2787,null,null,null,55521,null,null,null,85382]
["IndoorWettable powder, soluble powderUpward sprayingManual-KnapsackBody","Indoor","Wettable powder, soluble powder","Upward spraying","Manual-Knapsack","Body",null,null,null,803,null,null,null,2787,{"$f":"5.59","v":5.59},1,null,null,6.1,{"$f":"opex_indoor95_hm!C$35","v":"1"}]
["OutdoorWettable granules, soluble granulesUpward sprayingManual-Hand heldBody","Outdoor","Wettable granules, soluble granules","Upward spraying","Manual-Hand held","Body",3.04,0.74,null,null,3.87,0.69,null,null,6.08,0.16,-1.29,null,6.34,0.01,-1.0900000000000001]
["IndoorDenseWettable granules, soluble granulesDownward sprayingManual-KnapsackBody","IndoorDense","Wettable granules, soluble granules","Downward spraying","Manual-Knapsack","Body",null,null,null,803,null,null,null,2787,null,null,null,55521,null,null,null,85382]
["IndoorSoluble concentrates, emulsifiable concentrate, etc.Upward sprayingManual-TrolleyHead","Indoor","Soluble concentrates, emulsifiable concentrate, etc.","Upward spraying","Manual-Trolley","Head",1.46,1,{"$f":"0.34","v":0.34},null,2.19,1,0.39,null,2.7,0.18,-0.41,null,3.1,0.33,0.25]
["OutdoorSoluble concentrates, emulsifiable concentrate, etc.Downward sprayingVehicle-mountedHead","Outdoor","Soluble concentrates, emulsifiable concentrate, etc.","Downward spraying","Vehicle-mounted","Head",1.46,1,{"$f":"0.34","v":0.34},null,2.19,1,0.39,null,0.24,1,{"$f":"0.88+IF(d_AreaTreated>10,-0.53,0)","v":0.88},null,1.1599999999999999,1,{"$f":"1.03+IF(d_AreaTreated>10,-1.12,0)","v":1.03}]
["IndoorSoluble concentrates, emulsifiable concentrate, etc.Upward sprayingManual-Hand heldInhalation","Indoor","Soluble concentrates, emulsifiable concentrate, etc.","Upward spraying","Manual-Hand held","Inhalation",1.38,0.38,-0.87,null,1.81,0.49,-0.92,null,{"$f":"opex_indoor75_hm!B$38","v":"2.69"},{"$f":"opex_indoor75_hm!C$38","v":"1"},null,null,{"$f":"opex_indoor95_hm!B$38","v":"2.82"},{"$f":"opex_indoor95_hm!C$38","v":"1"}]
["IndoorSoluble concentrates, emulsifiable concentrate, etc.Downward sprayingManual-Hand heldProtected Hands","Indoor","Soluble concentrates, emulsifiable concentrate, etc.","Downward spraying","Manual-Hand held","Protected Hands",1.46,0.46,0.32,null,2.29,0.53,0.83,null,null,null,null,1.5,null,null,null,12]
["OutdoorSoluble concentrates, emulsifiable concentrate, etc.Downward sprayingManual-KnapsackProtected Body","Outdoor","Soluble concentrates, emulsifiable concentrate, etc.","Downward spraying","Manual-Knapsack","Protected Body",null,null,null,25,null,null,null,103,null,null,null,8903,null,null,null,62630]
["OutdoorSoluble concentrates, emulsifiable concentrate, etc.Upward sprayingManual-KnapsackProtected Body","Outdoor","Soluble concentrates, emulsifiable concentrate, etc.","Upward spraying","Manual-Knapsack","Protected Body",null,null,null,25,null,null,null,103,4.6500000000000004,null,-1.64,null,5.27,null,-1.99]
["OutdoorWettable granules, soluble granulesDownward sprayingManual-KnapsackProtected Body","Outdoor","Wettable granules, soluble granules","Downward spraying","Manual-Knapsack","Protected Body",null,null,null,25,null,null,null,103,null,null,null,8903,null,null,null,62630]
["OutdoorWettable granules, soluble granulesUpward sprayingManual-KnapsackProtected Body","Outdoor","Wettable granules, soluble granules","Upward spraying","Manual-Knapsack","Protected Body",null,null,null,25,null,null,null,103,4.6500000000000004,null,-1.64,null,5.27,null,-1.99]
["OutdoorWettable powder, soluble powderDownward sprayingManual-KnapsackProtected Body","Outdoor","Wettable powder, soluble powder","Downward spraying","Manual-Knapsack","Protected Body",null,null,null,25,null,null,null,103,null,null,null,8903,null,null,null,62630]
["OutdoorWettable powder, soluble powderUpward sprayingManual-KnapsackProtected Body","Outdoor","Wettable powder, soluble powder","Upward spraying","Manual-Knapsack","Protected Body",null,null,null,25,null,null,null,103,4.6500000000000004,null,-1.64,null,5.27,null,-1.99]
["IndoorDenseWettable powder, soluble powderDownward sprayingManual-KnapsackBody","IndoorDense","Wettable powder, soluble powder","Downward spraying","Manual-Knapsack","Body",null,null,null,803,null,null,null,2787,null,null,null,55521,null,null,null,85382]
["IndoorWettable granules, soluble granulesUpward sprayingManual-TrolleyBody","Indoor","Wettable granules, soluble granules","Upward spraying","Manual-Trolley","Body",3.04,0.74,null,null,3.87,0.69,null,null,{"$f":"5.59","v":5.59},1,-0.81,null,6.1,{"$f":"opex_indoor95_hm!C$35","v":"1"},-0.92]
["IndoorDenseSoluble concentrates, emulsifiable concentrate, etc.Upward sprayingManual-Hand heldHead","IndoorDense","Soluble concentrates, emulsifiable concentrate, etc.","Upward spraying","Manual-Hand held","Head",1.46,1,{"$f":"0.34","v":0.34},null,2.19,1,0.39,null,2.7,0.18,0.28999999999999998,null,3.1,0.33,0.79]
["IndoorSoluble concentrates, emulsifiable concentrate, etc.Downward sprayingManual-Hand heldInhalation","Indoor","Soluble concentrates, emulsifiable concentrate, etc.","Downward spraying","Manual-Hand held","Inhalation",1.38,0.38,-0.87,null,1.81,0.49,-0.92,null,null,null,null,47,null,null,null,80]
["IndoorSoluble concentrates, emulsifiable concentrate, etc.Upward sprayingManual-TrolleyProtected Hands","Indoor","Soluble concentrates, emulsifiable concentrate, etc.","Upward spraying","Manual-Trolley","Protected Hands",1.46,0.46,0.32,null,2.29,0.53,0.83,null,{"$f":"opex_indoor75_hm!B$34","v":"1.71"},{"$f":"opex_indoor75_hm!C$34","v":"1"},-1.04,null,{"$f":"opex_indoor95_hm!B$34","v":"2.36"},{"$f":"opex_indoor95_hm!C$34","v":"0.67"}]
["IndoorSoluble concentrates, emulsifiable concentrate, etc.Downward sprayingManual-Hand heldProtected Body","Indoor","Soluble concentrates, emulsifiable concentrate, etc.","Downward spraying","Manual-Hand held","Protected Body",1.58,0.62,0.12,null,2.09,0.78,0.44,null,null,null,null,132,null,null,null,640]
["OutdoorSoluble concentrates, emulsifiable concentrate, etc.Upward sprayingVehicle-mounted-CabinBody","Outdoor","Soluble concentrates, emulsifiable concentrate, etc.","Upward spraying","Vehicle-mounted-Cabin","Body",3.04,0.74,0.52,null,3.87,0.69,0.72,null,3.47,1,null,null,3.92,1]
["IndoorDenseWettable powder, soluble powderDownward sprayingManual-Hand heldBody","IndoorDense","Wettable powder, soluble powder","Downward spraying","Manual-Hand held","Body",3.04,0.74,1.85,null,3.87,0.69,1.29,null,null,null,null,55521,null,null,null,85382]
["OutdoorWettable granules, soluble granulesUpward sprayingVehicle-mounted-CabinBody","Outdoor","Wettable granules, soluble granules","Upward spraying","Vehicle-mounted-Cabin","Body",3.04,0.74,null,null,3.87,0.69,null,null,3.47,1,null,null,3.92,1]
["OutdoorSoluble concentrates, emulsifiable concentrate, etc.Downward sprayingManual-Hand heldBody","Outdoor","Soluble concentrates, emulsifiable concentrate, etc.","Downward spraying","Manual-Hand held","Body",3.04,0.74,0.52,null,3.87,0.69,0.72,null,null,null,null,88868,null,null,null,137007]
["IndoorDenseSoluble concentrates, emulsifiable concentrate, etc.Upward sprayingManual-TrolleyHead","IndoorDense","Soluble concentrates, emulsifiable concentrate, etc.","Upward spraying","Manual-Trolley","Head",1.46,1,{"$f":"0.34","v":0.34},null,2.19,1,0.39,null,2.7,0.18,{"$f":"0.29-0.41","v":-0.12},null,3.1,0.33,{"$f":"0.79+0.25","v":1.04}]
["IndoorDenseWettable granules, soluble granulesUpward sprayingManual-Hand heldBody","IndoorDense","Wettable granules, soluble granules","Upward spraying","Manual-Hand held","Body",3.04,0.74,null,null,3.87,0.69,null,null,5.59,1,0.67,null,6.1,1,0.48]
["IndoorSoluble concentrates, emulsifiable concentrate, etc.Upward sprayingManual-TrolleyInhalation","Indoor","Soluble concentrates, emulsifiable concentrate, etc.","Upward spraying","Manual-Trolley","Inhalation",1.38,0.38,-0.87,null,1.81,0.49,-0.92,null,{"$f":"opex_indoor75_hm!B$38","v":"2.69"},{"$f":"opex_indoor75_hm!C$38","v":"1"},-0.19,null,{"$f":"opex_indoor95_hm!B$38","v":"2.82"},{"$f":"opex_indoor95_hm!C$38","v":"1"},-0.26]
["IndoorDenseWettable granules, soluble granulesUpward sprayingManual-TrolleyBody","IndoorDense","Wettable granules, soluble granules","Upward spraying","Manual-Trolley","Body",3.04,0.74,null,null,3.87,0.69,null,null,5.59,1,{"$f":"0.67-0.81","v":-0.14000000000000001},-0.64,6.1,1,{"$f":"0.48-0.92","v":-0.44000000000000006}]
["IndoorSoluble concentrates, emulsifiable concentrate, etc.Upward sprayingManual-Hand heldProtected Body","Indoor","Soluble concentrates, emulsifiable concentrate, etc.","Upward spraying","Manual-Hand held","Protected Body",1.58,0.62,0.12,null,2.09,0.78,0.44,null,4.1900000000000004,1,null,null,5.07,1]
["OutdoorWettable powder, soluble powderUpward sprayingVehicle-mounted-CabinBody","Outdoor","Wettable powder, soluble powder","Upward spraying","Vehicle-mounted-Cabin","Body",3.04,0.74,1.85,null,3.87,0.69,1.29,null,3.47,1,null,null,3.92,1]
["OutdoorSoluble concentrates, emulsifiable concentrate, etc.Downward sprayingManual-KnapsackHead","Outdoor","Soluble concentrates, emulsifiable concentrate, etc.","Downward spraying","Manual-Knapsack","Head",null,null,null,5.5,null,null,null,11,null,null,null,12,null,null,null,85]
["OutdoorSoluble concentrates, emulsifiable concentrate, etc.Upward sprayingManual-KnapsackHead","Outdoor","Soluble concentrates, emulsifiable concentrate, etc.","Upward spraying","Manual-Knapsack","Head",null,null,null,5.5,null,null,null,11,3.27,0.32,-1.0900000000000001,null,3.5,0.33,-0.59]
["OutdoorWettable granules, soluble granulesDownward sprayingManual-KnapsackHead","Outdoor","Wettable granules, soluble granules","Downward spraying","Manual-Knapsack","Head",null,null,null,5.5,null,null,null,11,null,null,null,12,null,null,null,85]
["OutdoorWettable granules, soluble granulesUpward sprayingManual-KnapsackHead","Outdoor","Wettable granules, soluble granules","Upward spraying","Manual-Knapsack","Head",null,null,null,5.5,null,null,null,11,3.27,0.32,-1.0900000000000001,null,3.5,0.33,-0.59]
["OutdoorWettable powder, soluble powderDownward sprayingManual-KnapsackHead","Outdoor","Wettable powder, soluble powder","Downward spraying","Manual-Knapsack","Head",null,null,null,5.5,null,null,null,11,null,null,null,12,null,null,null,85]
["OutdoorWettable powder, soluble powderUpward sprayingManual-KnapsackHead","Outdoor","Wettable powder, soluble powder","Upward spraying","Manual-Knapsack","Head",null,null,null,5.5,null,null,null,11,3.27,0.32,-1.0900000000000001,null,3.5,0.33,-0.59]
["OutdoorSoluble concentrates, emulsifiable concentrate, etc.Downward sprayingManual-KnapsackBody","Outdoor","Soluble concentrates, emulsifiable concentrate, etc.","Downward spraying","Manual-Knapsack","Body",null,null,null,803,null,null,null,2787,null,null,null,88868,null,null,null,137007]
["OutdoorWettable granules, soluble granulesDownward sprayingManual-KnapsackBody","Outdoor","Wettable granules, soluble granules","Downward spraying","Manual-Knapsack","Body",null,null,null,803,null,null,null,2787,null,null,null,88868,null,null,null,137007]
["IndoorDenseSoluble concentrates, emulsifiable concentrate, etc.Upward sprayingManual-Hand heldInhalation","IndoorDense","Soluble concentrates, emulsifiable concentrate, etc.","Upward spraying","Manual-Hand held","Inhalation",1.38,0.38,-0.87,null,1.81,0.49,-0.92,null,2.69,1,0.08,null,2.82,1,0.63]
["IndoorSoluble concentrates, emulsifiable concentrate, etc.Upward sprayingManual-TrolleyProtected Body","Indoor","Soluble concentrates, emulsifiable concentrate, etc.","Upward spraying","Manual-Trolley","Protected Body",1.58,0.62,0.12,null,2.09,0.78,0.44,null,4.1900000000000004,1,-1.23,null,5.07,1,-1.71]
["OutdoorSoluble concentrates, emulsifiable concentrate, etc.Upward sprayingVehicle-mounted-CabinHands","Outdoor","Soluble concentrates, emulsifiable concentrate, etc.","Upward spraying","Vehicle-mounted-Cabin","Hands",3.27,0.64,0.64,null,3.74,0.69,0.71,null,3.12,0.89,null,null,3.32,1]
["OutdoorSoluble concentrates, emulsifiable concentrate, etc.Downward sprayingVehicle-mounted-Drift ReductionHead","Outdoor","Soluble concentrates, emulsifiable concentrate, etc.","Downward spraying","Vehicle-mounted-Drift Reduction","Head",1.46,1,{"$f":"0.34","v":0.34},null,2.19,1,0.39,null,0.24,1,{"$f":"IF(d_AreaTreated>10,-0.53,0)","v":0},null,1.1599999999999999,1,{"$f":"IF(d_AreaTreated>10,-1.12,0)","v":0}]
["OutdoorSoluble concentrates, emulsifiable concentrate, etc.Upward sprayingVehicle-mounted-CabinHead","Outdoor","Soluble concentrates, emulsifiable concentrate, etc.","Upward spraying","Vehicle-mounted-Cabin","Head",1.46,1,{"$f":"0.34","v":0.34},null,2.19,1,0.39,null,1.17,1,null,null,2.29,1]
["OutdoorWettable granules, soluble granulesUpward sprayingVehicle-mountedHands","Outdoor","Wettable granules, soluble granules","Upward spraying","Vehicle-mounted","Hands",3.27,0.64,0,null,3.74,0.69,0,null,3.12,0.89,0.28000000000000003,null,3.32,1,0.48]
["OutdoorWettable powder, soluble powderDownward sprayingManual-KnapsackBody","Outdoor","Wettable powder, soluble powder","Downward spraying","Manual-Knapsack","Body",null,null,null,803,null,null,null,2787,null,null,null,88868,null,null,null,137007]
["IndoorDenseSoluble concentrates, emulsifiable concentrate, etc.Upward sprayingManual-Hand heldProtected Body","IndoorDense","Soluble concentrates, emulsifiable concentrate, etc.","Upward spraying","Manual-Hand held","Protected Body",1.58,0.62,0.12,null,2.09,0.78,0.44,null,4.1900000000000004,1,{"$f":"1.64+IF(I_PPE_appl=\"Protective coverall\",-0.54,IF(I_PPE_appl=\"Rain suit\",-2.42,0))","v":1.64},null,5.07,1,{"$f":"1.07+IF(I_PPE_appl=\"Protective coverall\",-0.64,IF(I_PPE_appl=\"Rain suit\",-2.2,0))","v":1.07}]
["OutdoorWettable granules, soluble granulesUpward sprayingVehicle-mounted-CabinHands","Outdoor","Wettable granules, soluble granules","Upward spraying","Vehicle-mounted-Cabin","Hands",3.27,0.64,0,null,3.74,0.69,0,null,3.12,0.89,null,null,3.32,1]
["IndoorDenseSoluble concentrates, emulsifiable concentrate, etc.Downward sprayingManual-Hand heldHead","IndoorDense","Soluble concentrates, emulsifiable concentrate, etc.","Downward spraying","Manual-Hand held","Head",1.46,1,{"$f":"0.34","v":0.34},null,2.19,1,0.39,null,null,null,null,21,null,null,null,39]
["IndoorSoluble concentrates, emulsifiable concentrate, etc.Upward sprayingManual-Hand heldProtected Hands","Indoor","Soluble concentrates, emulsifiable concentrate, etc.","Upward spraying","Manual-Hand held","Protected Hands",1.46,0.46,0.32,null,2.29,0.53,0.83,null,1.71,{"$f":"opex_indoor75_hm!C$34","v":"1"},null,null,2.36,{"$f":"opex_indoor95_hm!C$34","v":"0.67"}]
["IndoorDenseSoluble concentrates, emulsifiable concentrate, etc.Upward sprayingManual-TrolleyProtected Hands","IndoorDense","Soluble concentrates, emulsifiable concentrate, etc.","Upward spraying","Manual-Trolley","Protected Hands",4.4000000000000004,0.46,0.32,null,2.29,0.53,0,null,1.71,1,{"$f":"1.32-1.04","v":0.28000000000000003},null,2.36,0.67,{"$f":"0.76-1.19","v":-0.42999999999999994}]
["OutdoorWettable granules, soluble granulesDownward sprayingManual-Hand heldHands","Outdoor","Wettable granules, soluble granules","Downward spraying","Manual-Hand held","Hands",3.27,0.64,0,null,3.74,0.69,0,null,null,null,null,1544,null,null,null,4213]
["IndoorSoluble concentrates, emulsifiable concentrate, etc.Upward sprayingManual-KnapsackHands","Indoor","Soluble concentrates, emulsifiable concentrate, etc.","Upward spraying","Manual-Knapsack","Hands",null,null,null,9497,null,null,null,25490,{"$f":"opex_indoor75_hm!B$33","v":"4.4"},{"$f":"opex_indoor75_hm!C$33","v":"0.83"},null,null,{"$f":"opex_indoor95_hm!B$33","v":"4.81"},{"$f":"opex_indoor95_hm!C$33","v":"0.84"}]
["OutdoorWettable granules, soluble granulesUpward sprayingManual-Hand heldHands","Outdoor","Wettable granules, soluble granules","Upward spraying","Manual-Hand held","Hands",3.27,0.64,0,null,3.74,0.69,0,null,4.26,0.84,-0.83,null,4.41,0.77,-0.47]
["OutdoorSoluble concentrates, emulsifiable concentrate, etc.Downward sprayingManual-KnapsackInhalation","Outdoor","Soluble concentrates, emulsifiable concentrate, etc.","Downward spraying","Manual-Knapsack","Inhalation",null,null,null,35,null,null,0,36,null,null,null,26,null,null,null,26]
["OutdoorSoluble concentrates, emulsifiable concentrate, etc.Upward sprayingManual-KnapsackInhalation","Outdoor","Soluble concentrates, emulsifiable concentrate, etc.","Upward spraying","Manual-Knapsack","Inhalation",null,null,null,35,null,null,null,36,2.17,0.83,-0.26,null,2.52,0.6,-0.26]
["OutdoorWettable granules, soluble granulesDownward sprayingManual-KnapsackInhalation","Outdoor","Wettable granules, soluble granules","Downward spraying","Manual-Knapsack","Inhalation",null,null,null,35,null,null,null,36,null,null,null,26,null,null,null,26]
["OutdoorWettable granules, soluble granulesUpward sprayingManual-KnapsackInhalation","Outdoor","Wettable granules, soluble granules","Upward spraying","Manual-Knapsack","Inhalation",null,null,null,35,null,null,null,36,2.17,0.83,-0.26,null,2.52,0.6,-0.26]
["OutdoorWettable powder, soluble powderDownward sprayingManual-KnapsackInhalation","Outdoor","Wettable powder, soluble powder","Downward spraying","Manual-Knapsack","Inhalation",null,null,null,35,null,null,null,36,null,null,null,26,null,null,null,26]
["OutdoorWettable powder, soluble powderUpward sprayingManual-KnapsackInhalation","Outdoor","Wettable powder, soluble powder","Upward spraying","Manual-Knapsack","Inhalation",null,null,null,35,null,null,null,36,2.17,0.83,-0.26,null,2.52,0.6,-0.26]
["IndoorDenseSoluble concentrates, emulsifiable concentrate, etc.Upward sprayingManual-TrolleyProtected Body","IndoorDense","Soluble concentrates, emulsifiable concentrate, etc.","Upward spraying","Manual-Trolley","Protected Body",1.58,0.62,0.12,null,2.09,0.78,0.44,null,4.1900000000000004,1,{"$f":"1.64-1.23+IF(I_PPE_appl=\"Protective coverall\",-0.54,IF(I_PPE_appl=\"Rain suit\",-2.42,0))","v":0.40999999999999992},null,5.07,1,{"$f":"1.07-1.71+IF(I_PPE_appl=\"Protective coverall\",-0.64,IF(I_PPE_appl=\"Rain suit\",-2.2,0))","v":-0.6399999999999999}]
["OutdoorWettable powder, soluble powderUpward sprayingVehicle-mounted-CabinHands","Outdoor","Wettable powder, soluble powder","Upward spraying","Vehicle-mounted-Cabin","Hands",3.27,0.64,1.28,null,3.74,0.69,1.21,null,3.12,0.89,null,null,3.32,1]
[{"$f":"B131&C131&D131&E131&F131","v":"IndoorDenseSoluble concentrates, emulsifiable concentrate, etc.Downward sprayingManual-Hand heldHands"},"IndoorDense","Soluble concentrates, emulsifiable concentrate, etc.","Downward spraying","Manual-Hand held","Hands",3.27,0.64,0.64,null,3.74,0.69,0.71,null,null,null,null,1323,null,null,null,4159]
["OutdoorWettable granules, soluble granulesDownward sprayingVehicle-mountedHead","Outdoor","Wettable granules, soluble granules","Downward spraying","Vehicle-mounted","Head",1.46,1,0,null,2.19,1,0,null,0.24,1,{"$f":"0.88+IF(d_AreaTreated>10,-0.53,0)","v":0.88},null,1.1599999999999999,1,{"$f":"1.03+IF(d_AreaTreated>10,-1.12,0)","v":1.03}]
["IndoorDenseSoluble concentrates, emulsifiable concentrate, etc.Upward sprayingManual-Hand heldProtected Hands","IndoorDense","Soluble concentrates, emulsifiable concentrate, etc.","Upward spraying","Manual-Hand held","Protected Hands",1.46,0.46,0.32,null,2.29,0.53,0.83,null,1.71,1,1.32,null,2.36,0.67,0.76]
["IndoorWettable granules, soluble granulesUpward sprayingManual-Hand heldHands","Indoor","Wettable granules, soluble granules","Upward spraying","Manual-Hand held","Hands",3.27,0.64,0,null,3.74,0.69,0,null,{"$f":"opex_indoor75_hm!B$33","v":"4.4"},{"$f":"opex_indoor75_hm!C$33","v":"0.83"},null,null,{"$f":"opex_indoor95_hm!B$33","v":"4.81"},{"$f":"opex_indoor95_hm!C$33","v":"0.84"}]
["IndoorDenseSoluble concentrates, emulsifiable concentrate, etc.Upward sprayingManual-TrolleyInhalation","IndoorDense","Soluble concentrates, emulsifiable concentrate, etc.","Upward spraying","Manual-Trolley","Inhalation",1.38,0.38,-0.87,null,1.81,0.49,-0.92,null,2.69,1,{"$f":"0.08-0.19","v":-0.11},null,2.82,1,{"$f":"0.63-0.26","v":0.37}]
["IndoorWettable granules, soluble granulesDownward sprayingManual-Hand heldHands","Indoor","Wettable granules, soluble granules","Downward spraying","Manual-Hand held","Hands",3.27,0.64,0,null,3.74,0.69,null,null,null,null,null,1323,null,null,null,4159]
["IndoorWettable granules, soluble granulesUpward sprayingManual-TrolleyHands","Indoor","Wettable granules, soluble granules","Upward spraying","Manual-Trolley","Hands",3.27,0.64,0,null,3.74,0.69,0,null,{"$f":"opex_indoor75_hm!B$33","v":"4.4"},{"$f":"opex_indoor75_hm!C$33","v":"0.83"},-0.62,null,{"$f":"opex_indoor95_hm!B$33","v":"4.81"},{"$f":"opex_indoor95_hm!C$33","v":"0.84"},-0.82]
["OutdoorSoluble concentrates, emulsifiable concentrate, etc.Upward sprayingVehicle-mounted-CabinInhalation","Outdoor","Soluble concentrates, emulsifiable concentrate, etc.","Upward spraying","Vehicle-mounted-Cabin","Inhalation",1.38,0.38,-0.87,null,1.81,0.49,-0.92,null,0.99,0.56999999999999995,null,null,1.32,1]
["IndoorDenseWettable granules, soluble granulesDownward sprayingManual-Hand heldHands","IndoorDense","Wettable granules, soluble granules","Downward spraying","Manual-Hand held","Hands",3.27,0.64,0,null,3.74,0.69,0,null,null,null,null,1323,null,null,null,4159]
["IndoorDenseWettable granules, soluble granulesUpward sprayingManual-Hand heldHands","IndoorDense","Wettable granules, soluble granules","Upward spraying","Manual-Hand held","Hands",3.27,0.64,0,null,3.74,0.69,0,null,4.4000000000000004,0.83,0.17,null,4.8099999999999996,0.84,0.14000000000000001]
["IndoorSoluble concentrates, emulsifiable concentrate, etc.Downward sprayingManual-KnapsackHands","Indoor","Soluble concentrates, emulsifiable concentrate, etc.","Downward spraying","Manual-Knapsack","Hands",null,null,null,9497,null,null,null,25490,null,null,null,1323,null,null,null,4159]
["IndoorWettable granules, soluble granulesDownward sprayingManual-KnapsackHands","Indoor","Wettable granules, soluble granules","Downward spraying","Manual-Knapsack","Hands",null,null,null,9497,null,null,null,25490,null,null,null,1323,null,null,null,4159]
["IndoorDenseWettable granules, soluble granulesUpward sprayingManual-TrolleyHands","IndoorDense","Wettable granules, soluble granules","Upward spraying","Manual-Trolley","Hands",3.27,0.64,0,null,3.74,0.69,0,null,4.4000000000000004,0.83,{"$f":"0.17-0.62","v":-0.44999999999999996},null,4.8099999999999996,0.84,{"$f":"0.14-0.82","v":-0.67999999999999994}]
["IndoorWettable granules, soluble granulesUpward sprayingManual-KnapsackHands","Indoor","Wettable granules, soluble granules","Upward spraying","Manual-Knapsack","Hands",null,null,null,9497,null,null,null,25490,{"$f":"opex_indoor75_hm!B$33","v":"4.4"},{"$f":"opex_indoor75_hm!C$33","v":"0.83"},null,null,{"$f":"opex_indoor95_hm!B$33","v":"4.81"},{"$f":"opex_indoor95_hm!C$33","v":"0.84"}]
["IndoorWettable powder, soluble powderUpward sprayingManual-KnapsackHands","Indoor","Wettable powder, soluble powder","Upward spraying","Manual-Knapsack","Hands",null,null,null,9497,null,null,null,25490,{"$f":"opex_indoor75_hm!B$33","v":"4.4"},{"$f":"opex_indoor75_hm!C$33","v":"0.83"},null,null,{"$f":"opex_indoor95_hm!B$33","v":"4.81"},{"$f":"opex_indoor95_hm!C$33","v":"0.84"}]
["OutdoorWettable granules, soluble granulesUpward sprayingVehicle-mounted-CabinHead","Outdoor","Wettable granules, soluble granules","Upward spraying","Vehicle-mounted-Cabin","Head",1.46,1,0,null,2.19,1,0,null,1.17,1,null,null,2.29,1]
["OutdoorWettable granules, soluble granulesUpward sprayingVehicle-mountedHead","Outdoor","Wettable granules, soluble granules","Upward spraying","Vehicle-mounted","Head",1.46,1,0,null,2.19,1,0,null,1.17,1,1.89,null,2.29,1,1.56]
["OutdoorWettable granules, soluble granulesDownward sprayingVehicle-mounted-Drift ReductionHead","Outdoor","Wettable granules, soluble granules","Downward spraying","Vehicle-mounted-Drift Reduction","Head",1.46,1,0,null,2.19,1,0,null,0.24,1,{"$f":"IF(d_AreaTreated>10,-0.53,0)","v":0},null,1.1599999999999999,1,{"$f":"IF(d_AreaTreated>10,-1.12,0)","v":0}]
["OutdoorWettable granules, soluble granulesDownward sprayingManual-Hand heldHead","Outdoor","Wettable granules, soluble granules","Downward spraying","Manual-Hand held","Head",1.46,1,0,null,2.19,1,0,null,null,null,null,12,null,null,null,85]
["IndoorWettable powder, soluble powderDownward sprayingManual-KnapsackHands","Indoor","Wettable powder, soluble powder","Downward spraying","Manual-Knapsack","Hands",null,null,null,9497,null,null,null,25490,null,null,null,1323,null,null,null,4159]
["OutdoorWettable granules, soluble granulesUpward sprayingManual-Hand heldHead","Outdoor","Wettable granules, soluble granules","Upward spraying","Manual-Hand held","Head",1.46,1,0,null,2.19,1,0,null,3.27,0.32,-1.0900000000000001,null,3.5,0.33,-0.59]
["IndoorWettable granules, soluble granulesUpward sprayingManual-Hand heldHead","Indoor","Wettable granules, soluble granules","Upward spraying","Manual-Hand held","Head",1.46,1,0,null,2.19,1,0,null,2.7,0.18,null,null,3.1,0.33]
["IndoorWettable granules, soluble granulesDownward sprayingManual-Hand heldHead","Indoor","Wettable granules, soluble granules","Downward spraying","Manual-Hand held","Head",1.46,1,0,null,2.19,1,null,null,null,null,null,21,null,null,null,39]
["OutdoorWettable powder, soluble powderUpward sprayingVehicle-mountedHands","Outdoor","Wettable powder, soluble powder","Upward spraying","Vehicle-mounted","Hands",3.27,0.64,1.28,null,3.74,0.69,1.21,null,3.12,0.89,0.28000000000000003,null,3.32,1,0.48]
["IndoorWettable granules, soluble granulesUpward sprayingManual-TrolleyHead","Indoor","Wettable granules, soluble granules","Upward spraying","Manual-Trolley","Head",1.46,1,0,null,2.19,1,0,null,2.7,0.18,-0.41,null,3.1,0.33,0.25]
["IndoorDenseWettable granules, soluble granulesUpward sprayingManual-Hand heldHead","IndoorDense","Wettable granules, soluble granules","Upward spraying","Manual-Hand held","Head",1.46,1,0,null,2.19,1,0,null,2.7,0.18,0.28999999999999998,null,3.1,0.33,0.79]
["OutdoorWettable powder, soluble powderUpward sprayingVehicle-mounted-CabinInhalation","Outdoor","Wettable powder, soluble powder","Upward spraying","Vehicle-mounted-Cabin","Inhalation",1.38,0.38,1.96,null,1.81,0.49,1.54,null,0.99,0.56999999999999995,null,null,1.32,1]
["IndoorDenseWettable powder, soluble powderDownward sprayingManual-Hand heldHands","IndoorDense","Wettable powder, soluble powder","Downward spraying","Manual-Hand held","Hands",3.27,0.64,1.28,null,3.74,0.69,1.21,null,null,null,null,1323,null,null,null,4159]
["OutdoorSoluble concentrates, emulsifiable concentrate, etc.Downward sprayingVehicle-mountedInhalation","Outdoor","Soluble concentrates, emulsifiable concentrate, etc.","Downward spraying","Vehicle-mounted","Inhalation",1.38,0.38,-0.87,null,1.81,0.49,-0.92,null,0.72,0.5,{"$f":"0.01+IF(d_AreaTreated>10,-0.71,0)","v":0.01},null,1.27,0.57999999999999996,{"$f":"0.33+IF(d_AreaTreated>10,-1.14,0)","v":0.33}]
["IndoorDenseWettable granules, soluble granulesUpward sprayingManual-TrolleyHead","IndoorDense","Wettable granules, soluble granules","Upward spraying","Manual-Trolley","Head",1.46,1,0,null,2.19,1,0,null,2.7,0.18,{"$f":"0.29-0.41","v":-0.12},null,3.1,0.33,{"$f":"0.79+0.25","v":1.04}]
["IndoorDenseWettable granules, soluble granulesDownward sprayingManual-Hand heldHead","IndoorDense","Wettable granules, soluble granules","Downward spraying","Manual-Hand held","Head",1.46,1,0,null,2.19,1,0,null,null,null,null,21,null,null,null,39]
["OutdoorWettable granules, soluble granulesUpward sprayingVehicle-mountedInhalation","Outdoor","Wettable granules, soluble granules","Upward spraying","Vehicle-mounted","Inhalation",1.38,0.38,null,null,1.81,0.49,null,null,0.99,0.56999999999999995,0.82,null,1.32,1,0.6]
["IndoorSoluble concentrates, emulsifiable concentrate, etc.Upward sprayingManual-KnapsackHead","Indoor","Soluble concentrates, emulsifiable concentrate, etc.","Upward spraying","Manual-Knapsack","Head",null,null,null,5.5,null,null,null,11,2.7,0.18,null,null,3.1,0.33]
["OutdoorWettable granules, soluble granulesDownward sprayingVehicle-mountedInhalation","Outdoor","Wettable granules, soluble granules","Downward spraying","Vehicle-mounted","Inhalation",1.38,0.38,null,null,1.81,0.49,null,null,0.72,0.5,{"$f":"0.01+IF(d_AreaTreated>10,-0.71,0)","v":0.01},null,1.27,0.57999999999999996,{"$f":"0.33+IF(d_AreaTreated>10,-1.14,0)","v":0.33}]
["IndoorWettable granules, soluble granulesUpward sprayingManual-KnapsackHead","Indoor","Wettable granules, soluble granules","Upward spraying","Manual-Knapsack","Head",null,null,null,5.5,null,null,null,11,2.7,0.18,null,null,3.1,0.33]
["IndoorWettable powder, soluble powderUpward sprayingManual-KnapsackHead","Indoor","Wettable powder, soluble powder","Upward spraying","Manual-Knapsack","Head",null,null,null,5.5,null,null,null,11,2.7,0.18,null,null,3.1,0.33]
["OutdoorWettable granules, soluble granulesUpward sprayingVehicle-mounted-CabinInhalation","Outdoor","Wettable granules, soluble granules","Upward spraying","Vehicle-mounted-Cabin","Inhalation",1.38,0.38,null,null,1.81,0.49,null,null,0.99,0.56999999999999995,null,null,1.32,1]
["IndoorSoluble concentrates, emulsifiable concentrate, etc.Downward sprayingManual-KnapsackHead","Indoor","Soluble concentrates, emulsifiable concentrate, etc.","Downward spraying","Manual-Knapsack","Head",null,null,null,5.5,null,null,null,11,null,null,null,21,null,null,null,39]
["OutdoorWettable granules, soluble granulesDownward sprayingManual-Hand heldInhalation","Outdoor","Wettable granules, soluble granules","Downward spraying","Manual-Hand held","Inhalation",1.38,0.38,null,null,1.81,0.49,null,null,null,null,null,26,null,null,null,26]
["OutdoorWettable granules, soluble granulesUpward sprayingManual-Hand heldInhalation","Outdoor","Wettable granules, soluble granules","Upward spraying","Manual-Hand held","Inhalation",1.38,0.38,null,null,1.81,0.49,null,null,2.17,0.83,-0.26,null,2.52,0.6,-0.26]
["OutdoorWettable powder, soluble powderDownward sprayingVehicle-mountedHead","Outdoor","Wettable powder, soluble powder","Downward spraying","Vehicle-mounted","Head",1.46,1,0.7,null,2.19,1,0.11,null,0.24,1,{"$f":"0.88+IF(d_AreaTreated>10,-0.53,0)","v":0.88},null,1.1599999999999999,1,{"$f":"1.03+IF(d_AreaTreated>10,-1.12,0)","v":1.03}]
["OutdoorSoluble concentrates, emulsifiable concentrate, etc.Upward sprayingVehicle-mounted-CabinProtected Body","Outdoor","Soluble concentrates, emulsifiable concentrate, etc.","Upward spraying","Vehicle-mounted-Cabin","Protected Body",1.58,0.62,0.12,null,2.09,0.78,0.44,null,1.83,1,null,null,2.21,1]
["IndoorWettable granules, soluble granulesDownward sprayingManual-KnapsackHead","Indoor","Wettable granules, soluble granules","Downward spraying","Manual-Knapsack","Head",null,null,null,5.5,null,null,null,11,null,null,null,21,null,null,null,39]
["IndoorWettable powder, soluble powderDownward sprayingManual-KnapsackHead","Indoor","Wettable powder, soluble powder","Downward spraying","Manual-Knapsack","Head",null,null,null,5.5,null,null,null,11,null,null,null,21,null,null,null,39]
["OutdoorWettable powder, soluble powderDownward sprayingVehicle-mountedInhalation","Outdoor","Wettable powder, soluble powder","Downward spraying","Vehicle-mounted","Inhalation",1.38,0.38,1.96,null,1.81,0.49,1.54,null,0.72,0.5,{"$f":"0.01+IF(d_AreaTreated>10,-0.71,0)","v":0.01},null,1.27,0.57999999999999996,{"$f":"0.33+IF(d_AreaTreated>10,-1.14,0)","v":0.33}]
["IndoorWettable granules, soluble granulesUpward sprayingManual-Hand heldInhalation","Indoor","Wettable granules, soluble granules","Upward spraying","Manual-Hand held","Inhalation",1.38,0.38,null,null,1.81,0.49,null,null,{"$f":"opex_indoor75_hm!B$38","v":"2.69"},{"$f":"opex_indoor75_hm!C$38","v":"1"},null,null,{"$f":"opex_indoor95_hm!B$38","v":"2.82"},{"$f":"opex_indoor95_hm!C$38","v":"1"}]
["IndoorWettable granules, soluble granulesDownward sprayingManual-Hand heldInhalation","Indoor","Wettable granules, soluble granules","Downward spraying","Manual-Hand held","Inhalation",1.38,0.38,null,null,1.81,0.49,null,null,null,null,null,47,null,null,null,80]
["IndoorWettable granules, soluble granulesUpward sprayingManual-TrolleyInhalation","Indoor","Wettable granules, soluble granules","Upward spraying","Manual-Trolley","Inhalation",1.38,0.38,null,null,1.81,0.49,null,null,{"$f":"opex_indoor75_hm!B$38","v":"2.69"},{"$f":"opex_indoor75_hm!C$38","v":"1"},-0.19,null,{"$f":"opex_indoor95_hm!B$38","v":"2.82"},{"$f":"opex_indoor95_hm!C$38","v":"1"},-0.26]
["OutdoorSoluble concentrates, emulsifiable concentrate, etc.Downward sprayingVehicle-mounted-Drift ReductionInhalation","Outdoor","Soluble concentrates, emulsifiable concentrate, etc.","Downward spraying","Vehicle-mounted-Drift Reduction","Inhalation",1.38,0.38,-0.87,null,1.81,0.49,-0.92,null,0.72,0.5,{"$f":"IF(d_AreaTreated>10,-0.71,0)","v":0},null,1.27,0.57999999999999996,{"$f":"IF(d_AreaTreated>10,-1.14,0)","v":0}]
["OutdoorWettable powder, soluble powderUpward sprayingVehicle-mountedBody","Outdoor","Wettable powder, soluble powder","Upward spraying","Vehicle-mounted","Body",3.04,0.74,1.85,null,3.87,0.69,1.29,null,3.47,1,0.48,null,3.92,1,0.79]
["IndoorDenseSoluble concentrates, emulsifiable concentrate, etc.Downward sprayingManual-KnapsackHands","IndoorDense","Soluble concentrates, emulsifiable concentrate, etc.","Downward spraying","Manual-Knapsack","Hands",null,null,null,9497,null,null,null,25490,null,null,null,1323,null,null,null,4159]
["IndoorDenseWettable granules, soluble granulesUpward sprayingManual-Hand heldInhalation","IndoorDense","Wettable granules, soluble granules","Upward spraying","Manual-Hand held","Inhalation",1.38,0.38,null,null,1.81,0.49,null,null,2.69,1,0.08,null,2.82,1,0.63]
["IndoorDenseWettable granules, soluble granulesUpward sprayingManual-TrolleyInhalation","IndoorDense","Wettable granules, soluble granules","Upward spraying","Manual-Trolley","Inhalation",1.38,0.38,null,null,1.81,0.49,null,null,2.69,1,{"$f":"0.08-0.19","v":-0.11},null,2.82,1,{"$f":"0.63-0.26","v":0.37}]
["OutdoorWettable granules, soluble granulesUpward sprayingVehicle-mounted-CabinProtected Body","Outdoor","Wettable granules, soluble granules","Upward spraying","Vehicle-mounted-Cabin","Protected Body",1.58,0.62,null,null,2.09,0.78,null,null,1.83,1,null,null,2.21,1]
["IndoorSoluble concentrates, emulsifiable concentrate, etc.Upward sprayingManual-KnapsackInhalation","Indoor","Soluble concentrates, emulsifiable concentrate, etc.","Upward spraying","Manual-Knapsack","Inhalation",null,null,null,35,null,null,null,36,{"$f":"opex_indoor75_hm!B$38","v":"2.69"},{"$f":"opex_indoor75_hm!C$38","v":"1"},null,null,{"$f":"opex_indoor95_hm!B$38","v":"2.82"},{"$f":"opex_indoor95_hm!C$38","v":"1"}]
["OutdoorWettable granules, soluble granulesUpward sprayingVehicle-mountedProtected Body","Outdoor","Wettable granules, soluble granules","Upward spraying","Vehicle-mounted","Protected Body",1.58,0.62,null,null,2.09,0.78,null,null,1.83,1,0.23,null,2.21,1,0.15]
["OutdoorWettable granules, soluble granulesDownward sprayingVehicle-mounted-Drift ReductionInhalation","Outdoor","Wettable granules, soluble granules","Downward spraying","Vehicle-mounted-Drift Reduction","Inhalation",1.38,0.38,null,null,1.81,0.49,null,null,0.72,0.5,{"$f":"IF(d_AreaTreated>10,-0.71,0)","v":0},null,1.27,0.57999999999999996,{"$f":"IF(d_AreaTreated>10,-1.14,0)","v":0}]
["IndoorWettable granules, soluble granulesUpward sprayingManual-KnapsackInhalation","Indoor","Wettable granules, soluble granules","Upward spraying","Manual-Knapsack","Inhalation",null,null,null,35,null,null,null,36,{"$f":"opex_indoor75_hm!B$38","v":"2.69"},{"$f":"opex_indoor75_hm!C$38","v":"1"},null,null,{"$f":"opex_indoor95_hm!B$38","v":"2.82"},{"$f":"opex_indoor95_hm!C$38","v":"1"}]
["IndoorSoluble concentrates, emulsifiable concentrate, etc.Downward sprayingManual-KnapsackInhalation","Indoor","Soluble concentrates, emulsifiable concentrate, etc.","Downward spraying","Manual-Knapsack","Inhalation",null,null,null,35,null,null,null,36,null,null,null,47,null,null,null,80]
["IndoorWettable powder, soluble powderUpward sprayingManual-KnapsackInhalation","Indoor","Wettable powder, soluble powder","Upward spraying","Manual-Knapsack","Inhalation",null,null,null,35,null,null,null,36,{"$f":"opex_indoor75_hm!B$38","v":"2.69"},{"$f":"opex_indoor75_hm!C$38","v":"1"},null,null,{"$f":"opex_indoor95_hm!B$38","v":"2.82"},{"$f":"opex_indoor95_hm!C$38","v":"1"}]
["OutdoorWettable granules, soluble granulesDownward sprayingManual-Hand heldProtected Body","Outdoor","Wettable granules, soluble granules","Downward spraying","Manual-Hand held","Protected Body",1.58,0.62,null,null,2.09,0.78,null,null,null,null,null,8903,null,null,null,62630]
["OutdoorWettable granules, soluble granulesUpward sprayingManual-Hand heldProtected Body","Outdoor","Wettable granules, soluble granules","Upward spraying","Manual-Hand held","Protected Body",1.58,0.62,null,null,2.09,0.78,null,null,4.6500000000000004,null,-1.64,null,5.27,null,-1.99]
["OutdoorWettable powder, soluble powderUpward sprayingVehicle-mounted-CabinProtected Body","Outdoor","Wettable powder, soluble powder","Upward spraying","Vehicle-mounted-Cabin","Protected Body",1.58,0.62,1.84,null,2.09,0.78,1.58,null,1.83,1,null,null,2.21,1]
["OutdoorWettable powder, soluble powderDownward sprayingVehicle-mounted-Drift ReductionInhalation","Outdoor","Wettable powder, soluble powder","Downward spraying","Vehicle-mounted-Drift Reduction","Inhalation",1.38,0.38,1.96,null,1.81,0.49,1.54,null,0.72,0.5,{"$f":"IF(d_AreaTreated>10,-0.71,0)","v":0},null,1.27,0.57999999999999996,{"$f":"IF(d_AreaTreated>10,-1.14,0)","v":0}]
[{"$f":"B195&C195&D195&E195&F195","v":"OutdoorSoluble concentrates, emulsifiable concentrate, etc.Upward sprayingVehicle-mounted-CabinProtected Hands"},"Outdoor","Soluble concentrates, emulsifiable concentrate, etc.","Upward spraying","Vehicle-mounted-Cabin","Protected Hands",1.46,0.46,0.32,null,2.29,0.53,0.83,null,1.55,1,null,null,2.88,1,0.08]
["IndoorWettable granules, soluble granulesDownward sprayingManual-KnapsackInhalation","Indoor","Wettable granules, soluble granules","Downward spraying","Manual-Knapsack","Inhalation",null,null,null,35,null,null,null,36,null,null,null,47,null,null,null,80]
["IndoorWettable granules, soluble granulesDownward sprayingManual-Hand heldProtected Body","Indoor","Wettable granules, soluble granules","Downward spraying","Manual-Hand held","Protected Body",1.58,0.62,null,null,2.09,0.78,null,null,null,null,null,132,null,null,null,640]
["IndoorWettable powder, soluble powderDownward sprayingManual-KnapsackInhalation","Indoor","Wettable powder, soluble powder","Downward spraying","Manual-Knapsack","Inhalation",null,null,null,35,null,null,null,36,null,null,null,47,null,null,null,80]
["OutdoorWettable powder, soluble powderUpward sprayingVehicle-mountedInhalation","Outdoor","Wettable powder, soluble powder","Upward spraying","Vehicle-mounted","Inhalation",1.38,0.38,1.96,null,1.81,0.49,1.54,null,0.99,0.56999999999999995,0.82,null,1.32,1,0.6]
["IndoorWettable granules, soluble granulesUpward sprayingManual-Hand heldProtected Body","Indoor","Wettable granules, soluble granules","Upward spraying","Manual-Hand held","Protected Body",1.58,0.62,null,null,2.09,0.78,null,null,4.1900000000000004,1,null,null,5.07,1]
["OutdoorSoluble concentrates, emulsifiable concentrate, etc.Downward sprayingVehicle-mountedProtected Body","Outdoor","Soluble concentrates, emulsifiable concentrate, etc.","Downward spraying","Vehicle-mounted","Protected Body",1.58,0.62,0.12,null,2.09,0.78,0.44,null,0.74,1,{"$f":"0.7+IF(d_AreaTreated>10,-1.09,0)","v":0.7},null,0.47,1,{"$f":"1.05+IF(d_AreaTreated>10,-0.77,0)","v":1.05}]
["IndoorWettable granules, soluble granulesUpward sprayingManual-TrolleyProtected Body","Indoor","Wettable granules, soluble granules","Upward spraying","Manual-Trolley","Protected Body",1.58,0.62,null,null,2.09,0.78,null,null,4.1900000000000004,1,-1.23,null,5.07,1,-1.71]
["IndoorDenseWettable granules, soluble granulesDownward sprayingManual-KnapsackHands","IndoorDense","Wettable granules, soluble granules","Downward spraying","Manual-Knapsack","Hands",null,null,null,9497,null,null,null,25490,null,null,null,1323,null,null,null,4159]
["IndoorDenseWettable granules, soluble granulesUpward sprayingManual-Hand heldProtected Body","IndoorDense","Wettable granules, soluble granules","Upward spraying","Manual-Hand held","Protected Body",1.58,0.62,null,null,2.09,0.78,null,null,4.1900000000000004,1,{"$f":"1.64+IF(I_PPE_appl=\"Protective coverall\",-0.54,IF(I_PPE_appl=\"Rain suit\",-2.42,0))","v":1.64},null,5.07,1,{"$f":"1.07+IF(I_PPE_appl=\"Protective coverall\",-0.64,IF(I_PPE_appl=\"Rain suit\",-2.2,0))","v":1.07}]
["IndoorSoluble concentrates, emulsifiable concentrate, etc.Upward sprayingManual-KnapsackProtected Body","Indoor","Soluble concentrates, emulsifiable concentrate, etc.","Upward spraying","Manual-Knapsack","Protected Body",null,null,null,25,null,null,null,103,4.1900000000000004,1,null,null,5.07,1]
["IndoorWettable granules, soluble granulesUpward sprayingManual-KnapsackProtected Body","Indoor","Wettable granules, soluble granules","Upward spraying","Manual-Knapsack","Protected Body",null,null,null,25,null,null,null,103,4.1900000000000004,1,null,null,5.07,1]
["OutdoorWettable powder, soluble powderDownward sprayingVehicle-mounted-Drift ReductionHead","Outdoor","Wettable powder, soluble powder","Downward spraying","Vehicle-mounted-Drift Reduction","Head",1.46,1,0.7,null,2.19,1,0.11,null,0.24,1,{"$f":"IF(d_AreaTreated>10,-0.53,0)","v":0},null,1.1599999999999999,1,{"$f":"IF(d_AreaTreated>10,-1.12,0)","v":0}]
["IndoorDenseWettable granules, soluble granulesUpward sprayingManual-TrolleyProtected Body","IndoorDense","Wettable granules, soluble granules","Upward spraying","Manual-Trolley","Protected Body",1.58,0.62,null,null,2.09,0.78,null,null,4.1900000000000004,1,{"$f":"1.64-1.23+IF(I_PPE_appl=\"Protective coverall\",-0.54,IF(I_PPE_appl=\"Rain suit\",-2.42,0))","v":0.40999999999999992},null,5.07,1,{"$f":"1.07-1.71+IF(I_PPE_appl=\"Protective coverall\",-0.64,IF(I_PPE_appl=\"Rain suit\",-2.2,0))","v":-0.6399999999999999}]
["OutdoorWettable granules, soluble granulesDownward sprayingVehicle-mountedProtected Body","Outdoor","Wettable granules, soluble granules","Downward spraying","Vehicle-mounted","Protected Body",1.58,0.62,null,null,2.09,0.78,null,null,0.74,1,{"$f":"0.7+IF(d_AreaTreated>10,-1.09,0)","v":0.7},null,0.47,1,{"$f":"1.05+IF(d_AreaTreated>10,-0.77,0)","v":1.05}]
["OutdoorWettable powder, soluble powderDownward sprayingVehicle-mountedProtected Body","Outdoor","Wettable powder, soluble powder","Downward spraying","Vehicle-mounted","Protected Body",1.58,0.62,1.84,null,2.09,0.78,1.58,null,0.74,1,{"$f":"0.7+IF(d_AreaTreated>10,-1.09,0)","v":0.7},null,0.47,1,{"$f":"1.05+IF(d_AreaTreated>10,-0.77,0)","v":1.05}]
["OutdoorWettable powder, soluble powderUpward sprayingVehicle-mounted-CabinProtected Hands","Outdoor","Wettable powder, soluble powder","Upward spraying","Vehicle-mounted-Cabin","Protected Hands",1.46,0.46,1.66,null,2.29,0.53,1.39,null,1.55,1,null,null,2.88,1,0.08]
["IndoorSoluble concentrates, emulsifiable concentrate, etc.Downward sprayingManual-KnapsackProtected Body","Indoor","Soluble concentrates, emulsifiable concentrate, etc.","Downward spraying","Manual-Knapsack","Protected Body",null,null,null,25,null,null,null,103,null,null,null,132,null,null,null,640]
["IndoorWettable granules, soluble granulesDownward sprayingManual-KnapsackProtected Body","Indoor","Wettable granules, soluble granules","Downward spraying","Manual-Knapsack","Protected Body",null,null,null,25,null,null,null,103,null,null,null,132,null,null,null,640]
["OutdoorWettable granules, soluble granulesUpward sprayingVehicle-mountedProtected Hands","Outdoor","Wettable granules, soluble granules","Upward spraying","Vehicle-mounted","Protected Hands",1.46,0.46,null,null,2.29,0.53,null,null,1.55,1,null,null,2.88,1,0.08]
["OutdoorWettable granules, soluble granulesUpward sprayingVehicle-mounted-CabinProtected Hands","Outdoor","Wettable granules, soluble granules","Upward spraying","Vehicle-mounted-Cabin","Protected Hands",1.46,0.46,null,null,2.29,0.53,null,null,1.55,1,null,null,2.88,1,0.08]
["OutdoorWettable powder, soluble powderUpward sprayingVehicle-mountedProtected Body","Outdoor","Wettable powder, soluble powder","Upward spraying","Vehicle-mounted","Protected Body",1.58,0.62,1.84,null,2.09,0.78,1.58,null,1.83,1,0.23,null,2.21,1,0.15]
["IndoorWettable powder, soluble powderDownward sprayingManual-KnapsackProtected Body","Indoor","Wettable powder, soluble powder","Downward spraying","Manual-Knapsack","Protected Body",null,null,null,25,null,null,null,103,null,null,null,132,null,null,null,640]
["IndoorWettable powder, soluble powderUpward sprayingManual-KnapsackProtected Body","Indoor","Wettable powder, soluble powder","Upward spraying","Manual-Knapsack","Protected Body",null,null,null,25,null,null,null,103,4.1900000000000004,1,null,null,5.07,1]
["OutdoorWettable granules, soluble granulesUpward sprayingManual-Hand heldProtected Hands","Outdoor","Wettable granules, soluble granules","Upward spraying","Manual-Hand held","Protected Hands",1.46,0.46,null,null,2.29,0.53,null,null,2.2599999999999998,1,-0.88,null,2.61,1,-0.51]
["OutdoorSoluble concentrates, emulsifiable concentrate, etc.Downward sprayingVehicle-mounted-Drift ReductionProtected Body","Outdoor","Soluble concentrates, emulsifiable concentrate, etc.","Downward spraying","Vehicle-mounted-Drift Reduction","Protected Body",1.58,0.62,0.12,null,2.09,0.78,0.44,null,0.74,1,{"$f":"IF(d_AreaTreated>10,-1.09,0)","v":0},null,0.47,1,{"$f":"IF(d_AreaTreated>10,-0.77,0)","v":0}]
["OutdoorWettable granules, soluble granulesDownward sprayingManual-Hand heldProtected Hands","Outdoor","Wettable granules, soluble granules","Downward spraying","Manual-Hand held","Protected Hands",1.46,0.46,null,null,2.29,0.53,null,null,null,null,null,5,null,null,null,22]
["OutdoorWettable granules, soluble granulesDownward sprayingVehicle-mounted-Drift ReductionProtected Body","Outdoor","Wettable granules, soluble granules","Downward spraying","Vehicle-mounted-Drift Reduction","Protected Body",1.58,0.62,null,null,2.09,0.78,null,null,0.74,1,{"$f":"IF(d_AreaTreated>10,-1.09,0)","v":0},null,0.47,1,{"$f":"IF(d_AreaTreated>10,-0.77,0)","v":0}]
["IndoorWettable granules, soluble granulesUpward sprayingManual-TrolleyProtected Hands","Indoor","Wettable granules, soluble granules","Upward spraying","Manual-Trolley","Protected Hands",1.46,0.46,null,null,2.29,0.53,null,null,{"$f":"opex_indoor75_hm!B$34","v":"1.71"},{"$f":"opex_indoor75_hm!C$34","v":"1"},-1.04,null,{"$f":"opex_indoor95_hm!B$34","v":"2.36"},{"$f":"opex_indoor95_hm!C$34","v":"0.67"}]
["IndoorWettable granules, soluble granulesDownward sprayingManual-Hand heldProtected Hands","Indoor","Wettable granules, soluble granules","Downward spraying","Manual-Hand held","Protected Hands",1.46,0.46,null,null,2.29,0.53,null,null,null,null,null,1.5,null,null,null,12]
["IndoorWettable granules, soluble granulesUpward sprayingManual-Hand heldProtected Hands","Indoor","Wettable granules, soluble granules","Upward spraying","Manual-Hand held","Protected Hands",1.46,0.46,null,null,2.29,0.53,null,null,{"$f":"opex_indoor75_hm!B$34","v":"1.71"},{"$f":"opex_indoor75_hm!C$34","v":"1"},null,null,{"$f":"opex_indoor95_hm!B$34","v":"2.36"},{"$f":"opex_indoor95_hm!C$34","v":"0.67"}]
["IndoorDenseWettable granules, soluble granulesUpward sprayingManual-TrolleyProtected Hands","IndoorDense","Wettable granules, soluble granules","Upward spraying","Manual-Trolley","Protected Hands",1.46,0.46,null,null,2.29,0.53,null,null,1.71,1,{"$f":"1.32-1.04","v":0.28000000000000003},null,2.36,0.67,{"$f":"0.76-1.19","v":-0.42999999999999994}]
["IndoorWettable granules, soluble granulesDownward sprayingManual-KnapsackProtected Hands","Indoor","Wettable granules, soluble granules","Downward spraying","Manual-Knapsack","Protected Hands",null,null,null,21,null,null,null,164,null,null,null,1.5,null,null,null,12]
["IndoorDenseWettable powder, soluble powderDownward sprayingManual-KnapsackHands","IndoorDense","Wettable powder, soluble powder","Downward spraying","Manual-Knapsack","Hands",null,null,null,9497,null,null,null,25490,null,null,null,1323,null,null,null,4159]
["IndoorDenseWettable granules, soluble granulesUpward sprayingManual-Hand heldProtected Hands","IndoorDense","Wettable granules, soluble granules","Upward spraying","Manual-Hand held","Protected Hands",1.46,0.46,null,null,2.29,0.53,null,null,1.71,1,1.32,null,2.36,0.67,0.76]
["OutdoorWettable powder, soluble powderUpward sprayingVehicle-mountedProtected Hands","Outdoor","Wettable powder, soluble powder","Upward spraying","Vehicle-mounted","Protected Hands",1.46,0.46,1.66,null,2.29,0.53,1.39,null,1.55,1,null,null,2.88,1,0.08]
["IndoorSoluble concentrates, emulsifiable concentrate, etc.Downward sprayingManual-KnapsackProtected Hands","Indoor","Soluble concentrates, emulsifiable concentrate, etc.","Downward spraying","Manual-Knapsack","Protected Hands",null,null,null,21,null,null,null,164,null,null,null,1.5,null,null,null,12]
["IndoorWettable granules, soluble granulesUpward sprayingManual-KnapsackProtected Hands","Indoor","Wettable granules, soluble granules","Upward spraying","Manual-Knapsack","Protected Hands",null,null,null,21,null,null,null,164,{"$f":"opex_indoor75_hm!B$34","v":"1.71"},{"$f":"opex_indoor75_hm!C$34","v":"1"},null,null,{"$f":"opex_indoor95_hm!B$34","v":"2.36"},{"$f":"opex_indoor95_hm!C$34","v":"0.67"}]
["IndoorWettable powder, soluble powderDownward sprayingManual-KnapsackProtected Hands","Indoor","Wettable powder, soluble powder","Downward spraying","Manual-Knapsack","Protected Hands",null,null,null,21,null,null,null,164,null,null,null,1.5,null,null,null,12]
["IndoorWettable powder, soluble powderUpward sprayingManual-KnapsackProtected Hands","Indoor","Wettable powder, soluble powder","Upward spraying","Manual-Knapsack","Protected Hands",null,null,null,21,null,null,null,164,{"$f":"opex_indoor75_hm!B$34","v":"1.71"},{"$f":"opex_indoor75_hm!C$34","v":"1"},null,null,{"$f":"opex_indoor95_hm!B$34","v":"2.36"},{"$f":"opex_indoor95_hm!C$34","v":"0.67"}]
["IndoorSoluble concentrates, emulsifiable concentrate, etc.Upward sprayingManual-KnapsackProtected Hands","Indoor","Soluble concentrates, emulsifiable concentrate, etc.","Upward spraying","Manual-Knapsack","Protected Hands",null,null,null,21,null,null,null,164,{"$f":"opex_indoor75_hm!B$34","v":"1.71"},{"$f":"opex_indoor75_hm!C$34","v":"1"},null,null,{"$f":"opex_indoor95_hm!B$34","v":"2.36"},{"$f":"opex_indoor95_hm!C$34","v":"0.67"}]
["OutdoorWettable powder, soluble powderDownward sprayingVehicle-mounted-Drift ReductionProtected Body","Outdoor","Wettable powder, soluble powder","Downward spraying","Vehicle-mounted-Drift Reduction","Protected Body",1.58,0.62,1.84,null,2.09,0.78,1.58,null,0.74,1,{"$f":"IF(d_AreaTreated>10,-1.09,0)","v":0},null,0.47,1,{"$f":"IF(d_AreaTreated>10,-0.77,0)","v":0}]
["IndoorWettable powder, soluble powderUpward sprayingManual-Hand heldBody","Indoor","Wettable powder, soluble powder","Upward spraying","Manual-Hand held","Body",3.04,0.74,1.85,null,3.87,0.69,1.29,null,{"$f":"5.59","v":5.59},1,null,null,6.1,{"$f":"opex_indoor95_hm!C$35","v":"1"}]
["OutdoorWettable granules, soluble granulesDownward sprayingManual-Hand heldBody","Outdoor","Wettable granules, soluble granules","Downward spraying","Manual-Hand held","Body",3.04,0.74,null,null,3.87,0.69,null,null,null,null,null,88868,null,null,null,137007]
["IndoorWettable powder, soluble powderUpward sprayingManual-TrolleyBody","Indoor","Wettable powder, soluble powder","Upward spraying","Manual-Trolley","Body",3.04,0.74,1.85,null,3.87,0.69,1.29,null,{"$f":"5.59","v":5.59},1,-0.81,null,6.1,{"$f":"opex_indoor95_hm!C$35","v":"1"},-0.92]
["OutdoorWettable powder, soluble powderUpward sprayingManual-Hand heldBody","Outdoor","Wettable powder, soluble powder","Upward spraying","Manual-Hand held","Body",3.04,0.74,1.85,null,3.87,0.69,1.29,null,6.08,0.16,-1.29,null,6.34,0.01,-1.0900000000000001]
["OutdoorWettable powder, soluble powderDownward sprayingManual-Hand heldBody","Outdoor","Wettable powder, soluble powder","Downward spraying","Manual-Hand held","Body",3.04,0.74,1.85,null,3.87,0.69,1.29,null,null,null,null,88868,null,null,null,137007]
["OutdoorSoluble concentrates, emulsifiable concentrate, etc.Downward sprayingVehicle-mountedProtected Hands","Outdoor","Soluble concentrates, emulsifiable concentrate, etc.","Downward spraying","Vehicle-mounted","Protected Hands",1.46,0.46,0.32,null,2.29,0.53,0.83,null,0.23,0.54,{"$f":"1.11+IF(d_AreaTreated>10,0.29,0)","v":1.1100000000000001},null,-0.46,0.12,{"$f":"1.79+IF(d_AreaTreated>10,2.19,0)","v":1.79}]
["IndoorDenseSoluble concentrates, emulsifiable concentrate, etc.Upward sprayingManual-KnapsackBody","IndoorDense","Soluble concentrates, emulsifiable concentrate, etc.","Upward spraying","Manual-Knapsack","Body",null,null,null,803,null,null,null,2787,5.59,1,0.67,null,6.1,1,0.48]
["IndoorDenseWettable granules, soluble granulesUpward sprayingManual-KnapsackBody","IndoorDense","Wettable granules, soluble granules","Upward spraying","Manual-Knapsack","Body",null,null,null,803,null,null,null,2787,5.59,1,0.67,null,6.1,1,0.48]
["OutdoorWettable granules, soluble granulesDownward sprayingVehicle-mountedProtected Hands","Outdoor","Wettable granules, soluble granules","Downward spraying","Vehicle-mounted","Protected Hands",1.46,0.46,null,null,2.29,0.53,null,null,0.23,0.54,{"$f":"1.11+IF(d_AreaTreated>10,0.29,0)","v":1.1100000000000001},null,-0.46,0.12,{"$f":"1.79+IF(d_AreaTreated>10,2.19,0)","v":1.79}]
["IndoorDenseWettable powder, soluble powderUpward sprayingManual-KnapsackBody","IndoorDense","Wettable powder, soluble powder","Upward spraying","Manual-Knapsack","Body",null,null,null,803,null,null,null,2787,5.59,1,0.67,null,6.1,1,0.48]
["IndoorWettable powder, soluble powderDownward sprayingManual-Hand heldHands","Indoor","Wettable powder, soluble powder","Downward spraying","Manual-Hand held","Hands",3.27,0.64,1.28,null,3.74,0.69,1.21,null,null,null,null,1323,null,null,null,4159]
["IndoorWettable powder, soluble powderUpward sprayingManual-Hand heldHands","Indoor","Wettable powder, soluble powder","Upward spraying","Manual-Hand held","Hands",3.27,0.64,1.28,null,3.74,0.69,1.21,null,{"$f":"opex_indoor75_hm!B$33","v":"4.4"},{"$f":"opex_indoor75_hm!C$33","v":"0.83"},null,null,{"$f":"opex_indoor95_hm!B$33","v":"4.81"},{"$f":"opex_indoor95_hm!C$33","v":"0.84"}]
["OutdoorWettable powder, soluble powderDownward sprayingManual-Hand heldHands","Outdoor","Wettable powder, soluble powder","Downward spraying","Manual-Hand held","Hands",3.27,0.64,1.28,null,3.74,0.69,1.21,null,null,null,null,1544,null,null,null,4213]
["OutdoorWettable powder, soluble powderUpward sprayingVehicle-mounted-CabinHead","Outdoor","Wettable powder, soluble powder","Upward spraying","Vehicle-mounted-Cabin","Head",1.46,1,0.7,null,2.19,1,0.11,null,1.17,1,null,null,2.29,1]
["OutdoorWettable powder, soluble powderUpward sprayingManual-Hand heldHands","Outdoor","Wettable powder, soluble powder","Upward spraying","Manual-Hand held","Hands",3.27,0.64,1.28,null,3.74,0.69,1.21,null,4.26,0.84,-0.83,null,4.41,0.77,-0.47]
["IndoorDenseSoluble concentrates, emulsifiable concentrate, etc.Upward sprayingManual-KnapsackHands","IndoorDense","Soluble concentrates, emulsifiable concentrate, etc.","Upward spraying","Manual-Knapsack","Hands",null,null,null,9497,null,null,null,25490,4.4000000000000004,0.83,0.17,null,4.8099999999999996,0.84,0.14000000000000001]
["OutdoorWettable powder, soluble powderUpward sprayingVehicle-mountedHead","Outdoor","Wettable powder, soluble powder","Upward spraying","Vehicle-mounted","Head",1.46,1,0.7,null,2.19,1,0.11,null,1.17,1,1.89,null,2.29,1,1.56]
["IndoorWettable powder, soluble powderUpward sprayingManual-Hand heldHead","Indoor","Wettable powder, soluble powder","Upward spraying","Manual-Hand held","Head",1.46,1,0.7,null,2.19,1,0.11,null,2.7,0.18,null,null,3.1,0.33]
["IndoorDenseWettable granules, soluble granulesUpward sprayingManual-KnapsackHands","IndoorDense","Wettable granules, soluble granules","Upward spraying","Manual-Knapsack","Hands",null,null,null,9497,null,null,null,25490,4.4000000000000004,0.83,0.17,null,4.8099999999999996,0.84,0.14000000000000001]
["OutdoorWettable powder, soluble powderDownward sprayingVehicle-mountedProtected Hands","Outdoor","Wettable powder, soluble powder","Downward spraying","Vehicle-mounted","Protected Hands",1.46,0.46,1.66,null,2.29,0.53,1.39,null,0.23,0.54,{"$f":"1.11+IF(d_AreaTreated>10,0.29,0)","v":1.1100000000000001},null,-0.46,0.12,{"$f":"1.79+IF(d_AreaTreated>10,2.19,0)","v":1.79}]
["IndoorDenseWettable powder, soluble powderUpward sprayingManual-KnapsackHands","IndoorDense","Wettable powder, soluble powder","Upward spraying","Manual-Knapsack","Hands",null,null,null,9497,null,null,null,25490,4.4000000000000004,0.83,0.17,null,4.8099999999999996,0.84,0.14000000000000001]
["OutdoorWettable powder, soluble powderDownward sprayingManual-Hand heldInhalation","Outdoor","Wettable powder, soluble powder","Downward spraying","Manual-Hand held","Inhalation",1.38,0.38,1.96,null,1.81,0.49,1.54,null,null,null,null,26,null,null,null,26]
[{"$f":"B259&C259&D259&E259&F259","v":"IndoorWettable powder, soluble powderUpward sprayingManual-TrolleyHands"},"Indoor","Wettable powder, soluble powder","Upward spraying","Manual-Trolley","Hands",3.27,0.64,1.28,null,3.74,0.69,1.21,null,{"$f":"opex_indoor75_hm!B$33","v":"4.4"},{"$f":"opex_indoor75_hm!C$33","v":"0.83"},-0.62,null,{"$f":"opex_indoor95_hm!B$33","v":"4.81"},{"$f":"opex_indoor95_hm!C$33","v":"0.84"},-0.82]
["OutdoorWettable powder, soluble powderUpward sprayingManual-Hand heldInhalation","Outdoor","Wettable powder, soluble powder","Upward spraying","Manual-Hand held","Inhalation",1.38,0.38,1.96,null,1.81,0.49,1.54,null,2.17,0.83,-0.26,null,2.52,0.6,-0.26]
["OutdoorWettable powder, soluble powderDownward sprayingManual-Hand heldProtected Body","Outdoor","Wettable powder, soluble powder","Downward spraying","Manual-Hand held","Protected Body",1.58,0.62,1.84,null,2.09,0.78,1.58,null,null,null,null,8903,null,null,null,62630]
["OutdoorWettable powder, soluble powderDownward sprayingManual-Hand heldHead","Outdoor","Wettable powder, soluble powder","Downward spraying","Manual-Hand held","Head",1.46,1,0.7,null,2.19,1,0.11,null,null,null,null,12,null,null,null,85]
["OutdoorWettable powder, soluble powderUpward sprayingManual-Hand heldHead","Outdoor","Wettable powder, soluble powder","Upward spraying","Manual-Hand held","Head",1.46,1,0.7,null,2.19,1,0.11,null,3.27,0.32,-1.0900000000000001,null,3.5,0.33,-0.59]
["IndoorWettable powder, soluble powderDownward sprayingManual-Hand heldHead","Indoor","Wettable powder, soluble powder","Downward spraying","Manual-Hand held","Head",1.46,1,0.7,null,2.19,1,0.11,null,null,null,null,21,null,null,null,39]
["IndoorWettable powder, soluble powderUpward sprayingManual-TrolleyHead","Indoor","Wettable powder, soluble powder","Upward spraying","Manual-Trolley","Head",1.46,1,0.7,null,2.19,1,0.11,null,2.7,0.18,-0.41,null,3.1,0.33,0.25]
["OutdoorSoluble concentrates, emulsifiable concentrate, etc.Downward sprayingVehicle-mounted-Drift ReductionProtected Hands","Outdoor","Soluble concentrates, emulsifiable concentrate, etc.","Downward spraying","Vehicle-mounted-Drift Reduction","Protected Hands",1.46,0.46,0.32,null,2.29,0.53,0.83,null,0.23,0.54,{"$f":"IF(d_AreaTreated>10,0.29,0)","v":0},null,-0.46,0.12,{"$f":"IF(d_AreaTreated>10,2.19,0)","v":0}]
["OutdoorWettable granules, soluble granulesDownward sprayingVehicle-mounted-Drift ReductionProtected Hands","Outdoor","Wettable granules, soluble granules","Downward spraying","Vehicle-mounted-Drift Reduction","Protected Hands",1.46,0.46,null,null,2.29,0.53,null,null,0.23,0.54,{"$f":"IF(d_AreaTreated>10,0.29,0)","v":0},null,-0.46,0.12,{"$f":"IF(d_AreaTreated>10,2.19,0)","v":0}]
["IndoorDenseSoluble concentrates, emulsifiable concentrate, etc.Upward sprayingManual-KnapsackHead","IndoorDense","Soluble concentrates, emulsifiable concentrate, etc.","Upward spraying","Manual-Knapsack","Head",null,null,null,5.5,null,null,null,11,2.7,0.18,0.28999999999999998,null,3.1,0.33,0.79]
["IndoorDenseWettable powder, soluble powderUpward sprayingManual-Hand heldHands","IndoorDense","Wettable powder, soluble powder","Upward spraying","Manual-Hand held","Hands",3.27,0.64,1.28,null,3.74,0.69,1.21,null,4.4000000000000004,0.83,0.17,null,4.8099999999999996,0.84,0.14000000000000001]
["IndoorDenseWettable powder, soluble powderUpward sprayingManual-TrolleyHands","IndoorDense","Wettable powder, soluble powder","Upward spraying","Manual-Trolley","Hands",3.27,0.64,1.28,null,3.74,0.69,1.21,null,4.4000000000000004,0.83,{"$f":"0.17-0.62","v":-0.44999999999999996},null,4.8099999999999996,0.84,{"$f":"0.14-0.82","v":-0.67999999999999994}]
["IndoorDenseWettable granules, soluble granulesUpward sprayingManual-KnapsackHead","IndoorDense","Wettable granules, soluble granules","Upward spraying","Manual-Knapsack","Head",null,null,null,5.5,null,null,null,11,2.7,0.18,0.28999999999999998,null,3.1,0.33,0.79]
["IndoorDenseSoluble concentrates, emulsifiable concentrate, etc.Downward sprayingManual-KnapsackHead","IndoorDense","Soluble concentrates, emulsifiable concentrate, etc.","Downward spraying","Manual-Knapsack","Head",null,null,null,5.5,null,null,null,11,null,null,null,21,null,null,null,39]
["IndoorDenseWettable powder, soluble powderUpward sprayingManual-KnapsackHead","IndoorDense","Wettable powder, soluble powder","Upward spraying","Manual-Knapsack","Head",null,null,null,5.5,null,null,null,11,2.7,0.18,0.28999999999999998,null,3.1,0.33,0.79]
["IndoorWettable powder, soluble powderUpward sprayingManual-Hand heldInhalation","Indoor","Wettable powder, soluble powder","Upward spraying","Manual-Hand held","Inhalation",1.38,0.38,1.96,null,1.81,0.49,1.54,null,2.69,{"$f":"opex_indoor75_hm!C$38","v":"1"},null,null,{"$f":"opex_indoor95_hm!B$38","v":"2.82"},{"$f":"opex_indoor95_hm!C$38","v":"1"}]
["OutdoorWettable powder, soluble powderDownward sprayingVehicle-mounted-Drift ReductionProtected Hands","Outdoor","Wettable powder, soluble powder","Downward spraying","Vehicle-mounted-Drift Reduction","Protected Hands",1.46,0.46,1.66,null,2.29,0.53,1.39,null,0.23,0.54,{"$f":"IF(d_AreaTreated>10,0.29,0)","v":0},null,-0.46,0.12,{"$f":"IF(d_AreaTreated>10,2.19,0)","v":0}]
["IndoorWettable powder, soluble powderUpward sprayingManual-TrolleyProtected Hands","Indoor","Wettable powder, soluble powder","Upward spraying","Manual-Trolley","Protected Hands",1.46,0.46,1.66,null,2.29,0.53,1.39,null,{"$f":"opex_indoor75_hm!B$34","v":"1.71"},{"$f":"opex_indoor75_hm!C$34","v":"1"},-1.04,null,{"$f":"opex_indoor95_hm!B$34","v":"2.36"},{"$f":"opex_indoor95_hm!C$34","v":"0.67"}]
["OutdoorWettable powder, soluble powderUpward sprayingManual-Hand heldProtected Body","Outdoor","Wettable powder, soluble powder","Upward spraying","Manual-Hand held","Protected Body",1.58,0.62,1.84,null,2.09,0.78,1.58,null,4.6500000000000004,null,-1.64,null,5.27,null,-1.99]
["IndoorWettable powder, soluble powderDownward sprayingManual-Hand heldInhalation","Indoor","Wettable powder, soluble powder","Downward spraying","Manual-Hand held","Inhalation",1.38,0.38,1.96,null,1.81,0.49,1.54,null,null,null,null,47,null,null,null,80]
["OutdoorWettable powder, soluble powderUpward sprayingManual-Hand heldProtected Hands","Outdoor","Wettable powder, soluble powder","Upward spraying","Manual-Hand held","Protected Hands",1.46,0.46,1.66,null,2.29,0.53,1.39,null,2.2599999999999998,1,-0.88,null,2.61,1,-0.51]
["IndoorWettable powder, soluble powderUpward sprayingManual-TrolleyInhalation","Indoor","Wettable powder, soluble powder","Upward spraying","Manual-Trolley","Inhalation",1.38,0.38,1.96,null,1.81,0.49,1.54,null,2.69,{"$f":"opex_indoor75_hm!C$38","v":"1"},-0.19,null,{"$f":"opex_indoor95_hm!B$38","v":"2.82"},{"$f":"opex_indoor95_hm!C$38","v":"1"},-0.26]
["IndoorDenseWettable granules, soluble granulesDownward sprayingManual-KnapsackHead","IndoorDense","Wettable granules, soluble granules","Downward spraying","Manual-Knapsack","Head",null,null,null,5.5,null,null,null,11,null,null,null,21,null,null,null,39]
["IndoorDenseSoluble concentrates, emulsifiable concentrate, etc.Upward sprayingManual-KnapsackInhalation","IndoorDense","Soluble concentrates, emulsifiable concentrate, etc.","Upward spraying","Manual-Knapsack","Inhalation",null,null,null,35,null,null,null,36,2.69,1,0.08,null,2.82,1,0.63]
["IndoorDenseWettable powder, soluble powderUpward sprayingManual-Hand heldBody","IndoorDense","Wettable powder, soluble powder","Upward spraying","Manual-Hand held","Body",3.04,0.74,1.85,null,3.87,0.69,1.29,null,5.59,1,0.67,null,6.1,1,0.48]
["IndoorWettable powder, soluble powderDownward sprayingManual-Hand heldProtected Hands","Indoor","Wettable powder, soluble powder","Downward spraying","Manual-Hand held","Protected Hands",1.46,0.46,1.66,null,2.29,0.53,1.39,null,null,null,null,1.5,null,null,null,12]
["IndoorDenseWettable granules, soluble granulesUpward sprayingManual-KnapsackInhalation","IndoorDense","Wettable granules, soluble granules","Upward spraying","Manual-Knapsack","Inhalation",null,null,null,35,null,null,null,36,2.69,1,0.08,null,2.82,1,0.63]
["IndoorDenseWettable powder, soluble powderDownward sprayingManual-KnapsackHead","IndoorDense","Wettable powder, soluble powder","Downward spraying","Manual-Knapsack","Head",null,null,null,5.5,null,null,null,11,null,null,null,21,null,null,null,39]
["IndoorDenseWettable powder, soluble powderUpward sprayingManual-KnapsackInhalation","IndoorDense","Wettable powder, soluble powder","Upward spraying","Manual-Knapsack","Inhalation",null,null,null,35,null,null,null,36,2.69,1,0.08,null,2.82,1,0.63]
["IndoorDenseWettable powder, soluble powderDownward sprayingManual-Hand heldHead","IndoorDense","Wettable powder, soluble powder","Downward spraying","Manual-Hand held","Head",1.46,1,0.7,null,2.19,1,0.11,null,null,null,null,21,null,null,null,39]
["IndoorWettable powder, soluble powderDownward sprayingManual-Hand heldProtected Body","Indoor","Wettable powder, soluble powder","Downward spraying","Manual-Hand held","Protected Body",1.58,0.62,1.84,null,2.09,0.78,1.58,null,null,null,null,132,null,null,null,640]
["IndoorDenseSoluble concentrates, emulsifiable concentrate, etc.Downward sprayingManual-Hand heldInhalation","IndoorDense","Soluble concentrates, emulsifiable concentrate, etc.","Downward spraying","Manual-Hand held","Inhalation",1.38,0.38,-0.87,null,1.81,0.49,-0.92,null,null,null,null,47,null,null,null,80]
["IndoorDenseWettable granules, soluble granulesDownward sprayingManual-Hand heldInhalation","IndoorDense","Wettable granules, soluble granules","Downward spraying","Manual-Hand held","Inhalation",1.38,0.38,null,null,1.81,0.49,null,null,null,null,null,47,null,null,null,80]
["IndoorDenseWettable powder, soluble powderUpward sprayingManual-TrolleyBody","IndoorDense","Wettable powder, soluble powder","Upward spraying","Manual-Trolley","Body",3.04,0.74,1.85,null,3.87,0.69,1.29,null,5.59,1,{"$f":"0.67-0.81","v":-0.14000000000000001},-0.64,6.1,1,{"$f":"0.48-0.92","v":-0.44000000000000006}]
["IndoorDenseSoluble concentrates, emulsifiable concentrate, etc.Downward sprayingManual-KnapsackInhalation","IndoorDense","Soluble concentrates, emulsifiable concentrate, etc.","Downward spraying","Manual-Knapsack","Inhalation",null,null,null,35,null,null,null,36,null,null,null,47,null,null,null,80]
["IndoorDenseWettable granules, soluble granulesDownward sprayingManual-KnapsackInhalation","IndoorDense","Wettable granules, soluble granules","Downward spraying","Manual-Knapsack","Inhalation",null,null,null,35,null,null,null,36,null,null,null,47,null,null,null,80]
["IndoorWettable powder, soluble powderUpward sprayingManual-TrolleyProtected Body","Indoor","Wettable powder, soluble powder","Upward spraying","Manual-Trolley","Protected Body",1.58,0.62,1.84,null,2.09,0.78,1.58,null,4.1900000000000004,1,-1.23,null,5.07,1,-1.71]
["IndoorDenseWettable powder, soluble powderDownward sprayingManual-KnapsackInhalation","IndoorDense","Wettable powder, soluble powder","Downward spraying","Manual-Knapsack","Inhalation",null,null,null,35,null,null,null,36,null,null,null,47,null,null,null,80]
["IndoorDenseSoluble concentrates, emulsifiable concentrate, etc.Upward sprayingManual-KnapsackProtected Body","IndoorDense","Soluble concentrates, emulsifiable concentrate, etc.","Upward spraying","Manual-Knapsack","Protected Body",null,null,null,25,null,null,null,103,4.1900000000000004,1,{"$f":"1.64+IF(I_PPE_appl=\"Protective coverall\",-0.54,IF(I_PPE_appl=\"Rain suit\",-2.42,0))","v":1.64},null,5.07,1,{"$f":"1.07+IF(I_PPE_appl=\"Protective coverall\",-0.64,IF(I_PPE_appl=\"Rain suit\",-2.2,0))","v":1.07}]
["IndoorDenseWettable powder, soluble powderDownward sprayingManual-Hand heldInhalation","IndoorDense","Wettable powder, soluble powder","Downward spraying","Manual-Hand held","Inhalation",1.38,0.38,1.96,null,1.81,0.49,1.54,null,null,null,null,47,null,null,null,80]
["IndoorDenseWettable granules, soluble granulesUpward sprayingManual-KnapsackProtected Body","IndoorDense","Wettable granules, soluble granules","Upward spraying","Manual-Knapsack","Protected Body",null,null,null,25,null,null,null,103,4.1900000000000004,1,{"$f":"1.64+IF(I_PPE_appl=\"Protective coverall\",-0.54,IF(I_PPE_appl=\"Rain suit\",-2.42,0))","v":1.64},null,5.07,1,{"$f":"1.07+IF(I_PPE_appl=\"Protective coverall\",-0.64,IF(I_PPE_appl=\"Rain suit\",-2.2,0))","v":1.07}]
["IndoorWettable powder, soluble powderUpward sprayingManual-Hand heldProtected Body","Indoor","Wettable powder, soluble powder","Upward spraying","Manual-Hand held","Protected Body",1.58,0.62,1.84,null,2.09,0.78,1.58,null,4.1900000000000004,1,null,null,5.07,1]
["IndoorDenseSoluble concentrates, emulsifiable concentrate, etc.Downward sprayingManual-Hand heldProtected Body","IndoorDense","Soluble concentrates, emulsifiable concentrate, etc.","Downward spraying","Manual-Hand held","Protected Body",1.58,0.62,0.12,null,2.09,0.78,0.44,null,null,null,null,{"$f":"IF(I_PPE_appl=\"Rain trousers\",80,12180)","v":12180},null,null,null,{"$f":"IF(I_PPE_appl=\"Rain trousers\",154,27958)","v":27958}]
["IndoorDenseWettable powder, soluble powderUpward sprayingManual-TrolleyProtected Body","IndoorDense","Wettable powder, soluble powder","Upward spraying","Manual-Trolley","Protected Body",1.58,0.62,1.84,null,2.09,0.78,1.58,null,4.1900000000000004,1,{"$f":"1.64-1.23+IF(I_PPE_appl=\"Protective coverall\",-0.54,IF(I_PPE_appl=\"Rain suit\",-2.42,0))","v":0.40999999999999992},null,5.07,1,{"$f":"1.07-1.71+IF(I_PPE_appl=\"Protective coverall\",-0.64,IF(I_PPE_appl=\"Rain suit\",-2.2,0))","v":-0.6399999999999999}]
["IndoorDenseWettable granules, soluble granulesDownward sprayingManual-Hand heldProtected Body","IndoorDense","Wettable granules, soluble granules","Downward spraying","Manual-Hand held","Protected Body",1.58,0.62,null,null,2.09,0.78,null,null,null,null,null,{"$f":"IF(I_PPE_appl=\"Rain trousers\",80,12180)","v":12180},null,null,null,{"$f":"IF(I_PPE_appl=\"Rain trousers\",154,27958)","v":27958}]
["OutdoorWettable powder, soluble powderDownward sprayingManual-Hand heldProtected Hands","Outdoor","Wettable powder, soluble powder","Downward spraying","Manual-Hand held","Protected Hands",1.46,0.46,1.66,null,2.29,0.53,1.39,null,null,null,null,5,null,null,null,22]
["IndoorDenseWettable powder, soluble powderDownward sprayingManual-Hand heldProtected Body","IndoorDense","Wettable powder, soluble powder","Downward spraying","Manual-Hand held","Protected Body",1.58,0.62,1.84,null,2.09,0.78,1.58,null,null,null,null,{"$f":"IF(I_PPE_appl=\"Rain trousers\",80,12180)","v":12180},null,null,null,{"$f":"IF(I_PPE_appl=\"Rain trousers\",154,27958)","v":27958}]
["IndoorDenseWettable powder, soluble powderUpward sprayingManual-KnapsackProtected Body","IndoorDense","Wettable powder, soluble powder","Upward spraying","Manual-Knapsack","Protected Body",null,null,null,25,null,null,null,103,4.1900000000000004,1,{"$f":"1.64+IF(I_PPE_appl=\"Protective coverall\",-0.54,IF(I_PPE_appl=\"Rain suit\",-2.42,0))","v":1.64},null,5.07,1,{"$f":"1.07+IF(I_PPE_appl=\"Protective coverall\",-0.64,IF(I_PPE_appl=\"Rain suit\",-2.2,0))","v":1.07}]
["IndoorDenseSoluble concentrates, emulsifiable concentrate, etc.Downward sprayingManual-KnapsackProtected Body","IndoorDense","Soluble concentrates, emulsifiable concentrate, etc.","Downward spraying","Manual-Knapsack","Protected Body",null,null,null,25,null,null,null,103,null,null,null,{"$f":"IF(I_PPE_appl=\"Rain trousers\",80,12180)","v":12180},null,null,null,{"$f":"IF(I_PPE_appl=\"Rain trousers\",154,27958)","v":27958}]
["IndoorDenseWettable powder, soluble powderUpward sprayingManual-Hand heldProtected Body","IndoorDense","Wettable powder, soluble powder","Upward spraying","Manual-Hand held","Protected Body",1.58,0.62,1.84,null,2.09,0.78,1.58,null,4.1900000000000004,1,{"$f":"1.64+IF(I_PPE_appl=\"Protective coverall\",-0.54,IF(I_PPE_appl=\"Rain suit\",-2.42,0))","v":1.64},null,5.07,1,{"$f":"1.07+IF(I_PPE_appl=\"Protective coverall\",-0.64,IF(I_PPE_appl=\"Rain suit\",-2.2,0))","v":1.07}]
["IndoorDenseWettable granules, soluble granulesDownward sprayingManual-KnapsackProtected Body","IndoorDense","Wettable granules, soluble granules","Downward spraying","Manual-Knapsack","Protected Body",null,null,null,25,null,null,null,103,null,null,null,{"$f":"IF(I_PPE_appl=\"Rain trousers\",80,12180)","v":12180},null,null,null,{"$f":"IF(I_PPE_appl=\"Rain trousers\",154,27958)","v":27958}]
["IndoorWettable powder, soluble powderUpward sprayingManual-Hand heldProtected Hands","Indoor","Wettable powder, soluble powder","Upward spraying","Manual-Hand held","Protected Hands",1.46,0.46,1.66,null,2.29,0.53,1.39,null,1.71,1,null,null,{"$f":"opex_indoor95_hm!B$34","v":"2.36"},{"$f":"opex_indoor95_hm!C$34","v":"0.67"}]
["IndoorDenseWettable powder, soluble powderDownward sprayingManual-KnapsackProtected Body","IndoorDense","Wettable powder, soluble powder","Downward spraying","Manual-Knapsack","Protected Body",null,null,null,25,null,null,null,103,null,null,null,{"$f":"IF(I_PPE_appl=\"Rain trousers\",80,12180)","v":12180},null,null,null,{"$f":"IF(I_PPE_appl=\"Rain trousers\",154,27958)","v":27958}]
["IndoorDenseWettable powder, soluble powderUpward sprayingManual-Hand heldHead","IndoorDense","Wettable powder, soluble powder","Upward spraying","Manual-Hand held","Head",1.46,1,0.7,null,2.19,1,0.11,null,2.7,0.18,0.28999999999999998,null,3.1,0.33,0.79]
["IndoorDenseWettable powder, soluble powderUpward sprayingManual-TrolleyHead","IndoorDense","Wettable powder, soluble powder","Upward spraying","Manual-Trolley","Head",1.46,1,0.7,null,2.19,1,0.11,null,2.7,0.18,{"$f":"0.29-0.41","v":-0.12},null,3.1,0.33,{"$f":"0.79+0.25","v":1.04}]
["IndoorDenseWettable powder, soluble powderUpward sprayingManual-TrolleyProtected Hands","IndoorDense","Wettable powder, soluble powder","Upward spraying","Manual-Trolley","Protected Hands",1.46,0.46,1.66,null,2.29,0.53,1.39,null,1.71,1,{"$f":"1.32-1.04","v":0.28000000000000003},null,2.36,0.67,{"$f":"0.76-1.19","v":-0.42999999999999994}]
["IndoorDenseSoluble concentrates, emulsifiable concentrate, etc.Downward sprayingManual-Hand heldProtected Hands","IndoorDense","Soluble concentrates, emulsifiable concentrate, etc.","Downward spraying","Manual-Hand held","Protected Hands",1.46,0.46,0.32,null,2.29,0.53,0.83,null,null,null,null,1.5,null,null,null,12]
["IndoorDenseWettable granules, soluble granulesDownward sprayingManual-Hand heldProtected Hands","IndoorDense","Wettable granules, soluble granules","Downward spraying","Manual-Hand held","Protected Hands",1.46,0.46,null,null,2.29,0.53,null,null,null,null,null,1.5,null,null,null,12]
["IndoorDenseWettable powder, soluble powderDownward sprayingManual-Hand heldProtected Hands","IndoorDense","Wettable powder, soluble powder","Downward spraying","Manual-Hand held","Protected Hands",1.46,0.46,1.66,null,2.29,0.53,1.39,null,null,null,null,1.5,null,null,null,12]
["IndoorDenseWettable granules, soluble granulesUpward sprayingManual-KnapsackProtected Hands","IndoorDense","Wettable granules, soluble granules","Upward spraying","Manual-Knapsack","Protected Hands",null,null,null,21,null,null,null,164,1.71,1,1.32,null,2.36,0.67,0.76]
["IndoorDenseWettable powder, soluble powderUpward sprayingManual-KnapsackProtected Hands","IndoorDense","Wettable powder, soluble powder","Upward spraying","Manual-Knapsack","Protected Hands",null,null,null,21,null,null,null,164,1.71,1,1.32,null,2.36,0.67,0.76]
["IndoorDenseSoluble concentrates, emulsifiable concentrate, etc.Upward sprayingManual-KnapsackProtected Hands","IndoorDense","Soluble concentrates, emulsifiable concentrate, etc.","Upward spraying","Manual-Knapsack","Protected Hands",null,null,null,21,null,null,null,164,1.71,1,1.32,null,2.36,0.67,0.76]
["IndoorDenseWettable granules, soluble granulesDownward sprayingManual-KnapsackProtected Hands","IndoorDense","Wettable granules, soluble granules","Downward spraying","Manual-Knapsack","Protected Hands",null,null,null,21,null,null,null,164,null,null,null,1.5,null,null,null,12]
["IndoorDenseWettable powder, soluble powderUpward sprayingManual-Hand heldProtected Hands","IndoorDense","Wettable powder, soluble powder","Upward spraying","Manual-Hand held","Protected Hands",1.46,0.46,1.66,null,2.29,0.53,1.39,null,1.71,1,1.32,null,2.36,0.67,0.76]
[{"$f":"B323&C323&D323&E323&F323","v":"IndoorDenseSoluble concentrates, emulsifiable concentrate, etc.Downward sprayingManual-KnapsackProtected Hands"},"IndoorDense","Soluble concentrates, emulsifiable concentrate, etc.","Downward spraying","Manual-Knapsack","Protected Hands",null,null,null,21,null,null,null,164,null,null,null,1.5,null,null,null,12]
["IndoorDenseWettable powder, soluble powderDownward sprayingManual-KnapsackProtected Hands","IndoorDense","Wettable powder, soluble powder","Downward spraying","Manual-Knapsack","Protected Hands",null,null,null,21,null,null,null,164,null,null,null,1.5,null,null,null,12]
["IndoorDenseWettable powder, soluble powderUpward sprayingManual-Hand heldInhalation","IndoorDense","Wettable powder, soluble powder","Upward spraying","Manual-Hand held","Inhalation",1.38,0.38,1.96,null,1.81,0.49,1.54,null,2.69,1,0.08,null,2.82,1,0.63]
["IndoorDenseWettable powder, soluble powderUpward sprayingManual-TrolleyInhalation","IndoorDense","Wettable powder, soluble powder","Upward spraying","Manual-Trolley","Inhalation",1.38,0.38,1.96,null,1.81,0.49,1.54,null,2.69,1,{"$f":"0.08-0.19","v":-0.11},null,2.82,1,{"$f":"0.63-0.26","v":0.37}]

{"sheet":"Worker","index":13,"n_rows":50,"n_cols":22,"rows_kept":50,"cut":false,"hidden":false,"merged":[[44,17,45,17],[44,19,45,19],[35,17,36,17],[35,9,35,10],[35,13,35,14],[44,20,45,20],[43,17,43,20],[46,17,47,20],[43,9,43,12],[44,9,45,9],[44,10,45,10],[44,11,45,11],[44,12,45,12],[43,13,43,16],[44,13,45,13],[44,14,45,14],[44,15,45,15],[44,16,45,16],[44,18,45,18],[23,1,23,2],[16,13,16,16],[24,1,24,2],[19,5,19,8],[20,5,20,8],[20,9,20,12],[18,9,18,12],[18,5,18,8],[18,13,18,16],[16,1,16,4],[17,1,17,4],[18,1,18,4],[19,1,19,4],[20,1,20,4],[21,1,21,2],[22,1,22,2],[12,1,12,4],[10,1,10,4],[11,1,11,4],[9,1,9,4],[28,9,28,12],[9,13,9,16],[10,13,10,16],[11,13,11,16],[14,13,14,16],[15,13,15,16],[12,13,12,16],[13,13,13,16],[9,5,9,8],[10,5,10,8],[11,5,11,8],[14,5,14,8],[15,5,15,8],[9,9,9,12],[10,9,10,12],[11,9,11,12],[14,9,14,12],[15,9,15,12],[14,1,14,4],[15,1,15,4],[44,0,45,0],[34,5,34,6],[28,5,28,8],[35,0,36,0],[35,1,35,2],[35,5,35,6],[43,1,43,4],[43,5,43,8],[44,1,45,1],[44,2,45,2],[44,3,45,3],[44,4,45,4],[44,5,45,5],[44,6,45,6],[44,7,45,7],[44,8,45,8],[28,1,28,4],[34,1,34,2],[30,21,32,21],[34,9,34,10],[34,13,34,14],[30,17,31,20],[2,0,2,1],[7,0,7,1],[12,5,12,8],[12,9,12,12],[13,5,13,8],[13,9,13,12],[28,17,28,20],[28,13,28,16],[13,1,13,4],[28,21,29,21],[16,5,16,8],[16,9,16,12],[19,13,19,16],[19,9,19,12],[17,5,17,8],[17,9,17,12],[17,13,17,16],[20,13,20,16],[26,1,26,2],[25,1,25,2]]}
[{"$f":"\"Worker exposure from residues on foliage for \"&i_ProductName","v":"Worker exposure from residues on foliage for "}]
["Crop type",null,{"$f":"i_CropType","v":0}]
["Indoor or outdoor",null,{"$f":"'Data entry'!D8","v":0}]
["Application method",null,{"$f":"i_AppMeth","v":0}]
["Application equipment",null,{"$f":"i_AppEquip","v":0}]
["Worker's task",null,{"$f":"i_activity","v":0}]
["Main body parts in contact with foliage",null,{"$f":"INDEX(ay_CropType,MATCH(i_CropType,key_CropType,0),6)","v":{"$error":"#N/A"}}]
["Number of applications",null,{"$f":"i_AppNo","v":1}]
["Interval between multiple applications",null,{"$f":"i_AppInt","v":365},"d"]
[null,{"$f":"i_SubstName1","v":0},null,null,null,{"$f":"i_SubstName2","v":0},null,null,null,{"$f":"i_SubstName3","v":0},null,null,null,{"$f":"i_SubstName4","v":0}]
["Application rate of active substance (kg a.s./ha)",{"$f":"i_AppRateAS1","v":0},null,null,null,{"$f":"i_AppRateAS2","v":0},null,null,null,{"$f":"i_AppRateAS3","v":0},null,null,null,{"$f":"i_AppRateAS4","v":0},null,null,null,"i_AppRate"]
["DT50 foliar (d)",{"$f":"IF(i_DT50_1>0,i_DT50_1,d_HalflifeAS1)","v":30},null,null,null,{"$f":"IF(i_DT50_2>0,i_DT50_2,d_HalflifeAS2)","v":30},null,null,null,{"$f":"IF(i_DT50_3>0,i_DT50_3,d_HalflifeAS3)","v":30},null,null,null,{"$f":"IF(i_DT50_4>0,i_DT50_4,d_HalflifeAS4)","v":30},null,null,null,"d_HalflifeAS"]
["DT50 air (d)",30,null,null,null,30,null,null,null,30,null,null,null,30]
["DT50 soil (d)",30,null,null,null,30,null,null,null,30,null,null,null,30]
["Dermal absorption of the product",{"$f":"i_AbsorpProduct1","v":0},null,null,null,{"$f":"i_AbsorpProduct2","v":0},null,null,null,{"$f":"i_AbsorpProduct3","v":0},null,null,null,{"$f":"i_AbsorpProduct4","v":0},null,null,null,"i_AbsorpProduct"]
["Dermal absorption of the in-use dilution",{"$f":"i_AbsorpInuse1","v":0},null,null,null,{"$f":"i_AbsorpInuse2","v":0},null,null,null,{"$f":"i_AbsorpInuse3","v":0},null,null,null,{"$f":"i_AbsorpInuse4","v":0},null,null,null,"i_AbsorpInuse"]
["Inhalation absorption of the a.s.",{"$f":"i_AbsorpInhalation1","v":1},null,null,null,{"$f":"i_AbsorpInhalation2","v":1},null,null,null,{"$f":"i_AbsorpInhalation3","v":1},null,null,null,{"$f":"i_AbsorpInhalation4","v":1}]
["Saturated vapour concentration (mg/m³)",{"$f":"d_SVC1","v":"N/A"},null,null,null,{"$f":"d_SVC2","v":"N/A"},null,null,null,{"$f":"d_SVC3","v":"N/A"},null,null,null,{"$f":"d_SVC4","v":"N/A"},null,null,null,"d_SVC"]
["Vapour concentration (mg/m³)",{"$f":"d_VC1","v":1E-3},null,null,null,{"$f":"d_VC2","v":1E-3},null,null,null,{"$f":"d_VC3","v":1E-3},null,null,null,{"$f":"d_VC4","v":1E-3},null,null,null,"d_VC"]
[{"$f":"IF(sys_keyworker=\"Amenity grasslandTurf harvesting, cutting and handling\",\"Turf transferable residue (i_AppRate*d_Turf)\",\"Dislodgeable foliar residue (i_AppRate*i_DFR)\")&\" (μg a.s./cm²)\"","v":"Dislodgeable foliar residue (i_AppRate*i_DFR) (μg a.s./cm²)"},{"$f":"IF(LEFT(A20,4)=\"Turf\",d_TTR1,d_DFR1)","v":0},null,null,null,{"$f":"IF(LEFT(A20,4)=\"Turf\",d_TTR2,d_DFR2)","v":0},null,null,null,{"$f":"IF(LEFT(A20,4)=\"Turf\",d_TTR3,d_DFR3)","v":0},null,null,null,{"$f":"IF(LEFT(A20,4)=\"Turf\",d_TTR4,d_DFR4)","v":0},null,null,null,{"$f":"IF(LEFT(A20,4)=\"Turf\",\"d_TTR\",\"d_DFR\")","v":"d_DFR"}]
["Multiple application factor",{"$f":"d_MAF1","v":1},null,null,null,{"$f":"d_MAF2","v":1},null,null,null,{"$f":"d_MAF3","v":1},null,null,null,{"$f":"d_MAF4","v":1},null,null,null,"d_MAF"]
["Working hours",{"$f":"INDEX(ay_Worker_activity, MATCH(sys_keyworker, key_worker_activity, 0), 5)","v":{"$error":"#N/A"}},null,"h",null,null,null,null,null,null,null,null,null,null,null,null,null,"d_WorkHr"]
["Dermal TC - Total potential exposure",{"$f":"INDEX(ay_Worker_activity, MATCH(sys_keyworker, key_worker_activity, 0), 7)","v":{"$error":"#N/A"}},null,"cm²/h",null,null,null,null,null,null,null,null,null,null,null,null,null,"d_DermTcUCV"]
["Dermal TC - arms, body and legs covered",{"$f":"INDEX(ay_Worker_activity, MATCH(sys_keyworker, key_worker_activity, 0), 8)","v":{"$error":"#N/A"}},null,"cm²/h",null,null,null,null,null,null,null,null,null,null,null,null,null,"d_DermTcCV1"]
["Dermal TC - hands, arms, body and legs covered",{"$f":"INDEX(ay_Worker_activity, MATCH(sys_keyworker, key_worker_activity, 0), 9)","v":{"$error":"#N/A"}},null,"cm²/h",null,null,null,null,null,null,null,null,null,null,null,null,null,"d_DermTcCV2"]
["Dermal TC - hands covered, no workwear",{"$f":"INDEX(ay_Worker_activity, MATCH(sys_keyworker, key_worker_activity, 0), 10)","v":{"$error":"#N/A"}},null,"cm²/h",null,null,null,null,null,null,null,null,null,null,null,null,null,"d_DermTcCV3"]
["Inhalation TC",{"$f":"d_InhalTcManual","v":{"$error":"#N/A"}},null,"ha/h*10^(-3)",null,null,null,null,null,null,null,null,null,null,null,null,null,"d_InhalTcManual"]
[]
["1. Total ",{"$f":"i_SubstName1","v":0},null,null,null,{"$f":"i_SubstName2","v":0},null,null,null,{"$f":"i_SubstName3","v":0},null,null,null,{"$f":"i_SubstName4","v":0},null,null,null,"Combined",null,null,null,"Comments"]
[null,"Potential exposure","Work wear - no gloves","Work wear and gloves","Gloves, no work wear","Potential exposure","Work wear - no gloves","Work wear and gloves","Gloves, no work wear","Potential exposure","Work wear - no gloves","Work wear and gloves","Gloves, no work wear","Potential exposure","Work wear - no gloves","Work wear and gloves","Gloves, no work wear","Potential exposure","Work wear - no gloves","Work wear and gloves","Gloves, no work wear"]
["Total systemic exposure (mg a.s./day)",{"$f":"IF(LEFT(i_IndoorOutdoor,3)=\"Ind\",SUM(B38,B42),IF(OR(i_AppMeth=\"Worker rentry -roof fogger\",i_AppMeth=\"Worker rentry -low-volume-mist\"),B38+B42,B38))","v":"N/A"},{"$f":"IF(LEFT(i_IndoorOutdoor,3)=\"Ind\",SUM(B39,B42),IF(OR(i_AppMeth=\"Worker rentry -roof fogger\",i_AppMeth=\"Worker rentry -low-volume-mist\"),B39+B42,B39))","v":"N/A"},{"$f":"IF(LEFT(i_IndoorOutdoor,3)=\"Ind\",SUM(B40,B42),IF(OR(i_AppMeth=\"Worker rentry -roof fogger\",i_AppMeth=\"Worker rentry -low-volume-mist\"),B40+B42,B40))","v":"N/A"},{"$f":"IF(LEFT(i_IndoorOutdoor,3)=\"Ind\",SUM(B41,B42),IF(OR(i_AppMeth=\"Worker rentry -roof fogger\",i_AppMeth=\"Worker rentry -low-volume-mist\"),B41+B42,B41))","v":"N/A"},{"$f":"IF(LEFT(i_IndoorOutdoor,3)=\"Ind\",SUM(F38,F42),IF(OR(i_AppMeth=\"Worker rentry -roof fogger\",i_AppMeth=\"Worker rentry -low-volume-mist\"),F38+F42,F38))","v":"N/A"},{"$f":"IF(LEFT(i_IndoorOutdoor,3)=\"Ind\",SUM(F39,F42),IF(OR(i_AppMeth=\"Worker rentry -roof fogger\",i_AppMeth=\"Worker rentry -low-volume-mist\"),F39+F42,F39))","v":"N/A"},{"$f":"IF(LEFT(i_IndoorOutdoor,3)=\"Ind\",SUM(F40,F42),IF(OR(i_AppMeth=\"Worker rentry -roof fogger\",i_AppMeth=\"Worker rentry -low-volume-mist\"),F40+F42,F40))","v":"N/A"},{"$f":"IF(LEFT(i_IndoorOutdoor,3)=\"Ind\",SUM(F41,F42),IF(OR(i_AppMeth=\"Worker rentry -roof fogger\",i_AppMeth=\"Worker rentry -low-volume-mist\"),F41+F42,F41))","v":"N/A"},{"$f":"IF(LEFT(i_IndoorOutdoor,3)=\"Ind\",SUM(J38,J42),IF(OR(i_AppMeth=\"Worker rentry -roof fogger\",i_AppMeth=\"Worker rentry -low-volume-mist\"),J38+J42,J38))","v":"N/A"},{"$f":"IF(LEFT(i_IndoorOutdoor,3)=\"Ind\",SUM(J39,J42),IF(OR(i_AppMeth=\"Worker rentry -roof fogger\",i_AppMeth=\"Worker rentry -low-volume-mist\"),J39+J42,J39))","v":"N/A"},{"$f":"IF(LEFT(i_IndoorOutdoor,3)=\"Ind\",SUM(J40,J42),IF(OR(i_AppMeth=\"Worker rentry -roof fogger\",i_AppMeth=\"Worker rentry -low-volume-mist\"),J40+J42,J40))","v":"N/A"},{"$f":"IF(LEFT(i_IndoorOutdoor,3)=\"Ind\",SUM(J41,J42),IF(OR(i_AppMeth=\"Worker rentry -roof fogger\",i_AppMeth=\"Worker rentry -low-volume-mist\"),J41+J42,J41))","v":"N/A"},{"$f":"IF(LEFT(i_IndoorOutdoor,3)=\"Ind\",SUM(N38,N42),IF(OR(i_AppMeth=\"Worker rentry -roof fogger\",i_AppMeth=\"Worker rentry -low-volume-mist\"),N38+N42,N38))","v":"N/A"},{"$f":"IF(LEFT(i_IndoorOutdoor,3)=\"Ind\",SUM(N39,N42),IF(OR(i_AppMeth=\"Worker rentry -roof fogger\",i_AppMeth=\"Worker rentry -low-volume-mist\"),N39+N42,N39))","v":"N/A"},{"$f":"IF(LEFT(i_IndoorOutdoor,3)=\"Ind\",SUM(N40,N42),IF(OR(i_AppMeth=\"Worker rentry -roof fogger\",i_AppMeth=\"Worker rentry -low-volume-mist\"),N40+N42,N40))","v":"N/A"},{"$f":"IF(LEFT(i_IndoorOutdoor,3)=\"Ind\",SUM(N41,N42),IF(OR(i_AppMeth=\"Worker rentry -roof fogger\",i_AppMeth=\"Worker rentry -low-volume-mist\"),N41+N42,N41))","v":"N/A"},"Hazard Index",null,null,null,{"$f":"IF(i_CropType=\"Bare soil\",\"NA for treatment of bare soil\",IF(AND(LEFT(i_IndoorOutdoor,3)=\"Ind\",RIGHT(i_CropType,4)=\"tals\"),\"Calculation is based on inhalation exposure of task with the higher value\",\"\"))","v":""}]
["Total systemic dose [mg/kg bw/day]",{"$f":"IF(AND(ISNUMBER(B31),i_CropType<>\"Bare soil\"),B31/d_BwAdult,\"N/A\")","v":"N/A"},{"$f":"IF(AND(ISNUMBER(C31),i_CropType<>\"Bare soil\"),C31/d_BwAdult,\"N/A\")","v":"N/A"},{"$f":"IF(ISNUMBER(D31),D31/d_BwAdult,\"N/A\")","v":"N/A"},{"$f":"IF(ISNUMBER(E31),E31/d_BwAdult,\"N/A\")","v":"N/A"},{"$f":"IF(AND(ISNUMBER(F31),i_CropType<>\"Bare soil\"),F31/d_BwAdult,\"N/A\")","v":"N/A"},{"$f":"IF(AND(ISNUMBER(G31),i_CropType<>\"Bare soil\"),G31/d_BwAdult,\"N/A\")","v":"N/A"},{"$f":"IF(ISNUMBER(H31),H31/d_BwAdult,\"N/A\")","v":"N/A"},{"$f":"IF(ISNUMBER(I31),I31/d_BwAdult,\"N/A\")","v":"N/A"},{"$f":"IF(AND(ISNUMBER(J31),i_CropType<>\"Bare soil\"),J31/d_BwAdult,\"N/A\")","v":"N/A"},{"$f":"IF(AND(ISNUMBER(K31),i_CropType<>\"Bare soil\"),K31/d_BwAdult,\"N/A\")","v":"N/A"},{"$f":"IF(ISNUMBER(L31),L31/d_BwAdult,\"N/A\")","v":"N/A"},{"$f":"IF(ISNUMBER(M31),M31/d_BwAdult,\"N/A\")","v":"N/A"},{"$f":"IF(AND(ISNUMBER(N31),i_CropType<>\"Bare soil\"),N31/d_BwAdult,\"N/A\")","v":"N/A"},{"$f":"IF(AND(ISNUMBER(O31),i_CropType<>\"Bare soil\"),O31/d_BwAdult,\"N/A\")","v":"N/A"},{"$f":"IF(ISNUMBER(P31),P31/d_BwAdult,\"N/A\")","v":"N/A"},{"$f":"IF(ISNUMBER(Q31),Q31/d_BwAdult,\"N/A\")","v":"N/A"},null,null,null,null,{"$f":"IF(OR(i_AppMeth=\"Application of granules\",i_CropType=\"Bare soil\"),\"\",IF(AND(i_IndoorOutdoor=\"Indoor\",i_CropType=\"Ornamentals\"),#REF!+MAX(#REF!,#REF!),IF(AND(i_CropType<>\"Ornamentals\",OR(i_AppMeth=\"Gantry sprayer or roof fogger\",i_AppMeth=\"Ultra low volume mist sprayer\")),#REF!+#REF!,#REF!)))","v":{"$error":"#REF!"}}]
["% of AOEL",{"$f":"IFERROR(B32/i_AOEL1,0)","v":0},{"$f":"IFERROR(C32/i_AOEL1,0)","v":0},{"$f":"IFERROR(D32/i_AOEL1,0)","v":0},{"$f":"IFERROR(E32/i_AOEL1,0)","v":0},{"$f":"IFERROR(F32/i_AOEL2,0)","v":0},{"$f":"IFERROR(G32/i_AOEL2,0)","v":0},{"$f":"IFERROR(H32/i_AOEL2,0)","v":0},{"$f":"IFERROR(I32/i_AOEL2,0)","v":0},{"$f":"IFERROR(J32/i_AOEL3,0)","v":0},{"$f":"IFERROR(K32/i_AOEL3,0)","v":0},{"$f":"IFERROR(L32/i_AOEL3,0)","v":0},{"$f":"IFERROR(M32/i_AOEL3,0)","v":0},{"$f":"IFERROR(N32/i_AOEL4,0)","v":0},{"$f":"IFERROR(O32/i_AOEL4,0)","v":0},{"$f":"IFERROR(P32/i_AOEL4,0)","v":0},{"$f":"IFERROR(Q32/i_AOEL4,0)","v":0},{"$f":"IF(COUNTA('Data entry'!D26:G26)<2,\"N/A\",IFERROR(FIXED(B33+F33+J33+N33,3),\"N/A\"))","v":"N/A"},{"$f":"IF(COUNTA('Data entry'!D26:G26)<2,\"N/A\",IFERROR(FIXED(C33+G33+K33+O33,3),\"N/A\"))","v":"N/A"},{"$f":"IF(COUNTA('Data entry'!D26:G26)<2,\"N/A\",IFERROR(FIXED(D33+H33+L33+P33,3),\"N/A\"))","v":"N/A"},{"$f":"IF(COUNTA('Data entry'!D26:G26)<2,\"N/A\",IFERROR(FIXED(E33+I33+M33+Q33,3),\"N/A\"))","v":"N/A"},{"$f":"IF(OR(i_AppMeth=\"Application of granules\",i_CropType=\"Bare soil\"),\"\",IF(AND(i_IndoorOutdoor=\"Indoor\",i_CropType=\"Ornamentals\"),#REF!+MAX(#REF!,#REF!),IF(AND(i_CropType<>\"Ornamentals\",OR(i_AppMeth=\"Gantry sprayer or roof fogger\",i_AppMeth=\"Ultra low volume mist sprayer\")),#REF!+#REF!,#REF!)))","v":{"$error":"#REF!"}}]
[]
["2. Details",{"$f":"i_SubstName1","v":0},null,null,null,{"$f":"i_SubstName2","v":0},null,null,null,{"$f":"i_SubstName3","v":0},null,null,null,{"$f":"i_SubstName4","v":0}]
[null,"Systemic exposure",null,null,null,"Systemic exposure",null,null,null,"Systemic exposure",null,null,null,"Systemic exposure",null,null,null,"Comments"]
[null,"[mg a.s./day]","[mg a.s./kg bw/day]",null,null,"[mg a.s./day]","[mg a.s./kg bw/day]",null,null,"[mg a.s./day]","[mg a.s./kg bw/day]",null,null,"[mg a.s./day]","[mg a.s./kg bw/day]"]
[" Dermal - Potential",{"$f":"IFERROR(IF(w_task=\"contact with treated soil\",ConcSoil1*skinAdhSoil*d_HandSurface*i_AbsorpInuse1,d_DermTcUCV*d_WorkHr*B20*d_MAF1/1000*MAX(i_AbsorpProduct1,i_AbsorpInuse1)),\"N/A\")","v":"N/A"},{"$f":"IF(ISNUMBER(B38),B38/d_BwAdult,\"N/A\")","v":"N/A"},null,null,{"$f":"IFERROR(IF(w_task=\"contact with treated soil\",ConcSoil2*skinAdhSoil*d_HandSurface*i_AbsorpInuse2,d_DermTcUCV*d_WorkHr*F20*d_MAF2/1000*MAX(i_AbsorpProduct2,i_AbsorpInuse2)),\"N/A\")","v":"N/A"},{"$f":"IF(ISNUMBER(F38),F38/d_BwAdult,\"N/A\")","v":"N/A"},null,null,{"$f":"IFERROR(IF(w_task=\"contact with treated soil\",ConcSoil3*skinAdhSoil*d_HandSurface*i_AbsorpInuse3,d_DermTcUCV*d_WorkHr*J20*d_MAF3/1000*MAX(i_AbsorpProduct3,i_AbsorpInuse3)),\"N/A\")","v":"N/A"},{"$f":"IF(ISNUMBER(J38),J38/d_BwAdult,\"N/A\")","v":"N/A"},null,null,{"$f":"IFERROR(IF(w_task=\"contact with treated soil\",ConcSoil4*skinAdhSoil*d_HandSurface*i_AbsorpInuse4,d_DermTcUCV*d_WorkHr*N20*d_MAF4/1000*MAX(i_AbsorpProduct4,i_AbsorpInuse4)),\"N/A\")","v":"N/A"},{"$f":"IF(ISNUMBER(N38),N38/d_BwAdult,\"N/A\")","v":"N/A"}]
["Dermal - Work wear, no gloves",{"$f":"IFERROR(d_DermTcCV1*d_WorkHr*B20*d_MAF1/1000*MAX(i_AbsorpProduct1,i_AbsorpInuse1),\"N/A\")","v":"N/A"},{"$f":"IF(ISNUMBER(B39),B39/d_BwAdult,\"N/A\")","v":"N/A"},null,null,{"$f":"IFERROR(d_DermTcCV1*d_WorkHr*F20*d_MAF2/1000*MAX(i_AbsorpProduct2,i_AbsorpInuse2),\"N/A\")","v":"N/A"},{"$f":"IF(ISNUMBER(F39),F39/d_BwAdult,\"N/A\")","v":"N/A"},null,null,{"$f":"IFERROR(d_DermTcCV1*d_WorkHr*J20*d_MAF3/1000*MAX(i_AbsorpProduct3,i_AbsorpInuse3),\"N/A\")","v":"N/A"},{"$f":"IF(ISNUMBER(J39),J39/d_BwAdult,\"N/A\")","v":"N/A"},null,null,{"$f":"IFERROR(d_DermTcCV1*d_WorkHr*N20*d_MAF4/1000*MAX(i_AbsorpProduct4,i_AbsorpInuse4),\"N/A\")","v":"N/A"},{"$f":"IF(ISNUMBER(N39),N39/d_BwAdult,\"N/A\")","v":"N/A"}]
["Dermal - Work wear and gloves",{"$f":"IFERROR(d_DermTcCV2*d_WorkHr*B20*d_MAF1/1000*MAX(i_AbsorpProduct1,i_AbsorpInuse1),\"N/A\")","v":"N/A"},{"$f":"IF(ISNUMBER(B40),B40/d_BwAdult,\"N/A\")","v":"N/A"},null,null,{"$f":"IFERROR(d_DermTcCV2*d_WorkHr*F20*d_MAF2/1000*MAX(i_AbsorpProduct2,i_AbsorpInuse2),\"N/A\")","v":"N/A"},{"$f":"IF(ISNUMBER(F40),F40/d_BwAdult,\"N/A\")","v":"N/A"},null,null,{"$f":"IFERROR(d_DermTcCV2*d_WorkHr*J20*d_MAF3/1000*MAX(i_AbsorpProduct3,i_AbsorpInuse3),\"N/A\")","v":"N/A"},{"$f":"IF(ISNUMBER(J40),J40/d_BwAdult,\"N/A\")","v":"N/A"},null,null,{"$f":"IFERROR(d_DermTcCV2*d_WorkHr*N20*d_MAF4/1000*MAX(i_AbsorpProduct4,i_AbsorpInuse4),\"N/A\")","v":"N/A"},{"$f":"IF(ISNUMBER(N40),N40/d_BwAdult,\"N/A\")","v":"N/A"}]
["Dermal - Gloves, no work wear",{"$f":"IFERROR(IF(i_FormVal=\"Granules, fine granules\",\"N/A\",d_DermTcCV3*d_WorkHr*B20*d_MAF1/1000*MAX(i_AbsorpProduct1,i_AbsorpInuse1)),\"N/A\")","v":"N/A"},{"$f":"IF(ISNUMBER(B41),B41/d_BwAdult,\"N/A\")","v":"N/A"},null,null,{"$f":"IFERROR(IF(i_FormVal=\"Granules, fine granules\",\"N/A\",d_DermTcCV3*d_WorkHr*F20*d_MAF2/1000*MAX(i_AbsorpProduct2,i_AbsorpInuse2)),\"N/A\")","v":"N/A"},{"$f":"IF(ISNUMBER(F41),F41/d_BwAdult,\"N/A\")","v":"N/A"},null,null,{"$f":"IFERROR(IF(i_FormVal=\"Granules, fine granules\",\"N/A\",d_DermTcCV3*d_WorkHr*J20*d_MAF3/1000*MAX(i_AbsorpProduct3,i_AbsorpInuse3)),\"N/A\")","v":"N/A"},{"$f":"IF(ISNUMBER(J41),J41/d_BwAdult,\"N/A\")","v":"N/A"},null,null,{"$f":"IFERROR(IF(i_FormVal=\"Granules, fine granules\",\"N/A\",d_DermTcCV3*d_WorkHr*N20*d_MAF4/1000*MAX(i_AbsorpProduct4,i_AbsorpInuse4)),\"N/A\")","v":"N/A"},{"$f":"IF(ISNUMBER(N41),N41/d_BwAdult,\"N/A\")","v":"N/A"}]
["Inhalation",{"$f":"IFERROR(IF(w_task=\"contact with treated soil\",conc_dust1*d_BreathWorker*d_WorkHr*i_AbsorpInhalation1,IF(AND(LEFT(i_IndoorOutdoor,3)=\"Ind\",RIGHT(i_AppMeth,4)=\"ying\"), i_AbsorpInhalation1*(d_VC1*d_WorkHr*d_BreathWorker+i_AppRateAS1*d_InhalTcManual*d_WorkHr),0)),0)","v":0},{"$f":"IF(ISNUMBER(B42),B42/d_BwAdult,\"N/A\")","v":0},null,null,{"$f":"IFERROR(IF(w_task=\"contact with treated soil\",conc_dust2*d_BreathWorker*d_WorkHr*i_AbsorpInhalation2,IF(AND(LEFT(i_IndoorOutdoor,3)=\"Ind\",RIGHT(i_AppMeth,4)=\"ying\"), i_AbsorpInhalation2*(d_VC2*d_WorkHr*d_BreathWorker+i_AppRateAS2*d_InhalTcManual*d_WorkHr),0)),0)","v":0},{"$f":"IF(ISNUMBER(F42),F42/d_BwAdult,\"N/A\")","v":0},null,null,{"$f":"IFERROR(IF(w_task=\"contact with treated soil\",conc_dust3*d_BreathWorker*d_WorkHr*i_AbsorpInhalation3,IF(AND(LEFT(i_IndoorOutdoor,3)=\"Ind\",RIGHT(i_AppMeth,4)=\"ying\"), i_AbsorpInhalation3*(d_VC3*d_WorkHr*d_BreathWorker+i_AppRateAS3*d_InhalTcManual*d_WorkHr),0)),0)","v":0},{"$f":"IF(ISNUMBER(J42),J42/d_BwAdult,\"N/A\")","v":0},null,null,{"$f":"IFERROR(IF(w_task=\"contact with treated soil\",conc_dust4*d_BreathWorker*d_WorkHr*i_AbsorpInhalation4,IF(AND(LEFT(i_IndoorOutdoor,3)=\"Ind\",RIGHT(i_AppMeth,4)=\"ying\"), i_AbsorpInhalation4*(d_VC4*d_WorkHr*d_BreathWorker+i_AppRateAS4*d_InhalTcManual*d_WorkHr),0)),0)","v":0},{"$f":"IF(ISNUMBER(N42),N42/d_BwAdult,\"N/A\")","v":0},null,null,{"$f":"IF(d_InhalTcManual=\"NA\",\"No TSF available for this activity\",IF(i_IndoorOutdoor=\"Outdoor\",\"N/A for outdoor activities\",IF(LEFT(i_IndoorOutdoor,3)=\"Ind\", IF(AND(i_AppMeth<>\"Worker rentry -roof fogger\",i_AppMeth<>\"Worker rentry -low-volume-mist\"), \"\", IF(i_AppMeth=\"Worker rentry -roof fogger\", \"For re-entry 16 h after application\",IF(i_AppMeth=\"Worker rentry -low-volume-mist\",\"For re-entry 8 h after application\",IF(AND(i_AppMeth<>\"Worker rentry -roof fogger\",i_AppMeth<>\"Worker rentry -low-volume-mist\"),\"NA for non-automated applications\")))))))","v":{"$error":"#N/A"}}]
[]
["3. Refinement",{"$f":"i_SubstName1","v":0},null,null,null,{"$f":"i_SubstName2","v":0},null,null,null,{"$f":"i_SubstName3","v":0},null,null,null,{"$f":"i_SubstName4","v":0},null,null,null,"Combined"]
[null,"Potential exposure","Work wear - no gloves","Work wear and gloves","Gloves, no work wear","Potential exposure","Work wear - no gloves","Work wear and gloves","Gloves, no work wear","Potential exposure","Work wear - no gloves","Work wear and gloves","Gloves, no work wear","Potential exposure","Work wear - no gloves","Work wear and gloves","Gloves, no work wear","Potential exposure","Work wear - no gloves","Work wear and gloves","Gloves, no work wear"]
[]
["Dermal [mg a.s./kg bw/day]",{"$f":"IFERROR(B38*EXP(-$R$50*LN(2)/d_HalflifeAS1)/d_BwAdult,\"N/A\")","v":"N/A"},{"$f":"IFERROR(B39*EXP(-$S$50*LN(2)/d_HalflifeAS1)/d_BwAdult,\"N/A\")","v":"N/A"},{"$f":"IFERROR(B40*EXP(-$T$50*LN(2)/d_HalflifeAS1)/d_BwAdult,\"N/A\")","v":"N/A"},{"$f":"IFERROR(B41*EXP(-$U$50*LN(2)/d_HalflifeAS1)/d_BwAdult,\"N/A\")","v":"N/A"},{"$f":"IFERROR(F38*EXP(-$R$50*LN(2)/d_HalflifeAS2)/d_BwAdult,\"N/A\")","v":"N/A"},{"$f":"IFERROR(F39*EXP(-$S$50*LN(2)/d_HalflifeAS2)/d_BwAdult,\"N/A\")","v":"N/A"},{"$f":"IFERROR(F40*EXP(-$T$50*LN(2)/d_HalflifeAS2)/d_BwAdult,\"N/A\")","v":"N/A"},{"$f":"IFERROR(F41*EXP(-$U$50*LN(2)/d_HalflifeAS2)/d_BwAdult,\"N/A\")","v":"N/A"},{"$f":"IFERROR(J38*EXP(-$R$50*LN(2)/d_HalflifeAS3)/d_BwAdult,\"N/A\")","v":"N/A"},{"$f":"IFERROR(J39*EXP(-$S$50*LN(2)/d_HalflifeAS3)/d_BwAdult,\"N/A\")","v":"N/A"},{"$f":"IFERROR(J40*EXP(-$T$50*LN(2)/d_HalflifeAS3)/d_BwAdult,\"N/A\")","v":"N/A"},{"$f":"IFERROR(J41*EXP(-$U$50*LN(2)/d_HalflifeAS3)/d_BwAdult,\"N/A\")","v":"N/A"},{"$f":"IFERROR(N38*EXP(-$R$50*LN(2)/d_HalflifeAS4)/d_BwAdult,\"N/A\")","v":"N/A"},{"$f":"IFERROR(N39*EXP(-$S$50*LN(2)/d_HalflifeAS4)/d_BwAdult,\"N/A\")","v":"N/A"},{"$f":"IFERROR(N40*EXP(-$T$50*LN(2)/d_HalflifeAS4)/d_BwAdult,\"N/A\")","v":"N/A"},{"$f":"IFERROR(N41*EXP(-$U$50*LN(2)/d_HalflifeAS4)/d_BwAdult,\"N/A\")","v":"N/A"},"Hazard Index"]
["Inhalation [mg a.s./kg bw/day]",{"$f":"IFERROR(IF(AND(LEFT(i_IndoorOutdoor,3)=\"Ind\",RIGHT(i_AppMeth,4)=\"ying\"), i_AbsorpInhalation1*(d_VC1*d_WorkHr*d_BreathWorker*EXP(-$R$50*LN(2)/d_DT50air1)+i_AppRateAS1*d_InhalTcManual*d_WorkHr*EXP(-$R$50*LN(2)/d_DT50soil1)),0),0)/d_BwAdult","v":0},{"$f":"IFERROR(IF(AND(LEFT(i_IndoorOutdoor,3)=\"Ind\",RIGHT(i_AppMeth,4)=\"ying\"), i_AbsorpInhalation1*(d_VC1*d_WorkHr*d_BreathWorker*EXP(-$S$50*LN(2)/d_DT50air1)+i_AppRateAS1*d_InhalTcManual*d_WorkHr*EXP(-$S$50*LN(2)/d_DT50soil1)),0),0)/d_BwAdult","v":0},{"$f":"IFERROR(IF(AND(LEFT(i_IndoorOutdoor,3)=\"Ind\",RIGHT(i_AppMeth,4)=\"ying\"), i_AbsorpInhalation1*(d_VC1*d_WorkHr*d_BreathWorker*EXP(-$T$50*LN(2)/d_DT50air1)+i_AppRateAS1*d_InhalTcManual*d_WorkHr*EXP(-$T$50*LN(2)/d_DT50soil1)),0),0)/d_BwAdult","v":0},{"$f":"IFERROR(IF(AND(LEFT(i_IndoorOutdoor,3)=\"Ind\",RIGHT(i_AppMeth,4)=\"ying\"), i_AbsorpInhalation1*(d_VC1*d_WorkHr*d_BreathWorker*EXP(-$U$50*LN(2)/d_DT50air1)+i_AppRateAS1*d_InhalTcManual*d_WorkHr*EXP(-$U$50*LN(2)/d_DT50soil1)),0),0)/d_BwAdult","v":0},{"$f":"IFERROR(IF(AND(LEFT(i_IndoorOutdoor,3)=\"Ind\",RIGHT(i_AppMeth,4)=\"ying\"), i_AbsorpInhalation2*(d_VC2*d_WorkHr*d_BreathWorker*EXP(-$R$50*LN(2)/d_DT50air2)+i_AppRateAS2*d_InhalTcManual*d_WorkHr*EXP(-$R$50*LN(2)/d_DT50soil2)),0),0)/d_BwAdult","v":0},{"$f":"IFERROR(IF(AND(LEFT(i_IndoorOutdoor,3)=\"Ind\",RIGHT(i_AppMeth,4)=\"ying\"), i_AbsorpInhalation2*(d_VC2*d_WorkHr*d_BreathWorker*EXP(-$S$50*LN(2)/d_DT50air2)+i_AppRateAS2*d_InhalTcManual*d_WorkHr*EXP(-$S$50*LN(2)/d_DT50soil2)),0),0)/d_BwAdult","v":0},{"$f":"IFERROR(IF(AND(LEFT(i_IndoorOutdoor,3)=\"Ind\",RIGHT(i_AppMeth,4)=\"ying\"), i_AbsorpInhalation2*(d_VC2*d_WorkHr*d_BreathWorker*EXP(-$T$50*LN(2)/d_DT50air2)+i_AppRateAS2*d_InhalTcManual*d_WorkHr*EXP(-$T$50*LN(2)/d_DT50soil2)),0),0)/d_BwAdult","v":0},{"$f":"IFERROR(IF(AND(LEFT(i_IndoorOutdoor,3)=\"Ind\",RIGHT(i_AppMeth,4)=\"ying\"), i_AbsorpInhalation2*(d_VC2*d_WorkHr*d_BreathWorker*EXP(-$U$50*LN(2)/d_DT50air2)+i_AppRateAS2*d_InhalTcManual*d_WorkHr*EXP(-$U$50*LN(2)/d_DT50soil2)),0),0)/d_BwAdult","v":0},{"$f":"IFERROR(IF(AND(LEFT(i_IndoorOutdoor,3)=\"Ind\",RIGHT(i_AppMeth,4)=\"ying\"), i_AbsorpInhalation3*(d_VC3*d_WorkHr*d_BreathWorker*EXP(-$R$50*LN(2)/d_DT50air3)+i_AppRateAS3*d_InhalTcManual*d_WorkHr*EXP(-$R$50*LN(2)/d_DT50soil3)),0),0)/d_BwAdult","v":0},{"$f":"IFERROR(IF(AND(LEFT(i_IndoorOutdoor,3)=\"Ind\",RIGHT(i_AppMeth,4)=\"ying\"), i_AbsorpInhalation3*(d_VC3*d_WorkHr*d_BreathWorker*EXP(-$S$50*LN(2)/d_DT50air3)+i_AppRateAS3*d_InhalTcManual*d_WorkHr*EXP(-$S$50*LN(2)/d_DT50soil3)),0),0)/d_BwAdult","v":0},{"$f":"IFERROR(IF(AND(LEFT(i_IndoorOutdoor,3)=\"Ind\",RIGHT(i_AppMeth,4)=\"ying\"), i_AbsorpInhalation3*(d_VC3*d_WorkHr*d_BreathWorker*EXP(-$T$50*LN(2)/d_DT50air3)+i_AppRateAS3*d_InhalTcManual*d_WorkHr*EXP(-$T$50*LN(2)/d_DT50soil3)),0),0)/d_BwAdult","v":0},{"$f":"IFERROR(IF(AND(LEFT(i_IndoorOutdoor,3)=\"Ind\",RIGHT(i_AppMeth,4)=\"ying\"), i_AbsorpInhalation3*(d_VC3*d_WorkHr*d_BreathWorker*EXP(-$U$50*LN(2)/d_DT50air3)+i_AppRateAS3*d_InhalTcManual*d_WorkHr*EXP(-$U$50*LN(2)/d_DT50soil3)),0),0)/d_BwAdult","v":0},{"$f":"IFERROR(IF(AND(LEFT(i_IndoorOutdoor,3)=\"Ind\",RIGHT(i_AppMeth,4)=\"ying\"), i_AbsorpInhalation4*(d_VC4*d_WorkHr*d_BreathWorker*EXP(-$R$50*LN(2)/d_DT50air4)+i_AppRateAS4*d_InhalTcManual*d_WorkHr*EXP(-$R$50*LN(2)/d_DT50soil4)),0),0)/d_BwAdult","v":0},{"$f":"IFERROR(IF(AND(LEFT(i_IndoorOutdoor,3)=\"Ind\",RIGHT(i_AppMeth,4)=\"ying\"), i_AbsorpInhalation4*(d_VC4*d_WorkHr*d_BreathWorker*EXP(-$S$50*LN(2)/d_DT50air4)+i_AppRateAS4*d_InhalTcManual*d_WorkHr*EXP(-$S$50*LN(2)/d_DT50soil4)),0),0)/d_BwAdult","v":0},{"$f":"IFERROR(IF(AND(LEFT(i_IndoorOutdoor,3)=\"Ind\",RIGHT(i_AppMeth,4)=\"ying\"), i_AbsorpInhalation4*(d_VC4*d_WorkHr*d_BreathWorker*EXP(-$T$50*LN(2)/d_DT50air4)+i_AppRateAS4*d_InhalTcManual*d_WorkHr*EXP(-$T$50*LN(2)/d_DT50soil4)),0),0)/d_BwAdult","v":0},{"$f":"IFERROR(IF(AND(LEFT(i_IndoorOutdoor,3)=\"Ind\",RIGHT(i_AppMeth,4)=\"ying\"), i_AbsorpInhalation4*(d_VC4*d_WorkHr*d_BreathWorker*EXP(-$U$50*LN(2)/d_DT50air4)+i_AppRateAS4*d_InhalTcManual*d_WorkHr*EXP(-$U$50*LN(2)/d_DT50soil4)),0),0)/d_BwAdult","v":0}]
["% of AOEL \nat the end of combined re-entry interval",{"$f":"IFERROR((B47+B48)/i_AOEL1,0)","v":0},{"$f":"IFERROR((C47+C48)/i_AOEL1,0)","v":0},{"$f":"IFERROR((D47+D48)/i_AOEL1,0)","v":0},{"$f":"IFERROR((E47+E48)/i_AOEL1,0)","v":0},{"$f":"IFERROR((F47+F48)/i_AOEL2,0)","v":0},{"$f":"IFERROR((G47+G48)/i_AOEL2,0)","v":0},{"$f":"IFERROR((H47+H48)/i_AOEL2,0)","v":0},{"$f":"IFERROR((I47+I48)/i_AOEL2,0)","v":0},{"$f":"IFERROR((J47+J48)/i_AOEL3,0)","v":0},{"$f":"IFERROR((K47+K48)/i_AOEL3,0)","v":0},{"$f":"IFERROR((L47+L48)/i_AOEL3,0)","v":0},{"$f":"IFERROR((M47+M48)/i_AOEL3,0)","v":0},{"$f":"IFERROR((N47+N48)/i_AOEL4,0)","v":0},{"$f":"IFERROR((O47+O48)/i_AOEL4,0)","v":0},{"$f":"IFERROR((P47+P48)/i_AOEL4,0)","v":0},{"$f":"IFERROR((Q47+Q48)/i_AOEL4,0)","v":0},{"$f":"B49+F49+J49+N49","v":0},{"$f":"C49+G49+K49+O49","v":0},{"$f":"D49+H49+L49+P49","v":0},{"$f":"E49+I49+M49+Q49","v":0}]
["Re-entry interval (d) per A.S.",0,0,0,0,0,0,0,0,0,0,0,0,0,0,0,0,0,0,0,0]

{"sheet":"Look up","index":14,"n_rows":83,"n_cols":9,"rows_kept":83,"cut":false,"hidden":true,"merged":[]}
["Formulation",null,null,null,null,"Boolean","Buffer"]
["Wettable powder, soluble powder",null,null,"Operator PPE Hands ",null,"Yes","2-3"]
["Wettable granules, soluble granules",null,null,"None",null,"No",5]
["Soluble concentrates, emulsifiable concentrate, etc.",null,null,"Chemical resistant gloves",null,"Not relevant",10]
["Granules, fine granules"]
[]
[null,null,null,"Application method drop down: ",null,"Application equipment drop down: "]
["Others","Cabin","Drift reduction (%)",null,null,"IndoorDownwardspraying","IndoorDenseDownwardspraying","OutdoorDownwardspraying"]
["does not apply ",{"$f":"IF(i_AppEquip&i_AppMeth=\"Vehicle-mountedUpward spraying\",\"HCVM\",\"nonHCVM\")","v":"nonHCVM"},0,"Define listname for additional restriction for \"Application of Granules\": ",null,"Manual-Hand held","Manual-Hand held","Vehicle-mounted"]
[null,null,0.5,{"$f":"IF(i_FormVal<>\"Granules, fine granules\",listapplications, IF(AND(i_FormVal=\"Granules, fine granules\",i_IndoorOutdoor=\"Outdoor\"),\"GranulesOutdoor\",IF(AND(i_FormVal=\"Granules, fine granules\",i_IndoorOutdoor=\"Indoor\"),\"GranulesIndoor\",\"\")))","v":{"$error":"#N/A"}},null,"Manual-Knapsack","Manual-Knapsack","Manual-Hand held"]
[null,null,null,null,null,null,null,"Manual-Knapsack"]
[null,null,null,"Indoor"]
[null,{"$f":"INDIRECT(SUBSTITUTE(i_IndoorOutdoor&i_AppMeth,\" \",\"\"))","v":{"$error":"#REF!"}},null,"Downward spraying"]
["Indoor or outdoor drop down: ",null,null,"Upward spraying",null,"IndoorUpwardspraying","IndoorDenseUpwardspraying"]
[null,null,null,null,null,"Manual-Hand held","Manual-Hand held"]
["lk_IndoorOutdoor",null,null,"IndoorDense",null,"Manual-Knapsack","Manual-Knapsack"]
["Indoor",null,null,"Downward spraying",null,"Manual-Trolley"]
["Indoor, Dense",null,null,"Upward spraying"]
["Outdoor"]
[null,null,null,"Outdoor",null,"IndoorApplicationofgranules"]
["Volatility",null,null,"Downward spraying",null,"Manual","OutdoorUpwardspraying"]
["low volatile substances having a vapour pressure of < 0.005 Pa",null,null,"Upward spraying",null,null,"Vehicle-mounted"]
["moderately volatile substances with a vapour pressure between 0.005 Pa and 0.01 Pa",null,null,null,null,null,"Manual-Hand held"]
[null,null,null,null,null,"IndoorGantrysprayerorrooffogger","Manual-Knapsack"]
["lk_PPEGranule",null,null,"GranulesOutdoor",null,"Automated"]
["Potential exposure",null,null,"Broadcast"]
["Certified protective coverall",null,null,"In furrow"]
[null,null,null,"Manual",null,"IndoorUltralowvolumemistsprayer","OutdoorBroadcast"]
[null,null,null,null,null,"Automated","Vehicle-mounted"]
[null,null,null,"GranulesIndoor"]
["lk_PPE_appl",null,null,"Application of granules",null,null,"OutdoorInfurrow"]
[{"$f":"IF(i_IndoorOutdoor<>\"IndoorDense\",\"Normal\",i_IndoorOutdoor&LEFT(i_AppMeth,4))","v":"Normal"},null,null,null,null,null,"Vehicle-mounted"]
["Normal","IndoorDenseUpwa","IndoorDenseDown",{"$f":"IF(i_ByCropType&i_AppMeth=\"Fruit cropsUpward spraying\",\"UpwardFruitCrops\",\"OtherCrops\")","v":{"$error":"#N/A"}}]
["Potential exposure","Potential exposure","Potential exposure","UpwardFruitCrops","OtherCrops",null,"OutdoorManual"]
["Work wear - arms, body and legs covered","Work wear - arms, body and legs covered","Work wear - arms, body and legs covered","not relevant","not relevant",null,"Manual"]
[null,"Protective coverall","Rain trousers","early (without leaves)"]
[null,"Rain suit",null,"late (dense foliage)"]
[]
[]
[]
[]
[]
[]
[]
["Define listname for worker activity","Define listname for application techniques"]
[{"$f":"SUBSTITUTE(SUBSTITUTE(i_CropType,\" \",\"\"),\"/\",\"\")","v":""},{"$f":"IF(i_FormVal=\"Granules, fine granules\",i_IndoorOutdoor&SUBSTITUTE(i_AppMeth,\" \",\"\"),INDEX(ay_CropType,MATCH(i_CropType,key_CropType,0),10)&i_IndoorOutdoor&LEFT(i_AppMeth,4))","v":{"$error":"#N/A"}}]
[]
[]
["FieldCrops","Hops","Viticulture","Orchards","Oilfruits","CanefruitHighberries","Barearableland","Barenonarableland","Strawberryoutdoor"]
["Inspection, irrigation","Inspection, irrigation","Hand harvesting","Maintenance/thinning","Searching, reaching, picking","Searching, reaching, picking","Contact with treated soil","NA","Reaching, picking"]
["Hand harvesting (only for sweetcorn)","Harvest","Inspection, irrigation","Inspection, irrigation","Inspection, irrigation","Inspection, irrigation","Inspection without contact with treated soil",null,"Inspection, irrigation"]
[null,null,null,"Searching, reaching, picking"]
[]
[]
["Lowberries","Lowvegetables","Lowornamentals","Highornamentals","Amenitygrassland","Agriculturalgrassland","Highvegetables","Strawberryindoor","Barenonarablelandrailwaytrack"]
["Reaching, picking","Reaching, picking (all except Brassica)","Cutting, sorting, bundling, carrying","Cutting, sorting, bundling, carrying","Turf harvesting, cutting and handling","Inspection, irrigation","Reaching, picking","Searching, reaching, picking","NA"]
["Inspection, irrigation","Inspection, irrigation (all)","Inspection, irrigation","Inspection, irrigation","Inspection, irrigation",null,"Inspection, irrigation","Inspection, irrigation"]
[null,"Removing bolting sugar beets"]
[null,"Harvest (Brassica only)"]
[null,"Maintenance (Brassica only)"]
[]
[{"$f":"IF(i_FormVal=\"Granules, fine granules\",\"Granules\"&i_IndoorOutdoor,listworker&\"updown\")","v":"updown"},{"$f":"listworker&\"inout\"","v":"inout"}]
["FieldCrops","Hops","Viticulture","Orchards","Oilfruits","CanefruitHighberries","Barearableland","Barenonarableland","Strawberryoutdoor"]
["Downward spraying","Downward spraying","Downward spraying","Downward spraying","Downward spraying","Downward spraying","Downward spraying","Downward spraying","Downward spraying"]
["Outdoor","Upward spraying","Upward spraying","Upward spraying","Upward spraying","Upward spraying","Indoor","Outdoor","Outdoor"]
[null,"Outdoor","Outdoor","Outdoor","Outdoor","Indoor","Outdoor"]
[null,null,null,null,null,"Indoor, Dense"]
[null,null,null,null,null,"Outdoor"]
[]
[]
[]
["Lowberries","Lowvegetables","Lowornamentals","Highornamentals","Amenitygrassland","Agriculturalgrassland","Highvegetables","Strawberryindoor","Barenonarablelandrailwaytrack"]
["Downward spraying","Downward spraying","Downward spraying","Downward spraying","Downward spraying","Downward spraying","Downward spraying","Downward spraying","Downward spraying"]
["Indoor","Indoor","Indoor","Upward spraying","Outdoor","Outdoor","Upward spraying","Upward spraying","Outdoor"]
["Outdoor","Indoor, Dense","Indoor, Dense","Indoor",null,null,"Indoor","Indoor"]
[null,"Outdoor","Outdoor","Indoor, Dense",null,null,"Indoor, Dense","Indoor, Dense"]
[null,null,null,"Outdoor",null,null,"Outdoor"]
[]
[]
["VMOutdoordown","VMHHOutdoordown","VMHHOutdoorupwa","VMHHIndoordown","VMHHIndoorupwa","VMHHIndoorDensedown","VMHHIndoorDenseupwa"]
["Vehicle-mounted","Vehicle-mounted","Vehicle-mounted","Manual-Hand held","Manual-Hand held","Manual-Hand held","Manual-Hand held"]
[null,"Manual-Hand held","Manual-Hand held","Manual-Knapsack","Manual-Knapsack","Manual-Knapsack","Manual-Knapsack"]
[null,"Manual-Knapsack","Manual-Knapsack",null,"Manual-Trolley"]

{"sheet":"cropsWorker","index":15,"n_rows":54,"n_cols":13,"rows_kept":54,"cut":false,"hidden":true,"merged":[]}
[1,2,3,4,5,6,7,8,9,10,11,12,13]
["sys_keyworker","cropGroup","Activity","ActivityTSF","h","bodyPartsInvolved","potentialExpo","workwear","workwearGloves","gloves","indoor","productCategory","TSF"]
[{"$f":"B3&C3","v":"Field cropsInspection, irrigation"},"Field crops","Inspection, irrigation","NA","2","Hand; body","12500","1400","1250","NA",1,"NA","NA"]
["Field cropsHand harvesting (only for sweetcorn)","Field crops","Hand harvesting (only for sweetcorn)","NA","8","Hand; body","NA","23000","NA","NA",1,"NA","NA"]
["HopsInspection, irrigation","Hops","Inspection, irrigation","NA","2","Hand; body","12500","1400","1250","NA",1,"NA","NA"]
["HopsHarvest","Hops","Harvest","NA","8","Hand; body","30000","10100","NA","NA",1,"NA","NA"]
["ViticultureHand harvesting","Viticulture","Hand harvesting","NA","8","Hand; body","30000","10100","NA","NA",1,"NA","NA"]
["ViticultureInspection, irrigation","Viticulture","Inspection, irrigation","NA","2","Hand; body","12500","1400","1250","NA",1,"NA","NA"]
["OrchardsMaintenance/thinning","Orchards","Maintenance/thinning","NA","8","Hand; body","22500","4500","2250","NA",1,"NA","NA"]
["OrchardsInspection, irrigation","Orchards","Inspection, irrigation","NA","2","Hand; body","12500","1400","1250","NA",1,"NA","NA"]
["OrchardsSearching, reaching, picking","Orchards","Searching, reaching, picking","NA","8","Hand; body","12500","3500","1250","NA",1,"NA","NA"]
["Oil fruitsSearching, reaching, picking","Oil fruits","Searching, reaching, picking","NA","8","Hand; body","22500","4500","2250","NA",1,"NA","NA"]
["Oil fruitsInspection, irrigation","Oil fruits","Inspection, irrigation","NA","2","Hand; body","12500","1400","1250","NA",1,"NA","NA"]
["Cane fruit/High berriesSearching, reaching, picking","Cane fruit/High berries","Searching, reaching, picking","Harvesting, including cutting and bundling","8","Hand; body","22500","4500","2250","NA",1,"other","0.1"]
["Cane fruit/High berriesSearching, reaching, picking","Cane fruit/High berries","Searching, reaching, picking","Harvesting, including cutting and bundling","8","Hand; body","22500","4500","2250","NA",1,"herbicide","0.01"]
["Cane fruit/High berriesInspection, irrigation","Cane fruit/High berries","Inspection, irrigation","General maintenance","2","Hand; body","12500","1400","1250","NA",1,"both","0.01"]
["Cane fruit/High berriesInspection, irrigation","Cane fruit/High berries","Inspection, irrigation","Inspection, watering","2","Hand; body","12500","1400","1250","NA",1,"both","0.01"]
["Low berriesReaching, picking","Low berries","Reaching, picking","Harvesting, including cutting and bundling","8","Hand, forearm","5800","3000","750","NA",1,"other","0.1"]
["Low berriesReaching, picking","Low berries","Reaching, picking","Harvesting, including cutting and bundling","8","Hand, forearm","5800","3000","750","NA",1,"herbicide","0.01"]
["Low berriesInspection, irrigation","Low berries","Inspection, irrigation","General maintenance","2","Hand; body","12500","1400","1250","NA",1,"both","0.01"]
["Low berriesInspection, irrigation","Low berries","Inspection, irrigation","Inspection, watering","2","Hand; body","12500","1400","1250","NA",1,"both","0.01"]
["Low vegetablesReaching, picking (all except Brassica)","Low vegetables","Reaching, picking (all except Brassica)","Harvesting, including cutting and bundling","8","Hand; body","5800","2500","580","NA",1,"other","0.1"]
["Low vegetablesReaching, picking (all except Brassica)","Low vegetables","Reaching, picking (all except Brassica)","Harvesting, including cutting and bundling","8","Hand; body","5800","2500","580","NA",1,"herbicide","0.01"]
["Low vegetablesInspection, irrigation (all)","Low vegetables","Inspection, irrigation (all)","General maintenance","2","Hand; body","12500","1400","1250","NA",1,"both","0.01"]
["Low vegetablesInspection, irrigation (all)","Low vegetables","Inspection, irrigation (all)","Inspection, watering","2","Hand; body","12500","1400","1250","NA",1,"both","0.01"]
["Low vegetablesremoving bolting sugar beets","Low vegetables","removing bolting sugar beets","NA","8","Hand; body","18600","4400","430","14300",0,"NA","NA"]
["Low vegetablesHarvest (Brassica only)","Low vegetables","Harvest (Brassica only)","Harvesting, including cutting and bundling","8","Hand; body","NA","5000","NA","NA",1,"other","0.1"]
["Low vegetablesMaintenance (Brassica only)","Low vegetables","Maintenance (Brassica only)","General maintenance","8","Hand; body","NA","5000","NA","NA",1,"both","0.01"]
["Low vegetablesHarvest (Brassica only)","Low vegetables","Harvest (Brassica only)","Harvesting, including cutting and bundling","8","Hand; body","NA","5000","NA","NA",1,"herbicide","0.01"]
["Low ornamentalsCutting, sorting, bundling, carrying","Low ornamentals","Cutting, sorting, bundling, carrying","Harvesting, including cutting and bundling","8","Hand; body","14000","5000","1400","NA",1,"other","0.1"]
["Low ornamentalsCutting, sorting, bundling, carrying","Low ornamentals","Cutting, sorting, bundling, carrying","Harvesting, including cutting and bundling","8","Hand; body","14000","5000","1400","NA",1,"herbicide","0.01"]
["Low ornamentalsInspection, irrigation","Low ornamentals","Inspection, irrigation","General maintenance","2","Hand; body","12500","1400","1250","NA",1,"both","0.01"]
["Low ornamentalsInspection, irrigation","Low ornamentals","Inspection, irrigation","Inspection, watering","2","Hand; body","12500","1400","1250","NA",1,"both","0.01"]
["High ornamentalsCutting, sorting, bundling, carrying","High ornamentals","Cutting, sorting, bundling, carrying","Harvesting, including cutting and bundling","8","Hand; body","14000","5000","1400","NA",1,"other","0.1"]
[{"$f":"B35&C35","v":"High ornamentalsCutting, sorting, bundling, carrying"},"High ornamentals","Cutting, sorting, bundling, carrying","Harvesting, including cutting and bundling","8","Hand; body","14000","5000","1400","NA",1,"herbicide","0.01"]
["High ornamentalsInspection, irrigation","High ornamentals","Inspection, irrigation","General maintenance","2","Hand; body","12500","1400","1250","NA",1,"both","0.01"]
["High ornamentalsInspection, irrigation","High ornamentals","Inspection, irrigation","Inspection, watering","2","Hand; body","12500","1400","1250","NA",1,"both","0.01"]
["Amenity grasslandTurf harvesting, cutting and handling","Amenity grassland","Turf harvesting, cutting and handling","NA","8","Hand; body","NA","8800","NA","NA",1,"NA","NA"]
["Amenity grasslandInspection, irrigation","Amenity grassland","Inspection, irrigation","NA","2","Hand; body","12500","1400","1250","NA",1,"NA","NA"]
["Agricultural grasslandInspection, irrigation","Agricultural grassland","Inspection, irrigation","NA","2","Hand; body","12500","1400","1250","NA",1,"NA","NA"]
["Bare arable landContact with treated soil","Bare arable land","Contact with treated soil","NA","8","Hand; body","NA","NA","NA","NA",1,"both","NA"]
["Bare arable landInspection without contact with treated soil","Bare arable land","Inspection without contact with treated soil","NA","2","Hand; body","NA","NA","NA","NA",1,"both","NA"]
["High vegetablesReaching, picking","High vegetables","Reaching, picking","Harvesting, including cutting and bundling","8","Hand; body","5800","2500","580","NA",1,"other","0.1"]
["High vegetablesReaching, picking","High vegetables","Reaching, picking","Harvesting, including cutting and bundling","8","Hand; body","5800","2500","580","NA",1,"herbicide","0.01"]
["High vegetablesInspection, irrigation","High vegetables","Inspection, irrigation","General maintenance","2","Hand; body","12500","1400","1250","NA",1,"both","0.01"]
["High vegetablesInspection, irrigation","High vegetables","Inspection, irrigation","Inspection, watering","2","Hand; body","12500","1400","1250","NA",1,"both","0.01"]
["Bare non arable landNA","Bare non arable land","NA","NA","NA","NA","NA","NA","NA","NA",1,"NA","NA"]
["Strawberry indoorSearching, reaching, picking","Strawberry indoor","Searching, reaching, picking","Harvesting, including cutting and bundling","8","Hand; body","22500","4500","2250","NA",1,"other","0.1"]
["Strawberry indoorSearching, reaching, picking","Strawberry indoor","Searching, reaching, picking","Harvesting, including cutting and bundling","8","Hand; body","22500","4500","2250","NA",1,"herbicide","0.01"]
["Strawberry indoorInspection, irrigation","Strawberry indoor","Inspection, irrigation","General maintenance","2","Hand; body","12500","1400","1250","NA",1,"both","0.01"]
["Strawberry indoorInspection, irrigation","Strawberry indoor","Inspection, irrigation","Inspection, watering","2","Hand; body","12500","1400","1250","NA",1,"other","0.01"]
["Strawberry outdoorReaching, picking","Strawberry outdoor","Reaching, picking","NA","8","Hand, forearm","5800","3000","750","NA",0,"other","NA"]
["Strawberry outdoorInspection, irrigation","Strawberry outdoor","Inspection, irrigation","NA","2","Hand; body","12500","1400","1250","NA",1,"other","NA"]
["Bare non arable land/railway trackNA","Bare non arable land/railway track","NA","NA","NA","NA","NA","NA","NA","NA",0,"NA","NA"]

{"sheet":"Small Tables","index":16,"n_rows":98,"n_cols":13,"rows_kept":98,"cut":false,"hidden":true,"merged":[]}
[1,2,3,4,5,6,7,8,9,10,11,12,13]
["RPE reduction factor",null,null,"Application: Gloves PPE reduction factor (depending on formulation type)"]
["key_MixRPE, ay_MixRPE",null,null,"key_AppPPEHands, ay_AppPPEHands"]
["None",1,null,"Wettable powder, soluble powderChemical resistant gloves",0.05]
["FP1, P1 and similar",0.25,null,"Granules, fine granulesChemical resistant gloves",0.05]
["FP2, P2 and similar",0.1,null,"Wettable granules, soluble granulesChemical resistant gloves",0.05]
[null,null,null,"Soluble concentrates, emulsifiable concentrate, etc.Chemical resistant gloves",0.1]
["PPE reduction factor",null,null,"Wettable powder, soluble powderNone",1]
["key_MixPPEBody, ay_MixPPEBody",null,null,"Granules, fine granulesNone",1]
["Potential exposure",1,null,"Wettable granules, soluble granulesNone",1]
["Work wear - arms, body and legs covered",0.1,null,"Soluble concentrates, emulsifiable concentrate, etc.None",1]
["Certified protective coverall",0.05]
[]
["PPE reduction factor",null,"PPE Head for M&L - Tank",{"$f":"IF(i_AppEquip=\"Manual-Knapsack\",\"ML_Knapsack\",\"ML_Tank\")","v":"ML_Tank"}]
["key_MixPPEHead, ay_MixPPEHead",null,"None"]
["None",1,"Hood"]
["Hood",0.5,"Face shield"]
["Hood and face shield",0.05,"Hood and face shield"]
["FP1, P1 and similar",0.8,"FP1, P1 and similar"]
["FP2, P2 and similar",0.8,"FP2, P2 and similar",null,null,null,{"$f":"i_AppMeth","v":0}]
[]
[]
["Crop dependent exposure parameters",null,null,null,null,null,null,null,null,null,null,"Area Treated"]
["key_CropType, ay_CropType","Transfer coefficients","Transfer coefficients",{"$f":"INDEX(ay_CropType, MATCH(i_CropType, key_CropType, 0), 7)","v":{"$error":"#N/A"}},null,null,"Transfer coefficients",null,null,null,"key_CropType, ay_CropType","Vehicle Mounted Applications"]
["Crop type","Arm, body and legs covered","Total potential exposure","Activity","hs per day","Body parts involved","Hands, arm, body and legs covered","Type of crop for Resident Bystander","Vehicle Mounted Applications","Application technique","Crop type"]
["Field crops",23000,"NA","Hand harvesting",8,"Hand and body","NA","Field crops",50,"VM","Field crops",50]
["Hops",3000,5800,"Reaching, picking",8,"Hand and forearm",750,{"$f":"IF(i_AppMeth=\"Upward spraying\",\"Hops\",\"Field crops\")","v":"Field crops"},10,"VMHH","Hops",10]
["Viticulture",2500,5800,"Reaching, picking",8,"Hand and body",580,{"$f":"IF(i_AppMeth=\"Upward spraying\",\"Grapes\",\"Field crops\")","v":"Field crops"},10,"VMHH","Viticulture",10]
["Orchards",4500,22500,"Searching, reaching, picking",8,"Hand and body",2250,{"$f":"IF(i_AppMeth=\"Upward spraying\",\"Fruit crops\",\"Field crops\")","v":"Field crops"},10,"VMHH","Orchards",10]
["Oil fruits",4500,22500,"Searching, reaching, picking",8,"Hand and body",2250,{"$f":"IF(i_AppMeth=\"Upward spraying\",\"Fruit crops\",\"Field crops\")","v":"Field crops"},10,"VMHH","Oil fruits",10]
["Cane fruit/High berries",4500,22500,"Searching, reaching, picking",8,"Hand and body",2250,{"$f":"IF(i_AppMeth=\"Upward spraying\",\"Fruit crops\",\"Field crops\")","v":"Field crops"},10,"VMHH","Cane fruit/High berries",10]
["Low berries",3000,5800,"Reaching, picking",8,"Hand and forearm",750,"Field crops",50,"VMHH","Low berries",50]
["Low vegetables",2500,5800,"Reaching, picking",8,"Hand and body",580,"Field crops",50,"VMHH","Low vegetables",50]
["Low ornamentals",5000,14000,"Cutting, sorting, bundling, carrying",8,"Hand and body",1400,"Field crops",50,"VMHH","Low ornamentals",50]
["High ornamentals",5000,14000,"Cutting, sorting, bundling, carrying",8,"Hand and body",1400,"Field crops",10,"VMHH","High ornamentals",10]
["Amenity grassland",1400,12500,"Inspection, irrigation",2,"Hand and body",1250,"Field crops",50,"VMHH","Amenity grassland",50]
["Agricultural grassland",1400,12500,"Inspection, irrigation",2,"Hand and body",1250,"Field crops",50,"VM","Agricultural grassland",50]
["Bare arable land","NA","NA","Contact with treated soil","NA","NA","NA","Field crops",50,"VM","Bare arable land",50]
["High vegetables",2500,5800,"Reaching, picking",8,"Hand and body",580,"Field crops",10,"VMHH","High vegetables",10]
["Bare non arable land","NA","NA","NA","NA","NA","NA","Field crops",50,"VMHH","Bare non arable land",50]
["Strawberry indoor",4500,22500,"Searching, reaching, picking",8,"Hand and body",2250,"Field crops",4,"VMHH","Strawberry indoor",4]
["Strawberry outdoor",3000,5800,"Reaching, picking",8,"Hand and forearm",750,"Field crops",50,"VMHH","Strawberry outdoor",50]
["Bare non arable land/railway track","NA","NA","NA","NA","NA","NA","Field crops",50,"VM","Bare non arable land/railway track",50]
[null,1400,12500,"Inspection, irrigation",2,"Hand and body","no TC available for this assessment","Field crops"]
[]
["Resident Spray Drift","These values are the 75th Percentiles for Residents (assuming average breathing rates for inhalation exposures)"]
["key_ResidSpray, ay_ResidSpray"]
[null,"Adults Dermal","Children Dermal","Adults Inhalation","Children Inhalation"]
["Downward spraying2-3",0.47,{"$f":"0.33","v":0.33},1.2E-4,1.6000000000000001E-4]
["Downward spraying5",0.24,{"$f":"0.22","v":0.22},1.1E-4,1.2E-4]
["Downward spraying10",0.2,{"$f":"0.18","v":0.18},1E-4,1E-4]
["Upward spraying2-3","NA","NA","NA","NA"]
["Upward spraying5",5.63,1.6890000000000001,2.0999999999999999E-3,1.0300000000000001E-3]
["Upward spraying10",5.63,1.6890000000000001,2.0999999999999999E-3,1.0300000000000001E-3]
[]
["Bystander Spray Drift","These values are the 95th Percentiles for Bystanders (assuming high breathing rates for inhalation exposures)"]
["key_BySpray, ay_BySpray"]
[null,"Adults Dermal","Children Dermal","Adults Inhalation","Children Inhalation"]
["Downward spraying2-3",1.21,0.74,6.6E-4,1.3500000000000001E-3]
["Downward spraying5",0.56999999999999995,0.48,6.4000000000000005E-4,1E-3]
["Downward spraying10",0.48,0.39,6.8000000000000005E-4,9.1E-4]
["Upward spraying2-3","NA","NA","NA","NA"]
["Upward spraying5",12.9,3.87,4.4000000000000003E-3,3.2000000000000002E-3]
["Upward spraying10",12.9,3.87,4.4000000000000003E-3,3.2000000000000002E-3]
[]
["mean Spray Drift","These values are the mean values"]
["key_AvgSpray, ay_AvgSpray"]
[null,"Adults Dermal","Children Dermal","Adults Inhalation","Children Inhalation"]
["Downward spraying2-3",0.22,0.18,1.1E-4,1.2E-4]
["Downward spraying5",0.12,0.12,9.0000000000000006E-5,1E-4]
["Downward spraying10",0.11,0.1,8.0000000000000007E-5,8.0000000000000007E-5]
["Upward spraying2-3","NA","NA","NA","NA"]
["Upward spraying5",3.68,1.1100000000000001,1.6999999999999999E-3,8.3000000000000001E-4]
["Upward spraying10",3.68,1.1100000000000001,1.6999999999999999E-3,8.3000000000000001E-4]
[]
[]
[]
["Resident and bystander Surface Deposits Drift percentage","Ground sediments in % of the application rate calculated on the basis of percentile values (drift data acc. Rautmann)"]
["key_ByCropType, ay_ByCropType"]
["key_ByCropType","Bystander surface deposit (90th Percentile)","Resident surface deposit (77th Percentile)","Resident surface deposit (mean)"]
["Field cropsnot relevant2-3",8.5000000000000006E-2,5.6000000000000001E-2,4.1000000000000002E-2]
["Field cropsnot relevant5",3.5000000000000003E-2,2.3E-2,1.7999999999999999E-2]
["Field cropsnot relevant10",1.9E-2,1.2999999999999999E-2,0.01]
["Fruit cropsnot relevant2-3",0.29199999999999998,0.23960000000000001,0.18959999999999999]
["Fruit cropsnot relevant5",0.19889999999999999,0.15790000000000001,0.1169]
["Fruit cropsnot relevant10",0.1181,8.9599999999999999E-2,6.0699999999999997E-2]
["Fruit cropsearly (without leaves)2-3",0.29199999999999998,0.23960000000000001,0.18959999999999999]
["Fruit cropsearly (without leaves)5",0.19889999999999999,0.15790000000000001,0.1169]
["Fruit cropsearly (without leaves)10",0.1181,8.9599999999999999E-2,6.0699999999999997E-2]
["Fruit cropslate (dense foliage)2-3",0.1573,0.1101,6.9599999999999995E-2]
["Fruit cropslate (dense foliage)5",8.4099999999999994E-2,6.0400000000000002E-2,3.73E-2]
["Fruit cropslate (dense foliage)10",3.5999999999999997E-2,2.6700000000000002E-2,1.6E-2]
["Grapesnot relevant2-3",8.0199999999999994E-2,6.9000000000000006E-2,5.2499999999999998E-2]
["Grapesnot relevant5",3.6200000000000003E-2,3.0700000000000002E-2,2.3199999999999998E-2]
["Grapesnot relevant10",1.23E-2,1.0200000000000001E-2,7.7000000000000002E-3]
["Hopsnot relevant2-3",0.1933,0.1593,9.9500000000000005E-2]
["Hopsnot relevant5",0.1157,8.5699999999999998E-2,5.91E-2]
["Hopsnot relevant10",5.7700000000000001E-2,3.6999999999999998E-2,2.9100000000000001E-2]

{"sheet":"Operator_exposure_values_PHED","index":17,"n_rows":14,"n_cols":14,"rows_kept":14,"cut":false,"hidden":true,"merged":[]}
[1,2,3,4,5,6,7,8,9,10,11,12,13,14]
["Match MixLoad","Outdoor/Indoor","Formulation type","Application method","Application equipment","Type of exposure","Mixing & Loading 75th percentile","Mixing & Loading 95th percentile","Mixing & Loading Comments","Mixing & Loading Model","Application 75th percentile","Application 95th percentile","Application Comments","Application Model"]
[{"$f":"B3&C3&D3&E3&F3","v":"IndoorGranules, fine granulesApplication of granulesManualBody"},"Indoor","Granules, fine granules","Application of granules","Manual","Body",null,null,"Value for application is for combination of mixing&loading and application","PHED",69,253,"Exposure value originally included use of PPE, calculated potential exposure is 100 times higher assuming a ‘worst case’ reduction factor of 1% for gloves/coverall","PHED"]
[{"$f":"B4&C4&D4&E4&F4","v":"IndoorGranules, fine granulesApplication of granulesManualHands"},"Indoor","Granules, fine granules","Application of granules","Manual","Hands",null,null,"Value for application is for combination of mixing&loading and application","PHED",29,94,"Exposure value originally included use of PPE, calculated potential exposure is 100 times higher assuming a ‘worst case’ reduction factor of 1% for gloves/coverall","PHED"]
["IndoorGranules, fine granulesApplication of granulesManualInhalation","Indoor","Granules, fine granules","Application of granules","Manual","Inhalation",null,null,"Value for application is for combination of mixing&loading and application","PHED",0.47,1.5,null,"PHED"]
["OutdoorGranules, fine granulesBroadcastVehicle-mountedBody","Outdoor","Granules, fine granules","Broadcast","Vehicle-mounted","Body",1.6E-2,4.2999999999999997E-2,"Exposure value originally included use of PPE, calculated potential exposure is 100 times higher assuming a ‘worst case’ reduction factor of 1% for gloves/coverall","PHED",4.7000000000000002E-3,1.4999999999999999E-2,"Exposure value originally included use of PPE, calculated potential exposure is 100 times higher assuming a ‘worst case’ reduction factor of 1% for gloves/coverall","PHED"]
["OutdoorGranules, fine granulesBroadcastVehicle-mountedHands","Outdoor","Granules, fine granules","Broadcast","Vehicle-mounted","Hands",1.5E-3,6.8999999999999999E-3,"Exposure value originally included use of PPE, calculated potential exposure is 100 times higher assuming a ‘worst case’ reduction factor of 1% for gloves/coverall","PHED",4.0999999999999999E-4,1.2999999999999999E-3,"Exposure value originally included use of PPE, calculated potential exposure is 100 times higher assuming a ‘worst case’ reduction factor of 1% for gloves/coverall","PHED"]
["OutdoorGranules, fine granulesBroadcastVehicle-mountedInhalation","Outdoor","Granules, fine granules","Broadcast","Vehicle-mounted","Inhalation",2.1000000000000001E-2,7.8E-2,null,"PHED",1.1999999999999999E-3,4.4999999999999997E-3,null,"PHED"]
["OutdoorGranules, fine granulesIn furrowVehicle-mountedBody","Outdoor","Granules, fine granules","In furrow","Vehicle-mounted","Body",1.6E-2,4.2999999999999997E-2,"Exposure value originally included use of PPE, calculated potential exposure is 100 times higher assuming a ‘worst case’ reduction factor of 1% for gloves/coverall","PHED",4.7000000000000002E-3,1.4999999999999999E-2,"Exposure value originally included use of PPE, calculated potential exposure is 100 times higher assuming a ‘worst case’ reduction factor of 1% for gloves/coverall","PHED"]
["OutdoorGranules, fine granulesIn furrowVehicle-mountedHands","Outdoor","Granules, fine granules","In furrow","Vehicle-mounted","Hands",1.5E-3,6.8999999999999999E-3,"Exposure value originally included use of PPE, calculated potential exposure is 100 times higher assuming a ‘worst case’ reduction factor of 1% for gloves/coverall","PHED",4.0999999999999999E-4,1.2999999999999999E-3,"Exposure value originally included use of PPE, calculated potential exposure is 100 times higher assuming a ‘worst case’ reduction factor of 1% for gloves/coverall","PHED"]
["OutdoorGranules, fine granulesIn furrowVehicle-mountedInhalation","Outdoor","Granules, fine granules","In furrow","Vehicle-mounted","Inhalation",2.1000000000000001E-2,7.8E-2,null,"PHED",1.1999999999999999E-3,4.4999999999999997E-3,null,"PHED"]
["OutdoorGranules, fine granulesManualManualBody","Outdoor","Granules, fine granules","Manual","Manual","Body",null,null,"Value for application is for combination of mixing&loading and application","PHED",69,253,"Exposure value originally included use of PPE, calculated potential exposure is 100 times higher assuming a ‘worst case’ reduction factor of 1% for gloves/coverall","PHED"]
["OutdoorGranules, fine granulesManualManualHands","Outdoor","Granules, fine granules","Manual","Manual","Hands",null,null,"Value for application is for combination of mixing&loading and application","PHED",29,94,"Exposure value originally included use of PPE, calculated potential exposure is 100 times higher assuming a ‘worst case’ reduction factor of 1% for gloves/coverall","PHED"]
["OutdoorGranules, fine granulesManualManualInhalation","Outdoor","Granules, fine granules","Manual","Manual","Inhalation",null,null,"Value for application is for combination of mixing&loading and application","PHED",0.47,1.5,null,"PHED"]

{"sheet":"Resident","index":18,"n_rows":75,"n_cols":26,"rows_kept":75,"cut":false,"hidden":false,"merged":[[69,18,69,19],[70,18,70,19],[71,18,71,19],[67,18,67,19],[66,18,66,19],[60,18,60,19],[61,18,61,19],[62,18,62,19],[64,11,64,12],[67,11,67,12],[70,13,70,14],[44,21,45,23],[53,21,56,23],[68,21,70,23],[50,18,50,19],[51,18,51,19],[52,18,52,19],[53,18,53,19],[47,21,47,23],[48,21,48,23],[49,21,49,23],[50,21,52,23],[61,21,61,23],[46,18,46,19],[47,18,47,19],[63,18,63,19],[58,16,58,19],[56,18,56,19],[68,18,68,19],[55,18,55,19],[51,16,51,17],[59,18,59,19],[60,21,60,23],[63,21,63,23],[59,21,59,23],[44,6,44,7],[44,18,44,19],[45,18,45,19],[45,13,45,14],[62,11,62,12],[65,11,65,12],[45,16,45,17],[46,11,46,12],[47,11,47,12],[50,11,50,12],[49,11,49,12],[47,13,47,14],[55,13,55,14],[55,16,55,17],[64,18,64,19],[65,18,65,19],[56,16,56,17],[63,16,63,17],[53,16,53,17],[54,18,54,19],[50,8,50,9],[53,8,53,9],[55,8,55,9],[61,11,61,12],[25,0,25,2],[41,6,41,7],[30,1,30,5],[30,6,30,10],[30,11,30,15],[40,1,40,4],[41,18,41,19],[42,18,42,19],[43,18,43,19],[42,3,42,4],[41,3,41,4],[43,3,43,4],[41,11,41,12],[42,11,42,12],[43,11,43,12],[43,6,43,7],[40,6,40,9],[43,16,43,17],[41,13,41,14],[42,16,42,17],[40,16,40,19],[42,6,42,7],[44,1,44,2],[44,11,44,12],[44,16,44,17],[44,13,44,14],[41,8,41,9],[42,8,42,9],[43,8,43,9],[42,13,42,14],[8,2,8,5],[9,2,9,5],[10,2,10,5],[11,2,11,5],[13,2,13,5],[16,11,16,15],[15,11,15,15],[14,2,14,5],[15,2,15,5],[41,1,41,2],[43,1,43,2],[42,1,42,2],[40,11,40,14],[16,2,16,5],[43,13,43,14],[41,16,41,17],[6,16,6,20],[7,11,7,15],[8,11,8,15],[10,11,10,15],[11,11,11,15],[10,6,10,10],[7,6,7,10],[30,21,30,25],[30,16,30,20],[15,16,15,20],[11,16,11,20],[10,16,10,20],[9,16,9,20],[8,16,8,20],[7,16,7,20],[12,6,12,10],[12,11,12,15],[16,6,16,10],[15,6,15,10],[16,16,16,20],[13,16,13,20],[14,16,14,20],[12,16,12,20],[6,2,6,5],[9,0,9,1],[9,11,9,15],[10,0,10,1],[11,0,11,1],[8,6,8,10],[9,6,9,10],[14,6,14,10],[11,6,11,10],[13,6,13,10],[12,2,12,5],[7,0,7,1],[8,0,8,1],[7,2,7,5],[12,0,12,1],[13,11,13,15],[14,11,14,15],[13,0,13,1],[6,6,6,10],[6,11,6,15],[45,1,45,2],[53,11,53,12],[55,11,55,12],[54,11,54,12],[52,11,52,12],[46,6,46,7],[47,6,47,7],[53,6,53,7],[44,3,44,4],[55,3,55,4],[46,8,46,9],[47,8,47,9],[48,8,48,9],[48,6,48,7],[51,8,51,9],[46,1,46,2],[45,8,45,9],[54,6,54,7],[44,8,44,9],[48,11,48,12],[45,11,45,12],[49,8,49,9],[52,8,52,9],[51,11,51,12],[56,3,56,4],[50,3,50,4],[51,3,51,4],[54,1,54,2],[55,1,55,2],[47,3,47,4],[48,3,48,4],[50,1,50,2],[51,1,51,2],[52,1,52,2],[53,1,53,2],[56,1,56,2],[47,1,47,2],[48,1,48,2],[49,1,49,2],[58,1,58,4],[59,3,59,4],[60,3,60,4],[64,1,64,2],[64,6,64,7],[45,3,45,4],[59,6,59,7],[60,6,60,7],[49,6,49,7],[55,6,55,7],[56,6,56,7],[50,6,50,7],[51,6,51,7],[52,6,52,7],[46,3,46,4],[45,6,45,7],[49,3,49,4],[52,3,52,4],[53,3,53,4],[54,3,54,4],[63,3,63,4],[62,1,62,2],[61,1,61,2],[59,1,59,2],[60,1,60,2],[63,1,63,2],[61,3,61,4],[62,3,62,4],[67,3,67,4],[64,3,64,4],[74,1,74,2],[73,8,73,9],[70,8,70,9],[71,8,71,9],[72,8,72,9],[66,1,66,2],[65,1,65,2],[67,1,67,2],[68,3,68,4],[68,1,68,2],[69,1,69,2],[69,3,69,4],[66,3,66,4],[70,3,70,4],[71,3,71,4],[72,3,72,4],[73,1,73,2],[74,8,74,9],[73,3,73,4],[70,1,70,2],[71,1,71,2],[72,1,72,2],[74,3,74,4],[65,3,65,4],[62,16,62,17],[61,16,61,17],[74,11,74,12],[72,6,72,7],[63,6,63,7],[61,6,61,7],[73,6,73,7],[66,11,66,12],[73,11,73,12],[69,11,69,12],[70,11,70,12],[71,11,71,12],[72,11,72,12],[68,8,68,9],[69,8,69,9],[74,6,74,7],[69,6,69,7],[70,6,70,7],[73,21,74,23],[46,21,46,23],[61,13,61,14],[62,13,62,14],[64,13,64,14],[65,13,65,14],[67,6,67,7],[58,11,58,14],[56,11,56,12],[58,6,58,9],[56,13,56,14],[56,8,56,9],[50,13,50,14],[51,13,51,14],[48,18,48,19],[48,13,48,14],[60,8,60,9],[54,13,54,14],[46,16,46,17],[52,16,52,17],[72,18,72,19],[71,21,71,23],[62,21,62,23],[64,21,64,23],[50,16,50,17],[66,16,66,17],[71,6,71,7],[62,8,62,9],[63,8,63,9],[66,6,66,7],[68,6,68,7],[65,6,65,7],[62,6,62,7],[54,8,54,9],[61,8,61,9],[59,8,59,9],[65,8,65,9],[66,8,66,9],[67,8,67,9],[64,8,64,9],[73,18,73,19],[74,18,74,19],[72,13,72,14],[36,21,37,25],[74,13,74,14],[49,18,49,19],[49,16,49,17],[49,13,49,14],[52,13,52,14],[53,13,53,14],[46,13,46,14],[48,16,48,17],[47,16,47,17],[74,16,74,17],[59,16,59,17],[64,16,64,17],[65,16,65,17],[71,16,71,17],[73,16,73,17],[70,16,70,17],[60,16,60,17],[73,13,73,14],[71,13,71,14],[59,13,59,14],[32,21,33,25],[1,2,1,3],[72,21,72,23],[66,21,66,23],[67,21,67,23],[54,16,54,17],[66,13,66,14],[72,16,72,17],[67,16,67,17],[68,16,68,17],[69,16,69,17],[68,11,68,12],[41,21,41,23],[42,21,42,23],[59,11,59,12],[60,11,60,12],[63,11,63,12],[63,13,63,14],[68,13,68,14],[69,13,69,14],[43,21,43,23],[65,21,65,23],[60,13,60,14],[67,13,67,14]]}
[{"$f":"IF(i_IndoorOutdoor=\"Indoor\", \"Resident exposure for \"&i_ProductName&\" - NA for indoor applications\",\"Resident exposure for \"&i_ProductName)","v":"Resident exposure for "}]
["Crop type",null,{"$f":"i_CropType&\", Season: \"&i_Season","v":", Season: not relevant"},null,"Crop group",{"$f":"INDEX(ay_CropType,MATCH(i_CropType,key_CropType,0),8)","v":{"$error":"#N/A"}}]
["Application method",null,{"$f":"i_AppMeth","v":0}]
["Application equipment",null,{"$f":"i_AppEquip","v":0},null,"Consider re-entry for indoor uses?","No",null,null,null,null,null,null,null,null,null,null,null,null,null,null,null,"i_AppEquip"]
["Formulation type",null,{"$f":"i_FormVal","v":0},null,null,null,null,null,null,null,null,null,null,null,null,null,null,null,null,null,null,"i_FormVal"]
["Buffer strip",null,{"$f":"i_Buffer","v":0},"m",null,null,null,null,null,null,null,null,null,null,null,null,null,null,null,null,null,"i_Buffer"]
[null,null,{"$f":"i_SubstName1","v":0},null,null,null,{"$f":"i_SubstName2","v":0},null,null,null,null,{"$f":"i_SubstName3","v":0},null,null,null,null,{"$f":"i_SubstName4","v":0}]
["Application rate of the a.s. (kg a.s./ha)",null,{"$f":"i_AppRateAS1","v":0},null,null,null,{"$f":"i_AppRateAS2","v":0},null,null,null,null,{"$f":"i_AppRateAS3","v":0},null,null,null,null,{"$f":"i_AppRateAS4","v":0},null,null,null,null,"i_AppRateAS"]
[{"$f":"\"Concentration of active substance (in-use dilution for liquid applications)\"&\" \"&IF(i_FormVal=\"Granules, fine granules\",\"(kg a.s./kg)\",\"(g a.s./L)\")","v":"Concentration of active substance (in-use dilution for liquid applications) (g a.s./L)"},null,{"$f":"d_ConcAs1","v":{"$error":"#DIV/0!"}},null,null,null,{"$f":"d_ConcAs2","v":{"$error":"#DIV/0!"}},null,null,null,null,{"$f":"d_ConcAs3","v":{"$error":"#DIV/0!"}},null,null,null,null,{"$f":"d_ConcAs4","v":{"$error":"#DIV/0!"}},null,null,null,null,"d_ConcAS"]
["Dermal absorption of product",null,{"$f":"i_AbsorpProduct1","v":0},null,null,null,{"$f":"i_AbsorpProduct2","v":0},null,null,null,null,{"$f":"i_AbsorpProduct3","v":0},null,null,null,null,{"$f":"i_AbsorpProduct4","v":0},null,null,null,null,"i_AbsorpProduct"]
["Dermal absorption of in-use dilution",null,{"$f":"i_AbsorpInuse1","v":0},null,null,null,{"$f":"i_AbsorpInuse2","v":0},null,null,null,null,{"$f":"i_AbsorpInuse3","v":0},null,null,null,null,{"$f":"i_AbsorpInuse4","v":0},null,null,null,null,"i_AbsorpInuse"]
["Oral absorption",null,{"$f":"IF(i_AbsorpOralInuse1>0.8,1,i_AbsorpOralInuse1)","v":1},null,null,null,{"$f":"IF(i_AbsorpOralInuse2>0.8,1,i_AbsorpOralInuse2)","v":1},null,null,null,null,{"$f":"IF(i_AbsorpOralInuse3>0.8,1,i_AbsorpOralInuse3)","v":1},null,null,null,null,{"$f":"IF(i_AbsorpOralInuse4>0.8,1,i_AbsorpOralInuse4)","v":1},null,null,null,null,"i_AbsorpOralInuse"]
["Inhalation absorption",null,{"$f":"i_AbsorpInhalation1","v":1},null,null,null,{"$f":"i_AbsorpInhalation2","v":1},null,null,null,null,{"$f":"i_AbsorpInhalation3","v":1},null,null,null,null,{"$f":"i_AbsorpInhalation4","v":1},null,null,null,null,"i_AbsorpOralInuse"]
[{"$f":"IF(i_CropType=\"Amenity grassland\",\"Turf transferable residue (i_AppRate*d_Turf)\",\"Dislodgeable foliar residue (i_AppRate*i_DFR)\")&\" (μg a.s./cm²)\"","v":"Dislodgeable foliar residue (i_AppRate*i_DFR) (μg a.s./cm²)"},null,{"$f":"IF(i_CropType=\"Amenity grassland\",d_TTR1,d_DFR1)","v":0},null,null,null,{"$f":"IF(i_CropType=\"Amenity grassland\",d_TTR2,d_DFR2)","v":0},null,null,null,null,{"$f":"IF(i_CropType=\"Amenity grassland\",d_TTR3,d_DFR3)","v":0},null,null,null,null,{"$f":"IF(i_CropType=\"Amenity grassland\",d_TTR4,d_DFR4)","v":0},null,null,null,null,{"$f":"IF(LEFT(A14,4)=\"Turf\",\"d_TTR\",\"d_DFR\")","v":"d_DFR"}]
["Vapour pressure of in-use dilution",null,{"$f":"i_Volat1","v":"low volatile substances having a vapour pressure of < 0.005 Pa"},null,null,null,{"$f":"i_Volat2","v":"low volatile substances having a vapour pressure of < 0.005 Pa"},null,null,null,null,{"$f":"i_Volat3","v":"low volatile substances having a vapour pressure of < 0.005 Pa"},null,null,null,null,{"$f":"i_Volat4","v":"low volatile substances having a vapour pressure of < 0.005 Pa"},null,null,null,null,"i_Volat"]
["Saturated vapour concentration (mg/m³)",null,{"$f":"d_SVC1","v":"N/A"},null,null,null,{"$f":"d_SVC2","v":"N/A"},null,null,null,null,{"$f":"d_SVC3","v":"N/A"},null,null,null,null,{"$f":"d_SVC4","v":"N/A"},null,null,null,null,"d_SVC"]
["Concentration in air  (mg/m³)",null,{"$f":"d_VC1","v":1E-3},null,null,null,{"$f":"d_VC2","v":1E-3},null,null,null,null,{"$f":"d_VC3","v":1E-3},null,null,null,null,{"$f":"d_VC4","v":1E-3},null,null,null,null,"d_AirCon"]
["Resident dermal spray drift exposure 75th percentile - adult",null,null,{"$f":"IF(i_FormVal=\"Granules, fine granules\",\"NA\",INDEX(ay_ResidSpray, MATCH(i_AppMeth&i_Buffer, key_ResidSpray, 0), 2))","v":{"$error":"#N/A"}},"mL spray dilution/person"]
["Resident dermal spray drift exposure 75th percentile - child",null,null,{"$f":"IF(i_FormVal=\"Granules, fine granules\",\"NA\",INDEX(ay_ResidSpray, MATCH(i_AppMeth&i_Buffer, key_ResidSpray, 0), 3))","v":{"$error":"#N/A"}},"mL spray dilution/person"]
["Resident inhal. spray drift exposure 75th percentile - adult",null,null,{"$f":"IF(i_FormVal=\"Granules, fine granules\",\"NA\",INDEX(ay_ResidSpray,MATCH(i_AppMeth&i_Buffer,key_ResidSpray,0),4))","v":{"$error":"#N/A"}},"mL spray dilution/person"]
["Resident inhal. spray drift exposure 75th percentile - child",null,null,{"$f":"IF(i_FormVal=\"Granules, fine granules\",\"NA\",INDEX(ay_ResidSpray, MATCH(i_AppMeth&i_Buffer, key_ResidSpray, 0), 5))","v":{"$error":"#N/A"}},"mL spray dilution/person"]
["Resident dermal spray drift exposure mean - adult",null,null,{"$f":"IF(i_FormVal=\"Granules, fine granules\",\"NA\",INDEX(ay_AvgSpray, MATCH(i_AppMeth&i_Buffer, key_AvgSpray, 0), 2))","v":{"$error":"#N/A"}},"mL spray dilution/person"]
["Resident dermal spray drift exposure mean - child",null,null,{"$f":"IF(i_FormVal=\"Granules, fine granules\",\"NA\",INDEX(ay_AvgSpray, MATCH(i_AppMeth&i_Buffer, key_AvgSpray, 0), 3))","v":{"$error":"#N/A"}},"mL spray dilution/person"]
["Resident inhal. spray drift exposure mean - adult",null,null,{"$f":"IF(i_FormVal=\"Granules, fine granules\",\"NA\",INDEX(ay_AvgSpray, MATCH(i_AppMeth&i_Buffer, key_AvgSpray, 0), 4))","v":{"$error":"#N/A"}},"mL spray dilution/person"]
["Resident inhal. spray drift exposure mean - child",null,null,{"$f":"IF(i_FormVal=\"Granules, fine granules\",\"NA\",INDEX(ay_AvgSpray, MATCH(i_AppMeth&i_Buffer, key_AvgSpray, 0), 5))","v":{"$error":"#N/A"}},"mL spray dilution/person"]
["Drift reduction",null,null,{"$f":"Driftreduction","v":0}]
["Drift percentage on surface (75th percentile)",null,null,{"$f":"IF(AND(i_FormVal=\"Granules, fine granules\",i_AppMeth<>\"In furrow application of granules\"),0.03,IF(i_AppMeth=\"In furrow application of granules\",\"NA\",INDEX(ay_ByCropType,(MATCH(INDEX(ay_CropType,MATCH(i_CropType,key_CropType,0),8)&i_Season&i_Buffer,key_ByCropType,0)),3)))","v":{"$error":"#N/A"}}]
["Drift percentage on surface (mean)",null,null,{"$f":"IF(AND(i_FormVal=\"Granules, fine granules\",i_AppMeth<>\"In furrow application of granules\"),0.03,IF(i_AppMeth=\"In furrow application of granules\",\"NA\",INDEX(ay_ByCropType,(MATCH(INDEX(ay_CropType,MATCH(i_CropType,key_CropType,0),8)&i_Season&i_Buffer,key_ByCropType,0)),4)))","v":{"$error":"#N/A"}}]
[]
[]
["1. Total ",{"$f":"i_SubstName1","v":0},null,null,null,null,{"$f":"i_SubstName2","v":0},null,null,null,null,{"$f":"i_SubstName3","v":0},null,null,null,null,{"$f":"i_SubstName4","v":0},null,null,null,null,"Combined"]
["Adult","Spray drift (75th percentile)","Vapour (75th percentile)","Surface deposits (75th percentile)","Entry into treated crops (75th percentile)","All pathways (mean)","Spray drift (75th percentile)","Vapour (75th percentile)","Surface deposits (75th percentile)","Entry into treated crops (75th percentile)","All pathways (mean)","Spray drift (75th percentile)","Vapour (75th percentile)","Surface deposits (75th percentile)","Entry into treated crops (75th percentile)","All pathways (mean)","Spray drift (75th percentile)","Vapour (75th percentile)","Surface deposits (75th percentile)","Entry into treated crops (75th percentile)","All pathways (mean)","Spray drift (75th percentile)","Vapour (75th percentile)","Surface deposits (75th percentile)","Entry into treated crops (75th percentile)","All pathways (mean)"]
["Total systemic exposure (mg a.s./day)",{"$f":"B43","v":0},{"$f":"B44","v":1.6199999999999999E-2},{"$f":"B45","v":{"$error":"#N/A"}},{"$f":"B46","v":0},{"$f":"B61+B62+B63+B64","v":{"$error":"#N/A"}},{"$f":"G43","v":0},{"$f":"G44","v":1.6199999999999999E-2},{"$f":"G45","v":{"$error":"#N/A"}},{"$f":"G46","v":0},{"$f":"G61+G62+G63+G64","v":{"$error":"#N/A"}},{"$f":"L43","v":0},{"$f":"L44","v":1.6199999999999999E-2},{"$f":"L45","v":""},{"$f":"L46","v":""},{"$f":"L61+L62+L63+L64","v":1.6199999999999999E-2},{"$f":"Q43","v":0},{"$f":"Q44","v":1.6199999999999999E-2},{"$f":"Q45","v":""},{"$f":"Q46","v":""},{"$f":"Q61+Q62+Q63+Q64","v":{"$error":"#N/A"}},"Hazard Index"]
["Total systemic dose (mg/kg bw/day)",{"$f":"D43","v":0},{"$f":"D44","v":2.7E-4},{"$f":"D45","v":""},{"$f":"D46","v":0},{"$f":"D61+D62+D63+D64","v":{"$error":"#VALUE!"}},{"$f":"I43","v":0},{"$f":"I44","v":2.7E-4},{"$f":"I45","v":""},{"$f":"I46","v":0},{"$f":"I61+I62+I63+I64","v":{"$error":"#VALUE!"}},{"$f":"N43","v":0},{"$f":"N44","v":2.7E-4},{"$f":"N45","v":""},{"$f":"N46","v":""},{"$f":"N61+N62+N63+N64","v":2.7E-4},{"$f":"S43","v":0},{"$f":"S44","v":2.7E-4},{"$f":"S45","v":""},{"$f":"S46","v":""},{"$f":"S61+S62+S63+S64","v":{"$error":"#VALUE!"}}]
["% of AOEL",{"$f":"IFERROR(B34/i_AOEL1,0)","v":0},{"$f":"IFERROR(C34/i_AOEL1,0)","v":0},{"$f":"IFERROR(D34/i_AOEL1,0)","v":0},{"$f":"IFERROR(E34/i_AOEL1,0)","v":0},{"$f":"IFERROR(F34/i_AOEL1,0)","v":0},{"$f":"IFERROR(G34/i_AOEL2,0)","v":0},{"$f":"IFERROR(H34/i_AOEL2,0)","v":0},{"$f":"IFERROR(I34/i_AOEL2,0)","v":0},{"$f":"IFERROR(J34/i_AOEL2,0)","v":0},{"$f":"IFERROR(K34/i_AOEL2,0)","v":0},{"$f":"IFERROR(L34/i_AOEL3,0)","v":0},{"$f":"IFERROR(M34/i_AOEL3,0)","v":0},{"$f":"IFERROR(N34/i_AOEL3,0)","v":0},{"$f":"IFERROR(O34/i_AOEL3,0)","v":0},{"$f":"IFERROR(P34/i_AOEL3,0)","v":0},{"$f":"IFERROR(Q34/i_AOEL4,0)","v":0},{"$f":"IFERROR(R34/i_AOEL4,0)","v":0},{"$f":"IFERROR(S34/i_AOEL4,0)","v":0},{"$f":"IFERROR(T34/i_AOEL4,0)","v":0},{"$f":"IFERROR(U34/i_AOEL4,0)","v":0},{"$f":"IF(COUNTA('Data entry'!D26:G26)<2,\"N/A\",FIXED(B35+G35+L35+Q35,3))","v":"N/A"},{"$f":"IF(COUNTA('Data entry'!D26:G26)<2,\"N/A\",FIXED(C35+H35+M35+R35,3))","v":"N/A"},{"$f":"IF(COUNTA('Data entry'!D26:G26)<2,\"N/A\",FIXED(D35+I35+N35+S35,3))","v":"N/A"},{"$f":"IF(COUNTA('Data entry'!D26:G26)<2,\"N/A\",FIXED(E35+J35+O35+T35,3))","v":"N/A"},{"$f":"IF(COUNTA('Data entry'!D26:G26)<2,\"N/A\",FIXED(F35+K35+P35+U35,3))","v":"N/A"}]
["1-3 year old child","Spray drift (75th percentile)","Vapour (75th percentile)","Surface deposits (75th percentile)","Entry into treated crops (75th percentile)","All pathways (mean)","Spray drift (75th percentile)","Vapour (75th percentile)","Surface deposits (75th percentile)","Entry into treated crops (75th percentile)","All pathways (mean)","Spray drift (75th percentile)","Vapour (75th percentile)","Surface deposits (75th percentile)","Entry into treated crops (75th percentile)","All pathways (mean)","Spray drift (75th percentile)","Vapour (75th percentile)","Surface deposits (75th percentile)","Entry into treated crops (75th percentile)","All pathways (mean)","Spray drift (75th percentile)","Vapour (75th percentile)","Surface deposits (75th percentile)","Entry into treated crops (75th percentile)","All pathways (mean)"]
["Total systemic exposure (mg a.s./day)",{"$f":"B48","v":"N/A"},{"$f":"B49","v":8.0000000000000002E-3},{"$f":"B51+B52+B53","v":{"$error":"#N/A"}},{"$f":"B55+B56+B57","v":0},{"$f":"B66+B67+B69+B70+B71+B73","v":{"$error":"#N/A"}},{"$f":"G48","v":"N/A"},{"$f":"G49","v":8.0000000000000002E-3},{"$f":"G51+G52+G53","v":{"$error":"#N/A"}},{"$f":"G55+G56+G57","v":0},{"$f":"G66+G67+G69+G70+G71+G73","v":{"$error":"#N/A"}},{"$f":"L48","v":""},{"$f":"L49","v":8.0000000000000002E-3},{"$f":"L51+L52+L53","v":{"$error":"#VALUE!"}},{"$f":"L55+L56+L57","v":0},{"$f":"L66+L67+L69+L70+L71+L73","v":{"$error":"#VALUE!"}},{"$f":"Q48","v":""},{"$f":"Q49","v":8.0000000000000002E-3},{"$f":"Q51+Q52+Q53","v":{"$error":"#VALUE!"}},{"$f":"Q55+Q56+Q57","v":0},{"$f":"Q66+Q67+Q69+Q70+Q71+Q73","v":{"$error":"#N/A"}},"Hazard Index"]
["Total systemic dose (mg/kg bw/day)",{"$f":"D48","v":"N/A"},{"$f":"D49","v":8.0000000000000004E-4},{"$f":"D51+D52+D53","v":{"$error":"#VALUE!"}},{"$f":"D55+D56+D57","v":0},{"$f":"F37/d_BwChild","v":{"$error":"#N/A"}},{"$f":"I48","v":"N/A"},{"$f":"I49","v":8.0000000000000004E-4},{"$f":"I51+I52+I53","v":{"$error":"#VALUE!"}},{"$f":"I55+I56+I57","v":0},{"$f":"K37/d_BwChild","v":{"$error":"#N/A"}},{"$f":"N48","v":""},{"$f":"N49","v":8.0000000000000004E-4},{"$f":"N51+N52+N53","v":{"$error":"#VALUE!"}},{"$f":"N55+N56+N57","v":0},{"$f":"P37/d_BwChild","v":{"$error":"#VALUE!"}},{"$f":"S48","v":""},{"$f":"S49","v":8.0000000000000004E-4},{"$f":"S51+S52+S53","v":{"$error":"#VALUE!"}},{"$f":"S55+S56+S57","v":0},{"$f":"U37/d_BwChild","v":{"$error":"#N/A"}}]
["% of AOEL",{"$f":"IFERROR(B38/i_AOEL1,0)","v":0},{"$f":"IFERROR(C38/i_AOEL1,0)","v":0},{"$f":"IFERROR(D38/i_AOEL1,0)","v":0},{"$f":"IFERROR(E38/i_AOEL1,0)","v":0},{"$f":"IFERROR(F38/i_AOEL1,0)","v":0},{"$f":"IFERROR(G38/i_AOEL2,0)","v":0},{"$f":"IFERROR(H38/i_AOEL2,0)","v":0},{"$f":"IFERROR(I38/i_AOEL2,0)","v":0},{"$f":"IFERROR(J38/i_AOEL2,0)","v":0},{"$f":"IFERROR(K38/i_AOEL2,0)","v":0},{"$f":"IFERROR(L38/i_AOEL3,0)","v":0},{"$f":"IFERROR(M38/i_AOEL3,0)","v":0},{"$f":"IFERROR(N38/i_AOEL3,0)","v":0},{"$f":"IFERROR(O38/i_AOEL3,0)","v":0},{"$f":"IFERROR(P38/i_AOEL3,0)","v":0},{"$f":"IFERROR(Q38/i_AOEL4,0)","v":0},{"$f":"IFERROR(R38/i_AOEL4,0)","v":0},{"$f":"IFERROR(S38/i_AOEL4,0)","v":0},{"$f":"IFERROR(T38/i_AOEL4,0)","v":0},{"$f":"IFERROR(U38/i_AOEL4,0)","v":0},{"$f":"IF(COUNTA('Data entry'!D26:G26)<2,\"N/A\",FIXED(prozAOEL_ResSpDrCh+G39+L39+Q39,3))","v":"N/A"},{"$f":"IF(COUNTA('Data entry'!D26:G26)<2,\"N/A\",FIXED(prozAOEL_ResVapCh+H39+M39+R39,3))","v":"N/A"},{"$f":"IF(COUNTA('Data entry'!D26:G26)<2,\"N/A\",FIXED(prozAOEL_ResSDCh+I39+N39+S39,3))","v":"N/A"},{"$f":"IF(COUNTA('Data entry'!D26:G26)<2,\"N/A\",FIXED(prozAOEL_ResEntryCh+J39+O39+T39,3))","v":"N/A"},{"$f":"IF(COUNTA('Data entry'!D26:G26)<2,\"N/A\",FIXED(prozAOEL_ResMeanCh+K39+P39+U39,3))","v":"N/A"}]
[]
["2. Resident exposure 75th Percentile",{"$f":"i_SubstName1","v":0},null,null,null,null,{"$f":"i_SubstName2","v":0},null,null,null,null,{"$f":"i_SubstName3","v":0},null,null,null,null,{"$f":"i_SubstName4","v":0}]
["Adult","Systemic exposure [mg a.s./day]",null,"Systemic dose [mg a.s./kg bw/day]",null,null,"Systemic exposure [mg a.s./day]",null,"Systemic dose [mg a.s./kg bw/day]",null,null,"Systemic exposure [mg a.s./day]",null,"Systemic dose [mg a.s./kg bw/day]",null,null,"Systemic exposure [mg a.s./day]",null,"Systemic dose [mg a.s./kg bw/day]",null,null,"Comments"]
["Spray drift",{"$f":"IFERROR(IF(i_FormVal=\"Granules, fine granules\", 0,((ResDermSD75Ad*i_AbsorpInuse1*(1-d_ClothAF))+ResInhalSD75Ad)*d_ConcAs1*(1-Driftreduction)),0)","v":0},null,{"$f":"IF(ISNUMBER(B43),B43/d_BwAdult,0)","v":0},null,null,{"$f":"IFERROR(IF(i_FormVal=\"Granules, fine granules\", 0,((ResDermSD75Ad*i_AbsorpInuse2*(1-d_ClothAF))+ResInhalSD75Ad)*d_ConcAs2*(1-Driftreduction)),0)","v":0},null,{"$f":"IF(ISNUMBER(G43),G43/d_BwAdult,0)","v":0},null,null,{"$f":"IFERROR(IF(i_FormVal=\"Granules, fine granules\", 0,((ResDermSD75Ad*i_AbsorpInuse3*(1-d_ClothAF))+ResInhalSD75Ad)*d_ConcAs3*(1-Driftreduction)),0)","v":0},null,{"$f":"IF(ISNUMBER(L43),L43/d_BwAdult,\"\")","v":0},null,null,{"$f":"IFERROR(IF(i_FormVal=\"Granules, fine granules\", 0,((ResDermSD75Ad*i_AbsorpInuse4*(1-d_ClothAF))+ResInhalSD75Ad)*d_ConcAs4*(1-Driftreduction)),0)","v":0},null,{"$f":"IF(ISNUMBER(Q43),Q43/d_BwAdult,\"\")","v":0},null,null,{"$f":"IF(i_FormVal=\"Granules, fine granules\", \"NA for application of granules\",IF(i_AppMeth=\"Upward spraying\",\"the only available values are for the 8 m distance downwind from the middle of the tree trunk, which are assumed to represent 5 m distance from the edge of orchard; the same value is used for 5 and 10 m. \",IF(Driftreduction = 0.5,\"Since drift reducing nozzles are selected a 50% reduction factor has been applied\",\"N/A\")))","v":"N/A"}]
["Vapour",{"$f":"i_AbsorpInhalation1*d_AirCon1*d_BreathRAd*d_BwAdult","v":1.6199999999999999E-2},null,{"$f":"IF(ISNUMBER(B44),B44/d_BwAdult,\"\")","v":2.7E-4},null,null,{"$f":"i_AbsorpInhalation2*d_AirCon2*d_BreathRAd*d_BwAdult","v":1.6199999999999999E-2},null,{"$f":"IF(ISNUMBER(G44),G44/d_BwAdult,\"\")","v":2.7E-4},null,null,{"$f":"i_AbsorpInhalation3*d_AirCon3*d_BreathRAd*d_BwAdult","v":1.6199999999999999E-2},null,{"$f":"IF(ISNUMBER(L44),L44/d_BwAdult,\"\")","v":2.7E-4},null,null,{"$f":"i_AbsorpInhalation4*d_AirCon4*d_BreathRAd*d_BwAdult","v":1.6199999999999999E-2},null,{"$f":"IF(ISNUMBER(Q44),Q44/d_BwAdult,\"\")","v":2.7E-4}]
["Surface deposits (dermal)",{"$f":"IF(i_AppMeth=\"In furrow application of granules\", \"\",(i_AppRateAS1/100)*DrOnSurface75*d_Turf*d_ReTCAd*d_ReExpDur*MAX(i_AbsorpProduct1,i_AbsorpInuse1)*d_MAF1*(1-Driftreduction))","v":{"$error":"#N/A"}},null,{"$f":"IF(ISNUMBER(B45),B45/d_BwAdult,\"\")","v":""},null,null,{"$f":"IF(i_AppMeth=\"In furrow application of granules\", \"\",(i_AppRateAS2/100)*DrOnSurface75*d_Turf*d_ReTCAd*d_ReExpDur*MAX(i_AbsorpProduct2,i_AbsorpInuse2)*d_MAF2*(1-Driftreduction))","v":{"$error":"#N/A"}},null,{"$f":"IF(ISNUMBER(G45),G45/d_BwAdult,\"\")","v":""},null,null,{"$f":"IF(L41<>0,IF(i_AppMeth=\"In furrow application of granules\", \"\",(i_AppRateAS3/100)*DrOnSurface75*d_Turf*d_ReTCAd*d_ReExpDur*MAX(i_AbsorpProduct3,i_AbsorpInuse3)*d_MAF3*(1-Driftreduction)),\"\")","v":""},null,{"$f":"IF(ISNUMBER(L45),L45/d_BwAdult,\"\")","v":""},null,null,{"$f":"IF(Q41<>0,IF(i_AppMeth=\"In furrow application of granules\", \"\",(i_AppRateAS4/100)*DrOnSurface75*d_Turf*d_ReTCAd*d_ReExpDur*MAX(i_AbsorpProduct4,i_AbsorpInuse4)*d_MAF4*(1-Driftreduction)),\"\")","v":""},null,{"$f":"IF(ISNUMBER(Q45),Q45/d_BwAdult,\"\")","v":""},null,null,{"$f":"IF(i_AppMeth=\"In furrow application of granules\", \"NA for in furrow or manual application of granules\",IF(Driftreduction = 0.5,\"Since drift reducing nozzles are selected a 50% reduction factor has been applied\",\"\"))","v":""}]
["Entry into treated crops (dermal)",{"$f":"IF(OR(i_FormVal=\"Granules, fine granules\",AND(i_IndoorOutdoor<>\"Outdoor\",$F$4=\"No\")),0, IF(i_CropType=\"Amenity grassland\",d_TTR1/1000*d_MAF1*d_ReTCAd*d_ExpDurTreatCrop*MAX(i_AbsorpProduct1,i_AbsorpInuse1), (d_TcEntryAd*0.25*d_DFR1*d_MAF1)/1000*MAX(i_AbsorpProduct1,i_AbsorpInuse1)))","v":0},null,{"$f":"IF(ISNUMBER(B46),B46/d_BwAdult,\"\")","v":0},null,null,{"$f":"IF(OR(i_FormVal=\"Granules, fine granules\",AND(i_IndoorOutdoor<>\"Outdoor\",$F$4=\"No\")),0, IF(i_CropType=\"Amenity grassland\", d_TTR2/1000*d_MAF2*d_ReTCAd*d_ExpDurTreatCrop*MAX(i_AbsorpProduct2,i_AbsorpInuse2), (d_TcEntryAd*0.25*d_DFR2*d_MAF2)/1000*MAX(i_AbsorpProduct2,i_AbsorpInuse2)))","v":0},null,{"$f":"IF(ISNUMBER(G46),G46/d_BwAdult,\"\")","v":0},null,null,{"$f":"IF(L41<>0,IF(OR(i_FormVal=\"Granules, fine granules\",AND(i_IndoorOutdoor<>\"Outdoor\",$F$4=\"No\")),0, IF(i_CropType=\"Amenity grassland\", (d_TTR3/1000)*d_MAF3*d_ReTCAd*d_ExpDurTreatCrop*MAX(i_AbsorpProduct3,i_AbsorpInuse3), (d_TcEntryAd*0.25*d_DFR3*d_MAF3)/1000*MAX(i_AbsorpProduct3,i_AbsorpInuse3))),\"\")","v":""},null,{"$f":"IF(ISNUMBER(L46),L46/d_BwAdult,\"\")","v":""},null,null,{"$f":"IF(Q41<>0,IF(OR(i_FormVal=\"Granules, fine granules\",AND(i_IndoorOutdoor<>\"Outdoor\",$F$4=\"No\")),0, IF(i_CropType=\"Amenity grassland\", (d_TTR4/1000)*d_MAF4*d_ReTCAd*d_ExpDurTreatCrop*MAX(i_AbsorpProduct4,i_AbsorpInuse4), (d_TcEntryAd*0.25*d_DFR4*d_MAF4)/1000*MAX(i_AbsorpProduct4,i_AbsorpInuse4))),\"\")","v":""},null,{"$f":"IF(ISNUMBER(Q46),Q46/d_BwAdult,\"\")","v":""}]
["1-3 year old child","Systemic exposure [mg a.s./day]",null,"Systemic dose [mg a.s./kg bw/day]",null,null,"Systemic exposure [mg a.s./day]",null,"Systemic dose [mg a.s./kg bw/day]",null,null,"Systemic exposure [mg a.s./day]",null,"Systemic dose [mg a.s./kg bw/day]",null,null,"Systemic exposure [mg a.s./day]",null,"Systemic dose [mg a.s./kg bw/day]",null,null,"Comments"]
["Spray drift",{"$f":"IFERROR(IF(i_FormVal=\"Granules, fine granules\",0,((ResDermSD75Ch*i_AbsorpInuse1*(1-d_ClothAF))+ResInhalSD75Ch)*d_ConcAs1*(1-Driftreduction)),\"N/A\")","v":"N/A"},null,{"$f":"IF(ISNUMBER(B48),B48/d_BwChild, \"N/A\")","v":"N/A"},null,null,{"$f":"IFERROR(IF(i_FormVal=\"Granules, fine granules\",0,((ResDermSD75Ch*i_AbsorpInuse2*(1-d_ClothAF))+ResInhalSD75Ch)*d_ConcAs2*(1-Driftreduction)),\"N/A\")","v":"N/A"},null,{"$f":"IF(ISNUMBER(G48),G48/d_BwChild, \"N/A\")","v":"N/A"},null,null,{"$f":"IF(L41<>0,IFERROR(IF(i_FormVal=\"Granules, fine granules\",0,((ResDermSD75Ch*i_AbsorpInuse3*(1-d_ClothAF))+ResInhalSD75Ch)*d_ConcAs3*(1-Driftreduction)),\"N/A\"),\"\")","v":""},null,{"$f":"IF(ISNUMBER(L48),L48/d_BwChild, \"\")","v":""},null,null,{"$f":"IF(Q41<>0,IFERROR(IF(i_FormVal=\"Granules, fine granules\",0,((ResDermSD75Ch*i_AbsorpInuse4*(1-d_ClothAF))+ResInhalSD75Ch)*d_ConcAs4*(1-Driftreduction)),\"N/A\"),\"\")","v":""},null,{"$f":"IF(ISNUMBER(Q48),Q48/d_BwChild, \"\")","v":""},null,null,{"$f":"IF(i_FormVal=\"Granules, fine granules\", \"NA for application of granules\",IF(i_AppMeth=\"Upward spraying\",\"the only available values are for the 8 m distance downwind from the middle of the tree trunk, which are assumed to represent 5 m distance from the edge of orchard; the same value is used for 5 and 10 m. \",IF(Driftreduction = 0.5,\"Since drift reducing nozzles are selected a 50% reduction factor has been applied\",\"\")))","v":""}]
["Vapour",{"$f":"i_AbsorpInhalation1*d_AirCon1*d_BreathRCh*d_BwChild","v":8.0000000000000002E-3},null,{"$f":"IF(ISNUMBER(B49),B49/d_BwChild, \"\")","v":8.0000000000000004E-4},null,null,{"$f":"i_AbsorpInhalation2*d_AirCon2*d_BreathRCh*d_BwChild","v":8.0000000000000002E-3},null,{"$f":"IF(ISNUMBER(G49),G49/d_BwChild, \"\")","v":8.0000000000000004E-4},null,null,{"$f":"i_AbsorpInhalation3*d_AirCon3*d_BreathRCh*d_BwChild","v":8.0000000000000002E-3},null,{"$f":"IF(ISNUMBER(L49),L49/d_BwChild, \"\")","v":8.0000000000000004E-4},null,null,{"$f":"i_AbsorpInhalation4*d_AirCon4*d_BreathRCh*d_BwChild","v":8.0000000000000002E-3},null,{"$f":"IF(ISNUMBER(Q49),Q49/d_BwChild, \"\")","v":8.0000000000000004E-4}]
["Surface deposits"]
["Dermal",{"$f":"IF( i_AppMeth=\"In furrow application of granules\", \"\",(i_AppRateAS1/100)*DrOnSurface75*d_Turf*d_ReTCCh*d_ReExpDur*MAX(i_AbsorpProduct1,i_AbsorpInuse1)*d_MAF1*(1-Driftreduction))","v":{"$error":"#N/A"}},null,{"$f":"IF(ISNUMBER(B51),B51/d_BwChild, \"\")","v":""},null,null,{"$f":"IF( i_AppMeth=\"In furrow application of granules\", \"\",(i_AppRateAS2/100)*DrOnSurface75*d_Turf*d_ReTCCh*d_ReExpDur*MAX(i_AbsorpProduct2,i_AbsorpInuse2)*d_MAF2*(1-Driftreduction))","v":{"$error":"#N/A"}},null,{"$f":"IF(ISNUMBER(G51),G51/d_BwChild, \"\")","v":""},null,null,{"$f":"IF(L41<>0,IF( i_AppMeth=\"In furrow application of granules\", \"\",(i_AppRateAS3/100)*DrOnSurface75*d_Turf*d_ReTCCh*d_ReExpDur*MAX(i_AbsorpProduct3,i_AbsorpInuse3)*d_MAF3*(1-Driftreduction)),\"\")","v":""},null,{"$f":"IF(ISNUMBER(L51),L51/d_BwChild, \"\")","v":""},null,null,{"$f":"IF(Q41<>0,IF( i_AppMeth=\"In furrow application of granules\", \"\",(i_AppRateAS4/100)*DrOnSurface75*d_Turf*d_ReTCCh*d_ReExpDur*MAX(i_AbsorpProduct4,i_AbsorpInuse4)*d_MAF4*(1-Driftreduction)),\"\")","v":""},null,{"$f":"IF(ISNUMBER(Q51),Q51/d_BwChild, \"\")","v":""},null,null,{"$f":"IF(W26=\"na\",\"NA since upward spraying applications are not expected for this crop type\",IF(Driftreduction = 0.5,\"Since drift reducing nozzles are selected a 50% reduction factor has been applied\",\"\"))","v":""}]
["Hand to mouth",{"$f":"IF(i_AppMeth=\"In furrow application of granules\",\"\",(i_AppRateAS1/100)*DrOnSurface75*d_Turf*d_SalExt*d_AreaHM*d_ReFreqHM*d_ReExpDur*i_AbsorpOralInuse1*d_MAF1*(1-Driftreduction))","v":{"$error":"#N/A"}},null,{"$f":"IF(ISNUMBER(B52),B52/d_BwChild, \"\")","v":""},null,null,{"$f":"IF(i_AppMeth=\"In furrow application of granules\",\"\",(i_AppRateAS2/100)*DrOnSurface75*d_Turf*d_SalExt*d_AreaHM*d_ReFreqHM*d_ReExpDur*i_AbsorpOralInuse2*d_MAF2*(1-Driftreduction))","v":{"$error":"#N/A"}},null,{"$f":"IF(ISNUMBER(G52),G52/d_BwChild, \"\")","v":""},null,null,{"$f":"IF(L41<>0,IF(i_AppMeth=\"In furrow application of granules\",\"\",(i_AppRateAS3/100)*DrOnSurface75*d_Turf*d_SalExt*d_AreaHM*d_ReFreqHM*d_ReExpDur*i_AbsorpOralInuse3*d_MAF3*(1-Driftreduction)),\"\")","v":""},null,{"$f":"IF(ISNUMBER(L52),L52/d_BwChild, \"\")","v":""},null,null,{"$f":"IF(Q41<>0,IF(i_AppMeth=\"In furrow application of granules\",\"\",(i_AppRateAS4/100)*DrOnSurface75*d_Turf*d_SalExt*d_AreaHM*d_ReFreqHM*d_ReExpDur*i_AbsorpOralInuse4*d_MAF4*(1-Driftreduction)),\"\")","v":""},null,{"$f":"IF(ISNUMBER(Q52),Q52/d_BwChild, \"\")","v":""}]
["Object to mouth",{"$f":"IF(i_AppMeth=\"In furrow application of granules\",\"\",(i_AppRateAS1/100)*DrOnSurface75*d_DRP*d_MouthGrass*i_AbsorpOralInuse1*d_MAF1*(1-Driftreduction))","v":{"$error":"#N/A"}},null,{"$f":"IF(ISNUMBER(B53),B53/d_BwChild, \"\")","v":""},null,null,{"$f":"IF(i_AppMeth=\"In furrow application of granules\",\"\",(i_AppRateAS2/100)*DrOnSurface75*d_DRP*d_MouthGrass*i_AbsorpOralInuse2*d_MAF2*(1-Driftreduction))","v":{"$error":"#N/A"}},null,{"$f":"IF(ISNUMBER(G53),G53/d_BwChild, \"\")","v":""},null,null,{"$f":"IF(L41<>0,IF(i_AppMeth=\"In furrow application of granules\",\"\",(i_AppRateAS3/100)*DrOnSurface75*d_DRP*d_MouthGrass*i_AbsorpOralInuse3*d_MAF3*(1-Driftreduction)),\"\")","v":""},null,{"$f":"IF(ISNUMBER(L53),L53/d_BwChild, \"\")","v":""},null,null,{"$f":"IF(Q41<>0,IF(i_AppMeth=\"In furrow application of granules\",\"\",(i_AppRateAS4/100)*DrOnSurface75*d_DRP*d_MouthGrass*i_AbsorpOralInuse4*d_MAF4*(1-Driftreduction)),\"\")","v":""},null,{"$f":"IF(ISNUMBER(Q53),Q53/d_BwChild, \"\")","v":""}]
["Entry into treated crops",null,null,null,null,null,null,null,null,null,null,null,null,null,null,null,null,null,null,null,null,{"$f":"IF(i_CropType=\"Amenity grassland\",\"\",\"Considered only for application on grassland and lawns and for application on golf course, turf or other sports lawns. \")","v":"Considered only for application on grassland and lawns and for application on golf course, turf or other sports lawns. "}]
["Dermal",{"$f":"IF(OR(i_FormVal=\"Granules, fine granules\",AND(i_IndoorOutdoor<>\"Outdoor\",$F$4=\"No\")),0,  IF(i_CropType=\"Amenity grassland\", (d_TTR1/1000)*d_MAF1*d_ReTCCh*d_ExpDurTreatCrop*MAX(i_AbsorpProduct1,i_AbsorpInuse1), (d_TcEntryCh*0.25*d_DFR1*d_MAF1)/1000*MAX(i_AbsorpProduct1,i_AbsorpInuse1)))","v":0},null,{"$f":"IF(ISNUMBER(B55),B55/d_BwChild, \"\")","v":0},null,null,{"$f":"IF(G41<>0,IF(OR(i_FormVal=\"Granules, fine granules\",AND(i_IndoorOutdoor<>\"Outdoor\",$F$4=\"No\")),0,  IF(i_CropType=\"Amenity grassland\", (d_TTR2/1000)*d_MAF2*d_ReTCCh*d_ExpDurTreatCrop*MAX(i_AbsorpProduct2,i_AbsorpInuse2),(d_TcEntryCh*0.25*d_DFR2*d_MAF2)/1000*MAX(i_AbsorpProduct2,i_AbsorpInuse2))),0)","v":0},null,{"$f":"IF(ISNUMBER(G55),G55/d_BwChild, 0)","v":0},null,null,{"$f":"IF(L41<>0,IF(OR(i_FormVal=\"Granules, fine granules\",AND(i_IndoorOutdoor<>\"Outdoor\",$F$4=\"No\")),0, IF(i_CropType=\"Amenity grassland\", (d_TTR3/1000)*d_MAF3*d_ReTCCh*d_ExpDurTreatCrop*MAX(i_AbsorpProduct3,i_AbsorpInuse3),(d_TcEntryCh*0.25*d_DFR3*d_MAF3)/1000*MAX(i_AbsorpProduct3,i_AbsorpInuse3))),0)","v":0},null,{"$f":"IF(ISNUMBER(L55),L55/d_BwChild, 0)","v":0},null,null,{"$f":"IF(Q41<>0,IF(OR(i_FormVal=\"Granules, fine granules\",AND(i_IndoorOutdoor<>\"Outdoor\",$F$4=\"No\")),0, IF(i_CropType=\"Amenity grassland\", (d_TTR4/1000)*d_MAF4*d_ReTCCh*d_ExpDurTreatCrop*MAX(i_AbsorpProduct4,i_AbsorpInuse4),(d_TcEntryCh*0.25*d_DFR4*d_MAF4)/1000*MAX(i_AbsorpProduct4,i_AbsorpInuse4))),0)","v":0},null,{"$f":"IF(ISNUMBER(Q55),Q55/d_BwChild, 0)","v":0}]
["Hand to mouth",{"$f":"IF(OR(i_FormVal=\"Granules, fine granules\",AND(i_IndoorOutdoor<>\"Outdoor\",$F$4=\"No\")),0,  IF(i_CropType=\"Amenity grassland\",(i_AppRateAS1/100)*d_MAF1*d_Turf*d_SalExt*d_AreaHM*d_ReFreqHM*d_ExpDurTreatCrop*i_AbsorpOralInuse1,0))","v":0},null,{"$f":"IF(ISNUMBER(B56),B56/d_BwChild, 0)","v":0},null,null,{"$f":"IF(OR(i_FormVal=\"Granules, fine granules\",AND(i_IndoorOutdoor<>\"Outdoor\",$F$4=\"No\")),0,IF(i_CropType=\"Amenity grassland\",(i_AppRateAS2/100)*d_MAF2*d_Turf*d_SalExt*d_AreaHM*d_ReFreqHM*d_ExpDurTreatCrop*i_AbsorpOralInuse2,0))","v":0},null,{"$f":"IF(ISNUMBER(G56),G56/d_BwChild, 0)","v":0},null,null,{"$f":"IF(L41<>0,IF(i_CropType=\"Amenity grassland\",(i_AppRateAS3/100)*d_MAF3*d_Turf*d_SalExt*d_AreaHM*d_ReFreqHM*d_ExpDurTreatCrop*i_AbsorpOralInuse3, 0),0)","v":0},null,{"$f":"IF(ISNUMBER(L56),L56/d_BwChild, 0)","v":0},null,null,{"$f":"IF(Q41<>0,IF(i_CropType=\"Amenity grassland\",(i_AppRateAS4/100)*d_MAF4*d_Turf*d_SalExt*d_AreaHM*d_ReFreqHM*d_ExpDurTreatCrop*i_AbsorpOralInuse4, 0),0)","v":0},null,{"$f":"IF(ISNUMBER(Q56),Q56/d_BwChild, 0)","v":0}]
["Object to mouth",{"$f":"IF(OR(i_FormVal=\"Granules, fine granules\",AND(i_IndoorOutdoor<>\"Outdoor\",$F$4=\"No\")),0,  IF(i_CropType=\"Amenity grassland\",(i_AppRateAS1/100)*d_DRP*d_MouthGrass*i_AbsorpOralInuse1*d_MAF1,0))","v":0},null,{"$f":"IF(ISNUMBER(B57),B57/d_BwChild, 0)","v":0},null,null,{"$f":"IF(OR(i_FormVal=\"Granules, fine granules\",AND(i_IndoorOutdoor<>\"Outdoor\",$F$4=\"No\")),0,IF(i_CropType=\"Amenity grassland\",(i_AppRateAS2/100)*d_DRP*d_MouthGrass*i_AbsorpOralInuse2*d_MAF2,0))","v":0},null,{"$f":"IF(ISNUMBER(G57),G57/d_BwChild, 0)","v":0},null,null,{"$f":"IF(L41<>0,IF(i_CropType=\"Amenity grassland\",(i_AppRateAS3/100)*d_DRP*d_MouthGrass*i_AbsorpOralInuse3*d_MAF3,0),0)","v":0},null,{"$f":"IF(ISNUMBER(L57),L57/d_BwChild, 0)","v":0},null,null,{"$f":"IF(Q41<>0,IF(i_CropType=\"Amenity grassland\",(i_AppRateAS4/100)*d_DRP*d_MouthGrass*i_AbsorpOralInuse4*d_MAF4,0),0)","v":0},null,{"$f":"IF(ISNUMBER(Q57),Q57/d_BwChild, 0)","v":0}]
[]
["2. Resident exposure mean",{"$f":"i_SubstName1","v":0},null,null,null,null,{"$f":"i_SubstName2","v":0},null,null,null,null,{"$f":"i_SubstName3","v":0},null,null,null,null,{"$f":"i_SubstName4","v":0}]
["Adult","Systemic exposure [mg a.s./day]",null,"Systemic dose [mg a.s./kg bw/day]",null,null,"Systemic exposure [mg a.s./day]",null,"Systemic dose [mg a.s./kg bw/day]",null,null,"Systemic exposure [mg a.s./day]",null,"Systemic dose [mg a.s./kg bw/day]",null,null,"Systemic exposure [mg a.s./day]",null,"Systemic dose [mg a.s./kg bw/day]",null,null,"Comments"]
["Spray drift",{"$f":"IF(i_FormVal=\"Granules, fine granules\", 0,(($D22*i_AbsorpInuse1*(1-d_ClothAF))+$D24)*d_ConcAs1*(1-Driftreduction))","v":{"$error":"#N/A"}},null,{"$f":"IF(ISNUMBER(B61),B61/d_BwAdult,0)","v":0},null,null,{"$f":"IF(i_FormVal=\"Granules, fine granules\", 0,(($D22*i_AbsorpInuse2*(1-d_ClothAF))+$D24)*d_ConcAs2*(1-Driftreduction))","v":{"$error":"#N/A"}},null,{"$f":"IF(ISNUMBER(G61),G61/d_BwAdult,0)","v":0},null,null,{"$f":"IF(L41<>0,IF(i_FormVal=\"Granules, fine granules\", 0,(($D22*i_AbsorpInuse3*(1-d_ClothAF))+$D24)*d_ConcAs3*(1-Driftreduction)),0)","v":0},null,{"$f":"IF(ISNUMBER(L61),L61/d_BwAdult,\"\")","v":0},null,null,{"$f":"IF(i_FormVal=\"Granules, fine granules\", 0,(($D22*i_AbsorpInuse4*(1-d_ClothAF))+$D24)*d_ConcAs4*(1-Driftreduction))","v":{"$error":"#N/A"}},null,{"$f":"IF(ISNUMBER(Q61),Q61/d_BwAdult,0)","v":0},null,null,{"$f":"IF(i_FormVal=\"Granules, fine granules\", \"NA for application of granules\",IF(i_AppMeth=\"Upward spraying\",\"the only available values are for the 8 m distance downwind from the middle of the tree trunk, which are assumed to represent 5 m distance from the edge of orchard; the same value is used for 5 and 10 m. \",IF(Driftreduction = 0.5,\"Since drift reducing nozzles are selected a 50% reduction factor has been applied\",\"\")))","v":""}]
["Vapour",{"$f":"i_AbsorpInhalation1*d_AirCon1*d_BreathRAd*d_BwAdult","v":1.6199999999999999E-2},null,{"$f":"IF(ISNUMBER(B62),B62/d_BwAdult,\"\")","v":2.7E-4},null,null,{"$f":"i_AbsorpInhalation2*d_AirCon2*d_BreathRAd*d_BwAdult","v":1.6199999999999999E-2},null,{"$f":"IF(ISNUMBER(G62),G62/d_BwAdult,\"\")","v":2.7E-4},null,null,{"$f":"i_AbsorpInhalation3*d_AirCon3*d_BreathRAd*d_BwAdult","v":1.6199999999999999E-2},null,{"$f":"IF(ISNUMBER(L62),L62/d_BwAdult,\"\")","v":2.7E-4},null,null,{"$f":"i_AbsorpInhalation4*d_AirCon4*d_BreathRAd*d_BwAdult","v":1.6199999999999999E-2},null,{"$f":"IF(ISNUMBER(Q62),Q62/d_BwAdult,\"\")","v":2.7E-4}]
["Surface deposits (dermal)",{"$f":"IF(i_AppMeth=\"In furrow application of granules\", \"\",(i_AppRateAS1/100)*$D28*d_Turf*d_ReTCAd*d_ReExpDur*MAX(i_AbsorpProduct1,i_AbsorpInuse1)*d_MAF1*(1-Driftreduction))","v":{"$error":"#N/A"}},null,{"$f":"IF(ISNUMBER(B63),B63/d_BwAdult,\"\")","v":""},null,null,{"$f":"IF(i_AppMeth=\"In furrow application of granules\", \"\",(i_AppRateAS2/100)*$D28*d_Turf*d_ReTCAd*d_ReExpDur*MAX(i_AbsorpProduct2,i_AbsorpInuse2)*d_MAF2*(1-Driftreduction))","v":{"$error":"#N/A"}},null,{"$f":"IF(ISNUMBER(G63),G63/d_BwAdult,\"\")","v":""},null,null,{"$f":"IF(L41<>0,IF(i_AppMeth=\"In furrow application of granules\", \"\",(i_AppRateAS3/100)*$D28*d_Turf*d_ReTCAd*d_ReExpDur*MAX(i_AbsorpProduct3,i_AbsorpInuse3)*d_MAF3*(1-Driftreduction)),0)","v":0},null,{"$f":"IF(ISNUMBER(L63),L63/d_BwAdult,\"\")","v":0},null,null,{"$f":"IF(i_AppMeth=\"In furrow application of granules\", \"\",(i_AppRateAS4/100)*$D28*d_Turf*d_ReTCAd*d_ReExpDur*MAX(i_AbsorpProduct4,i_AbsorpInuse4)*d_MAF4*(1-Driftreduction))","v":{"$error":"#N/A"}},null,{"$f":"IF(ISNUMBER(Q63),Q63/d_BwAdult,\"\")","v":""},null,null,{"$f":"IF(OR(i_AppMeth=\"In furrow application of granules\", i_AppMeth=\"Manual application of granules\"), \"NA for in furrow or manual application of granules\",IF(Driftreduction = 0.5,\"Since drift reducing nozzles are selected a 50% reduction factor has been applied\",\"\"))","v":""}]
["Entry into treated crops (dermal)",{"$f":"IF(OR(i_FormVal=\"Granules, fine granules\",AND(i_IndoorOutdoor<>\"Outdoor\",$F$4=\"No\")),0, IF(i_CropType=\"Amenity grassland\", (i_AppRateAS1/100)*d_MAF1*d_Turf*d_ReTCAd*d_ExpDurTreatCrop*MAX(i_AbsorpProduct1,i_AbsorpInuse1), (d_TcEntryMeanAd*0.25*d_DFR1*d_MAF1)/1000*MAX(i_AbsorpProduct1,i_AbsorpInuse1)))","v":0},null,{"$f":"IF(ISNUMBER(B64),B64/d_BwAdult,\"\")","v":0},null,null,{"$f":"IF(OR(i_FormVal=\"Granules, fine granules\",AND(i_IndoorOutdoor<>\"Outdoor\",$F$4=\"No\")),0, IF(i_CropType=\"Amenity grassland\", (i_AppRateAS2/100)*d_MAF2*d_Turf*d_ReTCAd*d_ExpDurTreatCrop*MAX(i_AbsorpProduct2,i_AbsorpInuse2), (d_TcEntryMeanAd*0.25*d_DFR2*d_MAF2)/1000*MAX(i_AbsorpProduct2,i_AbsorpInuse2)))","v":0},null,{"$f":"IF(ISNUMBER(G64),G64/d_BwAdult,\"\")","v":0},null,null,{"$f":"IF(OR(i_FormVal=\"Granules, fine granules\",AND(i_IndoorOutdoor<>\"Outdoor\",$F$4=\"No\")),0, IF(i_CropType=\"Amenity grassland\", (i_AppRateAS3/100)*d_MAF3*d_Turf*d_ReTCAd*d_ExpDurTreatCrop*MAX(i_AbsorpProduct3,i_AbsorpInuse3), (d_TcEntryMeanAd*0.25*d_DFR3*d_MAF3)/1000*MAX(i_AbsorpProduct3,i_AbsorpInuse3)))","v":0},null,{"$f":"IF(ISNUMBER(L64),L64/d_BwAdult,\"\")","v":0},null,null,{"$f":"IF(OR(i_FormVal=\"Granules, fine granules\",AND(i_IndoorOutdoor<>\"Outdoor\",$F$4=\"No\")),0, IF(i_CropType=\"Amenity grassland\", (i_AppRateAS4/100)*d_MAF4*d_Turf*d_ReTCAd*d_ExpDurTreatCrop*MAX(i_AbsorpProduct4,i_AbsorpInuse4), (d_TcEntryMeanAd*0.25*d_DFR4*d_MAF4)/1000*MAX(i_AbsorpProduct4,i_AbsorpInuse4)))","v":0},null,{"$f":"IF(ISNUMBER(Q64),Q64/d_BwAdult,\"\")","v":0},null,null,{"$f":"IF(i_FormVal=\"Granules, fine granules\",\"NA for application of granules since calculation is same as for worker exposure and have no worker exposure for application of granules\",\"\")","v":""}]
["1-3 year old child","Systemic exposure [mg a.s./day]",null,"Systemic dose [mg a.s./kg bw/day]",null,null,"Systemic exposure [mg a.s./day]",null,"Systemic dose [mg a.s./kg bw/day]",null,null,"Systemic exposure [mg a.s./day]",null,"Systemic dose [mg a.s./kg bw/day]",null,null,"Systemic exposure [mg a.s./day]",null,"Systemic dose [mg a.s./kg bw/day]",null,null,"Comments"]
["Spray drift",{"$f":"IF(i_FormVal=\"Granules, fine granules\",0,((ResDermSDmeanCh*i_AbsorpInuse1*(1-d_ClothAF))+ResInhalSDmeanCh)*d_ConcAs1*(1-Driftreduction))","v":{"$error":"#N/A"}},null,{"$f":"IF(ISNUMBER(B66), B66/d_BwChild,\"N/A\")","v":"N/A"},null,null,{"$f":"IF(i_FormVal=\"Granules, fine granules\",0,((ResDermSDmeanCh*i_AbsorpInuse2*(1-d_ClothAF))+ResInhalSDmeanCh)*d_ConcAs2*(1-Driftreduction))","v":{"$error":"#N/A"}},null,{"$f":"IF(ISNUMBER(G66), G66/d_BwChild,\"N/A\")","v":"N/A"},null,null,{"$f":"IF(L41<>0,IF(i_FormVal=\"Granules, fine granules\",,((ResDermSDmeanCh*i_AbsorpInuse3*(1-d_ClothAF))+ResInhalSDmeanCh)*d_ConcAs3*(1-Driftreduction)),\"\")","v":""},null,{"$f":"IF(ISNUMBER(L66), L66/d_BwChild,\"\")","v":""},null,null,{"$f":"IF(i_FormVal=\"Granules, fine granules\",0,((ResDermSDmeanCh*i_AbsorpInuse4*(1-d_ClothAF))+ResInhalSDmeanCh)*d_ConcAs4*(1-Driftreduction))","v":{"$error":"#N/A"}},null,{"$f":"IF(ISNUMBER(Q66), Q66/d_BwChild,\"N/A\")","v":"N/A"},null,null,{"$f":"IF(i_FormVal=\"Granules, fine granules\", \"NA for application of granules\",IF(i_AppMeth=\"Upward spraying\",\"the only available values are for the 8 m distance downwind from the middle of the tree trunk, which are assumed to represent 5 m distance from the edge of orchard; the same value is used for 5 and 10 m. \",IF(Driftreduction = 0.5,\"Since drift reducing nozzles are selected a 50% reduction factor has been applied\",\"N/A\")))","v":"N/A"}]
["Vapour",{"$f":"i_AbsorpInhalation1*d_AirCon1*d_BreathRCh*d_BwChild","v":8.0000000000000002E-3},null,{"$f":"IF(ISNUMBER(B67),B67/d_BwChild, \"\")","v":8.0000000000000004E-4},null,null,{"$f":"i_AbsorpInhalation2*d_AirCon2*d_BreathRCh*d_BwChild","v":8.0000000000000002E-3},null,{"$f":"IF(ISNUMBER(G67),G67/d_BwChild, \"\")","v":8.0000000000000004E-4},null,null,{"$f":"i_AbsorpInhalation3*d_AirCon3*d_BreathRCh*d_BwChild","v":8.0000000000000002E-3},null,{"$f":"IF(ISNUMBER(L67),L67/d_BwChild, \"\")","v":8.0000000000000004E-4},null,null,{"$f":"i_AbsorpInhalation4*d_AirCon4*d_BreathRCh*d_BwChild","v":8.0000000000000002E-3},null,{"$f":"IF(ISNUMBER(Q67),Q67/d_BwChild, \"\")","v":8.0000000000000004E-4}]
["Surface deposits"]
["Dermal",{"$f":"IF(i_AppMeth=\"In furrow application of granules\", \"\",(i_AppRateAS1/100)*DrOnSurfaceMean*d_Turf*d_ReTCCh*d_ReExpDur*MAX(i_AbsorpProduct1,i_AbsorpInuse1)*d_MAF1*(1-Driftreduction))","v":{"$error":"#N/A"}},null,{"$f":"IF(ISNUMBER(B69), B69/d_BwChild,\"\")","v":""},null,null,{"$f":"IF(i_AppMeth=\"In furrow application of granules\", \"\",(i_AppRateAS2/100)*$D28*d_Turf*d_ReTCCh*d_ReExpDur*MAX(i_AbsorpProduct2,i_AbsorpInuse2)*d_MAF2*(1-Driftreduction))","v":{"$error":"#N/A"}},null,{"$f":"IF(ISNUMBER(G69), G69/d_BwChild,\"\")","v":""},null,null,{"$f":"IF(L41<>0,IF(i_AppMeth=\"In furrow application of granules\", \"\",(i_AppRateAS3/100)*DrOnSurfaceMean*d_Turf*d_ReTCCh*d_ReExpDur*MAX(i_AbsorpProduct3,i_AbsorpInuse3)*d_MAF3*(1-Driftreduction)),0)","v":0},null,{"$f":"IF(ISNUMBER(L69), L69/d_BwChild,\"\")","v":0},null,null,{"$f":"IF(i_AppMeth=\"In furrow application of granules\", \"\",(i_AppRateAS4/100)*DrOnSurfaceMean*d_Turf*d_ReTCCh*d_ReExpDur*MAX(i_AbsorpProduct4,i_AbsorpInuse4)*d_MAF4*(1-Driftreduction))","v":{"$error":"#N/A"}},null,{"$f":"IF(ISNUMBER(Q69), Q69/d_BwChild,\"N/A\")","v":"N/A"},null,null,{"$f":"IF(i_AppMeth=\"In furrow application of granules\", \"NA for in furrow or manual application of granules\",IF(DrOnSurface75=\"na\",\"NA since upward spraying applications are not expected for this crop type\",IF(Driftreduction = 0.5,\"Since drift reducing nozzles are selected a 50% reduction factor has been applied\",\"\")))","v":{"$error":"#N/A"}}]
["Hand to mouth",{"$f":"IF(i_AppMeth=\"In furrow application of granules\",\"\",(i_AppRateAS1/100)*$D28*d_Turf*d_SalExt*d_AreaHM*d_ReFreqHM*d_ReExpDur*i_AbsorpOralInuse1*d_MAF1*(1-Driftreduction))","v":{"$error":"#N/A"}},null,{"$f":"IF(ISNUMBER(B70), B70/d_BwChild,\"\")","v":""},null,null,{"$f":"IF(i_AppMeth=\"In furrow application of granules\",\"\",(i_AppRateAS2/100)*DrOnSurfaceMean*d_Turf*d_SalExt*d_AreaHM*d_ReFreqHM*d_ReExpDur*i_AbsorpOralInuse2*d_MAF2*(1-Driftreduction))","v":{"$error":"#N/A"}},null,{"$f":"IF(ISNUMBER(G70), G70/d_BwChild,\"\")","v":""},null,null,{"$f":"IF(L41<>0,IF(i_AppMeth=\"In furrow application of granules\",\"\",(i_AppRateAS3/100)*DrOnSurfaceMean*d_Turf*d_SalExt*d_AreaHM*d_ReFreqHM*d_ReExpDur*i_AbsorpOralInuse3*d_MAF3*(1-Driftreduction)),0)","v":0},null,{"$f":"IF(ISNUMBER(L70), L70/d_BwChild,\"\")","v":0},null,null,{"$f":"IF(i_AppMeth=\"In furrow application of granules\",\"\",(i_AppRateAS4/100)*DrOnSurfaceMean*d_Turf*d_SalExt*d_AreaHM*d_ReFreqHM*d_ReExpDur*i_AbsorpOralInuse4*d_MAF4*(1-Driftreduction))","v":{"$error":"#N/A"}},null,{"$f":"IF(ISNUMBER(Q70), Q70/d_BwChild,\"N/A\")","v":"N/A"}]
["Object to mouth",{"$f":"IF(i_AppMeth=\"In furrow application of granules\",\"\",(i_AppRateAS1/100)*$D28*d_DRP*d_MouthGrass*i_AbsorpOralInuse1*d_MAF1*(1-Driftreduction))","v":{"$error":"#N/A"}},null,{"$f":"IF(ISNUMBER(B71), B71/d_BwChild,\"\")","v":""},null,null,{"$f":"IF(i_AppMeth=\"In furrow application of granules\",\"\",(i_AppRateAS2/100)*$D28*d_DRP*d_MouthGrass*i_AbsorpOralInuse2*d_MAF2*(1-Driftreduction))","v":{"$error":"#N/A"}},null,{"$f":"IF(ISNUMBER(G71), G71/d_BwChild,\"\")","v":""},null,null,{"$f":"IF(L41<>0,IF(i_AppMeth=\"In furrow application of granules\",\"\",(i_AppRateAS3/100)*$D28*d_DRP*d_MouthGrass*i_AbsorpOralInuse3*d_MAF3*(1-Driftreduction)),0)","v":0},null,{"$f":"IF(ISNUMBER(L71), L71/d_BwChild,\"\")","v":0},null,null,{"$f":"IF(i_AppMeth=\"In furrow application of granules\",\"\",(i_AppRateAS4/100)*$D28*d_DRP*d_MouthGrass*i_AbsorpOralInuse4*d_MAF4*(1-Driftreduction))","v":{"$error":"#N/A"}},null,{"$f":"IF(ISNUMBER(Q71), Q71/d_BwChild,\"N/A\")","v":"N/A"}]
["Entry into treated crops"]
["Dermal",{"$f":"IF(OR(i_FormVal=\"Granules, fine granules\",AND(i_IndoorOutdoor<>\"Outdoor\",$F$4=\"No\")),0, IF(i_CropType=\"Amenity grassland\", (i_AppRateAS1/100)*d_MAF1*d_Turf*d_ReTCCh*d_ExpDurTreatCrop*MAX(i_AbsorpProduct1,i_AbsorpInuse1),(d_TcEntryMeanCh*0.25*d_DFR1*d_MAF1)/1000*MAX(i_AbsorpProduct1,i_AbsorpInuse1)))","v":0},null,{"$f":"IF(ISNUMBER(B73), B73/d_BwChild,0)","v":0},null,null,{"$f":"IF(OR(i_FormVal=\"Granules, fine granules\",AND(i_IndoorOutdoor<>\"Outdoor\",$F$4=\"No\")),0, IF(i_CropType=\"Amenity grassland\", (i_AppRateAS2/100)*d_MAF2*d_Turf*d_ReTCCh*d_ExpDurTreatCrop*MAX(i_AbsorpProduct2,i_AbsorpInuse2),(d_TcEntryMeanCh*0.25*d_DFR2*d_MAF2)/1000*MAX(i_AbsorpProduct2,i_AbsorpInuse2)))","v":0},null,{"$f":"IF(ISNUMBER(G73), G73/d_BwChild,0)","v":0},null,null,{"$f":"IF(OR(i_FormVal=\"Granules, fine granules\",AND(i_IndoorOutdoor<>\"Outdoor\",$F$4=\"No\")),0, IF(i_CropType=\"Amenity grassland\", (i_AppRateAS3/100)*d_MAF3*d_Turf*d_ReTCCh*d_ExpDurTreatCrop*MAX(i_AbsorpProduct3,i_AbsorpInuse3),(d_TcEntryMeanCh*0.25*d_DFR3*d_MAF3)/1000*MAX(i_AbsorpProduct3,i_AbsorpInuse3)))","v":0},null,{"$f":"IF(ISNUMBER(L73), L73/d_BwChild,\"\")","v":0},null,null,{"$f":"IF(OR(i_FormVal=\"Granules, fine granules\",AND(i_IndoorOutdoor<>\"Outdoor\",$F$4=\"No\")),0, IF(i_CropType=\"Amenity grassland\", (i_AppRateAS4/100)*d_MAF4*d_Turf*d_ReTCCh*d_ExpDurTreatCrop*MAX(i_AbsorpProduct4,i_AbsorpInuse4),(d_TcEntryMeanCh*0.25*d_DFR4*d_MAF4)/1000*MAX(i_AbsorpProduct4,i_AbsorpInuse4)))","v":0},null,{"$f":"IF(ISNUMBER(Q73), Q73/d_BwChild,0)","v":0},null,null,{"$f":"IF(i_FormVal=\"Granules, fine granules\",\"NA for application of granules\",\"\")","v":""}]
["Hand to mouth",{"$f":"IF(OR(i_FormVal=\"Granules, fine granules\",AND(i_IndoorOutdoor<>\"Outdoor\",$F$4=\"No\")),0,IF(i_CropType=\"Amenity grassland\",(i_AppRateAS1/100)*d_MAF1*1*d_Turf*d_SalExt*d_AreaHM*d_ReFreqHM*d_ExpDurTreatCrop*i_AbsorpOralInuse1,))","v":0},null,{"$f":"IF(ISNUMBER(B74), B74/d_BwChild,\"\")","v":0},null,null,{"$f":"IF(OR(i_FormVal=\"Granules, fine granules\",AND(i_IndoorOutdoor<>\"Outdoor\",$F$4=\"No\")),0,IF(i_CropType=\"Amenity grassland\",(i_AppRateAS2/100)*d_MAF2*1*d_Turf*d_SalExt*d_AreaHM*d_ReFreqHM*d_ExpDurTreatCrop*i_AbsorpOralInuse2,0))","v":0},null,{"$f":"IF(ISNUMBER(G74), G74/d_BwChild,\"\")","v":0},null,null,{"$f":"IF(OR(i_FormVal=\"Granules, fine granules\",AND(i_IndoorOutdoor<>\"Outdoor\",$F$4=\"No\")),0,IF(L41<>0,IF(i_CropType=\"Amenity grassland\",(i_AppRateAS3/100)*d_MAF3*1*d_Turf*d_SalExt*d_AreaHM*d_ReFreqHM*d_ExpDurTreatCrop*i_AbsorpOralInuse3,0),0))","v":0},null,{"$f":"IF(ISNUMBER(L74), L74/d_BwChild,\"\")","v":0},null,null,{"$f":"IF(OR(i_FormVal=\"Granules, fine granules\",AND(i_IndoorOutdoor<>\"Outdoor\",$F$4=\"No\")),0,IF(i_CropType=\"Amenity grassland\",(i_AppRateAS4/100)*d_MAF4*1*d_Turf*d_SalExt*d_AreaHM*d_ReFreqHM*d_ExpDurTreatCrop*i_AbsorpOralInuse4,0))","v":0},null,{"$f":"IF(ISNUMBER(Q74), Q74/d_BwChild,0)","v":0},null,null,{"$f":"IF(i_CropType=\"Amenity grassland\",\"\",\"Considered only for application on grassland and lawns and for application on golf course, turf or other sports lawns. \")","v":"Considered only for application on grassland and lawns and for application on golf course, turf or other sports lawns. "}]
["Object to mouth",{"$f":"IF(OR(i_FormVal=\"Granules, fine granules\",AND(i_IndoorOutdoor<>\"Outdoor\",$F$4=\"No\")),0,IF(i_CropType=\"Amenity grassland\",(i_AppRateAS1/100)*1*d_DRP*d_MouthGrass*i_AbsorpOralInuse1*d_MAF1,0))","v":0},null,{"$f":"IF(ISNUMBER(B75), B75/d_BwChild,\"\")","v":0},null,null,{"$f":"IF(OR(i_FormVal=\"Granules, fine granules\",AND(i_IndoorOutdoor<>\"Outdoor\",$F$4=\"No\")),0,IF(i_CropType=\"Amenity grassland\",(i_AppRateAS2/100)*1*d_DRP*d_MouthGrass*i_AbsorpOralInuse2*d_MAF2,0))","v":0},null,{"$f":"IF(ISNUMBER(G75), G75/d_BwChild,\"\")","v":0},null,null,{"$f":"IF(OR(i_FormVal=\"Granules, fine granules\",AND(i_IndoorOutdoor<>\"Outdoor\",$F$4=\"No\")),0,IF(L41<>0,IF(i_CropType=\"Amenity grassland\",(i_AppRateAS3/100)*1*d_DRP*d_MouthGrass*i_AbsorpOralInuse3*d_MAF3,0),0))","v":0},null,{"$f":"IF(ISNUMBER(L75), L75/d_BwChild,\"\")","v":0},null,null,{"$f":"IF(OR(i_FormVal=\"Granules, fine granules\",AND(i_IndoorOutdoor<>\"Outdoor\",$F$4=\"No\")),0,IF(i_CropType=\"Amenity grassland\",(i_AppRateAS4/100)*1*d_DRP*d_MouthGrass*i_AbsorpOralInuse4*d_MAF4,0))","v":0},null,{"$f":"IF(ISNUMBER(Q75), Q75/d_BwChild,0)","v":0}]

{"sheet":"Bystander","index":19,"n_rows":51,"n_cols":21,"rows_kept":51,"cut":false,"hidden":false,"merged":[[37,5,37,6],[37,7,37,8],[15,9,15,12],[24,9,24,12],[24,5,24,8],[35,13,35,14],[36,7,36,8],[14,2,14,4],[42,11,42,12],[38,3,38,4],[39,1,39,2],[39,3,39,4],[36,1,36,2],[36,3,36,4],[37,1,37,2],[37,3,37,4],[38,1,38,2],[38,5,38,6],[35,5,35,6],[36,5,36,6],[14,9,14,12],[16,9,16,12],[39,7,39,8],[39,9,39,10],[11,0,11,1],[43,15,43,16],[37,9,37,10],[37,11,37,12],[38,9,38,10],[36,9,36,10],[39,13,39,14],[39,15,39,16],[41,11,41,12],[42,9,42,10],[11,2,11,4],[35,7,35,8],[34,5,34,8],[34,9,34,12],[37,15,37,16],[34,13,34,16],[35,9,35,10],[35,11,35,12],[15,5,15,8],[40,1,40,2],[43,1,43,2],[43,3,43,4],[35,1,35,2],[35,3,35,4],[45,7,45,8],[46,5,46,6],[40,9,40,10],[41,9,41,10],[40,7,40,8],[40,5,40,6],[45,9,45,10],[41,7,41,8],[42,7,42,8],[43,7,43,8],[43,9,43,10],[41,5,41,6],[49,3,49,4],[44,1,44,2],[44,3,44,4],[40,3,40,4],[42,5,42,6],[47,5,47,6],[43,5,43,6],[39,5,39,6],[41,1,41,2],[41,3,41,4],[42,1,42,2],[42,3,42,4],[50,5,50,6],[48,5,48,6],[49,5,49,6],[45,5,45,6],[44,7,44,8],[49,7,49,8],[44,5,44,6],[50,9,50,10],[50,1,50,2],[50,3,50,4],[50,7,50,8],[47,7,47,8],[48,7,48,8],[46,7,46,8],[44,9,44,10],[47,1,47,2],[47,3,47,4],[48,1,48,2],[48,3,48,4],[45,1,45,2],[45,3,45,4],[46,1,46,2],[46,3,46,4],[49,1,49,2],[47,17,47,19],[48,17,48,19],[49,17,49,19],[50,17,50,19],[46,13,46,14],[47,9,47,10],[47,11,47,12],[47,15,47,16],[48,13,48,14],[48,15,48,16],[46,15,46,16],[47,13,47,14],[46,9,46,10],[46,11,46,12],[50,11,50,12],[48,9,48,10],[48,11,48,12],[49,9,49,10],[49,11,49,12],[50,13,50,14],[44,11,44,12],[44,17,44,19],[45,17,45,19],[46,17,46,19],[42,15,42,16],[43,13,43,14],[42,13,42,14],[45,11,45,12],[39,17,39,19],[40,11,40,12],[43,11,43,12],[40,13,40,14],[40,15,40,16],[39,11,39,12],[12,13,12,16],[15,13,15,16],[24,13,24,16],[38,7,38,8],[40,17,40,19],[41,17,41,19],[42,17,42,19],[43,17,43,19],[36,11,36,12],[38,13,38,14],[38,15,38,16],[37,13,37,14],[38,11,38,12],[36,15,36,16],[24,17,24,20],[34,17,35,19],[36,17,36,19],[37,17,37,19],[38,17,38,19],[26,17,27,20],[30,17,31,20],[10,9,10,12],[11,9,11,12],[13,9,13,12],[12,9,12,12],[6,13,6,16],[16,13,16,16],[14,13,14,16],[50,15,50,16],[49,13,49,14],[49,15,49,16],[7,13,7,16],[8,13,8,16],[9,13,9,16],[35,15,35,16],[36,13,36,14],[41,13,41,14],[41,15,41,16],[44,13,44,14],[44,15,44,16],[45,13,45,14],[45,15,45,16],[10,13,10,16],[11,13,11,16],[13,13,13,16],[6,9,6,12],[7,9,7,12],[8,9,8,12],[9,9,9,12],[8,2,8,4],[9,2,9,4],[6,2,6,4],[7,2,7,4],[7,5,7,8],[8,5,8,8],[34,1,34,4],[10,5,10,8],[10,2,10,4],[24,1,24,4],[1,1,1,2],[7,0,7,1],[10,0,10,1],[9,0,9,1],[8,0,8,1],[22,0,22,1],[21,0,21,1],[12,2,12,4],[12,5,12,8],[6,5,6,8],[13,0,13,1],[16,2,16,4],[16,5,16,8],[15,2,15,4],[9,5,9,8],[12,0,12,1],[11,5,11,8],[14,5,14,8],[13,5,13,8],[13,2,13,4]]}
[{"$f":"IF(NOT(i_IndoorOutdoor=\"Outdoor\"), \"Bystander exposure for \"&i_ProductName&\" - NA for indoor applications\",\"Bystander exposure for \"&i_ProductName)","v":"Bystander exposure for  - NA for indoor applications"}]
["Crop type",{"$f":"i_CropType&\",  Season: \"&i_Season","v":",  Season: not relevant"},null,"Crop group",{"$f":"INDEX(ay_CropType,MATCH(i_CropType,key_CropType,0),8)","v":{"$error":"#N/A"}}]
["Application method",{"$f":"i_AppMeth","v":0}]
["Application equipment",{"$f":"i_AppEquip","v":0},null,"Consider re-entry for indoor uses?","No",null,null,null,null,null,null,null,null,null,null,null,null,"i_AppEquip"]
["Formulation type",{"$f":"i_FormVal","v":0},null,null,null,null,null,null,null,null,null,null,null,null,null,null,null,"i_FormVal"]
["Buffer strip",{"$f":"i_Buffer","v":0},"m",null,null,null,null,null,null,null,null,null,null,null,null,null,null,"i_Buffer"]
[null,null,{"$f":"i_SubstName1","v":0},null,null,{"$f":"i_SubstName2","v":0},null,null,null,{"$f":"i_SubstName3","v":0},null,null,null,{"$f":"i_SubstName4","v":0}]
["Application rate of the a.s. (kg a.s./ha)",null,{"$f":"i_AppRateAS1","v":0},null,null,{"$f":"i_AppRateAS2","v":0},null,null,null,{"$f":"i_AppRateAS3","v":0},null,null,null,{"$f":"i_AppRateAS4","v":0},null,null,null,"i_AppRateAS"]
[{"$f":"\"Concentration of active substance (in-use dilution for liquid applications)\"&\" \"&IF(i_FormVal=\"Granules, fine granules\",\"(kg a.s./kg)\",\"(g a.s./L)\")","v":"Concentration of active substance (in-use dilution for liquid applications) (g a.s./L)"},null,{"$f":"d_ConcAs1","v":{"$error":"#DIV/0!"}},null,null,{"$f":"d_ConcAs2","v":{"$error":"#DIV/0!"}},null,null,null,{"$f":"d_ConcAs3","v":{"$error":"#DIV/0!"}},null,null,null,{"$f":"d_ConcAs4","v":{"$error":"#DIV/0!"}},null,null,null,"d_ConcAS"]
["Dermal absorption of product",null,{"$f":"i_AbsorpProduct1","v":0},null,null,{"$f":"i_AbsorpProduct2","v":0},null,null,null,{"$f":"i_AbsorpProduct3","v":0},null,null,null,{"$f":"i_AbsorpProduct4","v":0},null,null,null,"i_AbsorpProduct"]
["Dermal absorption of in-use dilution",null,{"$f":"i_AbsorpInuse1","v":0},null,null,{"$f":"i_AbsorpInuse2","v":0},null,null,null,{"$f":"i_AbsorpInuse3","v":0},null,null,null,{"$f":"i_AbsorpInuse4","v":0},null,null,null,"i_AbsorpInuse"]
["Oral absorption",null,{"$f":"IF(i_AbsorpOralInuse1>0.8,1,i_AbsorpOralInuse1)","v":1},null,null,{"$f":"IF(i_AbsorpOralInuse2>0.8,1,i_AbsorpOralInuse2)","v":1},null,null,null,{"$f":"IF(i_AbsorpOralInuse3>0.8,1,i_AbsorpOralInuse3)","v":1},null,null,null,{"$f":"IF(i_AbsorpOralInuse4>0.8,1,i_AbsorpOralInuse4)","v":1},null,null,null,"i_AbsorpOralInuse"]
["Inhalation absorption",null,{"$f":"i_AbsorpInhalation1","v":1},null,null,{"$f":"i_AbsorpInhalation2","v":1},null,null,null,{"$f":"i_AbsorpInhalation3","v":1},null,null,null,{"$f":"i_AbsorpInhalation4","v":1},null,null,null,"i_AbsorpOralInuse"]
[{"$f":"IF(i_CropType=\"Amenity grassland\",\"Turf transferable residue (i_AppRate*d_Turf)\",\"Dislodgeable foliar residue (i_AppRate*i_DFR)\")&\" (μg a.s./cm²)\"","v":"Dislodgeable foliar residue (i_AppRate*i_DFR) (μg a.s./cm²)"},null,{"$f":"IF(i_CropType=\"Amenity grassland\",d_TTR1,d_DFR1)","v":0},null,null,{"$f":"IF(i_CropType=\"Amenity grassland\",d_TTR2,d_DFR2)","v":0},null,null,null,{"$f":"IF(i_CropType=\"Amenity grassland\",d_TTR3,d_DFR3)","v":0},null,null,null,{"$f":"IF(i_CropType=\"Amenity grassland\",d_TTR4,d_DFR4)","v":0},null,null,null,{"$f":"IF(LEFT(A14,4)=\"Turf\",\"d_TTR\",\"d_DFR\")","v":"d_DFR"}]
["Vapour pressure of in-use dilution",null,{"$f":"i_Volat1","v":"low volatile substances having a vapour pressure of < 0.005 Pa"},null,null,{"$f":"i_Volat2","v":"low volatile substances having a vapour pressure of < 0.005 Pa"},null,null,null,{"$f":"i_Volat3","v":"low volatile substances having a vapour pressure of < 0.005 Pa"},null,null,null,{"$f":"i_Volat4","v":"low volatile substances having a vapour pressure of < 0.005 Pa"},null,null,null,"i_Volat"]
["Saturated vapour concentration (mg/m³)",null,{"$f":"d_SVC1","v":"N/A"},null,null,{"$f":"d_SVC2","v":"N/A"},null,null,null,{"$f":"d_SVC3","v":"N/A"},null,null,null,{"$f":"d_SVC4","v":"N/A"},null,null,null,"d_SVC"]
["Concentration in air  (mg/m³)",null,{"$f":"MIN(d_SVC1,IF(i_Volat1='Look up'!A22,d_AirConNonVol,d_AirConVol))","v":1E-3},null,null,{"$f":"MIN(d_SVC2,IF(i_Volat2='Look up'!A22,d_AirConNonVol,d_AirConVol))","v":1E-3},null,null,null,{"$f":"MIN(d_SVC3,IF(i_Volat3='Look up'!A22,d_AirConNonVol,d_AirConVol))","v":1E-3},null,null,null,{"$f":"MIN(d_SVC4,IF(i_Volat4='Look up'!A22,d_AirConNonVol,d_AirConVol))","v":1E-3},null,null,null,"d_AirCon"]
["Bystander dermal spray drift exposure - adult",null,{"$f":"IF(i_FormVal=\"Granules, fine granules\",\"NA\",INDEX(ay_BySpray, MATCH(i_AppMeth&i_Buffer, key_BySpray, 0), 2))","v":{"$error":"#N/A"}},"mL spray dilution/person"]
["Bystander dermal spray drift exposure - child",null,{"$f":"IF(i_FormVal=\"Granules, fine granules\",\"NA\",INDEX(ay_BySpray, MATCH(i_AppMeth&i_Buffer, key_BySpray, 0), 3))","v":{"$error":"#N/A"}},"mL spray dilution/person"]
["Bystander inhal. spray drift exposure - adult",null,{"$f":"IF(i_FormVal=\"Granules, fine granules\",\"NA\",INDEX(ay_BySpray, MATCH(i_AppMeth&i_Buffer, key_BySpray, 0), 4))","v":{"$error":"#N/A"}},"mL spray dilution/person"]
["Bystander inhal. spray drift exposure - child",null,{"$f":"IF(i_FormVal=\"Granules, fine granules\",\"NA\",INDEX(ay_BySpray, MATCH(i_AppMeth&i_Buffer, key_BySpray, 0), 5))","v":{"$error":"#N/A"}},"mL spray dilution/person"]
["Drift reduction",null,{"$f":"Driftreduction","v":0}]
["Drift percentage on surface (90th percentile)",null,{"$f":"IF(AND(i_FormVal=\"Granules, fine granules\",i_AppMeth<>\"In furrow application of granules\"),0.03,IF(i_AppMeth=\"In furrow application of granules\",\"NA\",INDEX(ay_ByCropType, (MATCH(INDEX(ay_CropType,MATCH(i_CropType,key_CropType,0),8)&i_Season&i_Buffer,key_ByCropType,0)),2)))","v":{"$error":"#N/A"}}]
[]
["1. Total ",{"$f":"i_SubstName1","v":0},null,null,null,{"$f":"i_SubstName2","v":0},null,null,null,{"$f":"i_SubstName3","v":0},null,null,null,{"$f":"i_SubstName4","v":0},null,null,null,"Combined"]
["Adult","Spray drift (95th percentile)","Vapour (95th percentile)","Surface deposits (95th percentile)","Entry into treated crops (95th percentile)","Spray drift (95th percentile)","Vapour (95th percentile)","Surface deposits (95th percentile)","Entry into treated crops (95th percentile)","Spray drift (95th percentile)","Vapour (95th percentile)","Surface deposits (95th percentile)","Entry into treated crops (95th percentile)","Spray drift (95th percentile)","Vapour (95th percentile)","Surface deposits (95th percentile)","Entry into treated crops (95th percentile)","Spray drift (95th percentile)","Vapour (95th percentile)","Surface deposits (95th percentile)","Entry into treated crops (95th percentile)"]
["Total systemic exposure (mg a.s./day)",{"$f":"B37","v":{"$error":"#N/A"}},{"$f":"B38","v":1.6199999999999999E-2},{"$f":"B39","v":{"$error":"#N/A"}},{"$f":"B40","v":0},{"$f":"F37","v":{"$error":"#N/A"}},{"$f":"F38","v":1.6199999999999999E-2},{"$f":"F39","v":{"$error":"#N/A"}},{"$f":"F40","v":0},{"$f":"J37","v":{"$error":"#N/A"}},{"$f":"J38","v":1.6199999999999999E-2},{"$f":"J39","v":{"$error":"#N/A"}},{"$f":"J40","v":0},{"$f":"N37","v":{"$error":"#N/A"}},{"$f":"N38","v":1.6199999999999999E-2},{"$f":"N39","v":{"$error":"#N/A"}},{"$f":"N40","v":0},"Hazard Index"]
["Total systemic dose [mg/kg bw/day]",{"$f":"D37","v":0},{"$f":"D38","v":2.7E-4},{"$f":"D39","v":""},{"$f":"D40","v":0},{"$f":"H37","v":0},{"$f":"H38","v":2.7E-4},{"$f":"H39","v":""},{"$f":"H40","v":0},{"$f":"L37","v":0},{"$f":"L38","v":2.7E-4},{"$f":"L39","v":""},{"$f":"L40","v":0},{"$f":"P37","v":0},{"$f":"P38","v":2.7E-4},{"$f":"P39","v":""},{"$f":"P40","v":0}]
["% of AAOEL",{"$f":"IFERROR(B28/i_AAOEL1,0)","v":0},{"$f":"IFERROR(C28/i_AAOEL1,0)","v":0},{"$f":"IFERROR(D28/i_AAOEL1,0)","v":0},{"$f":"IFERROR(E28/i_AAOEL1,0)","v":0},{"$f":"IFERROR(F28/i_AAOEL2,0)","v":0},{"$f":"IFERROR(G28/i_AAOEL2,0)","v":0},{"$f":"IFERROR(H28/i_AAOEL2,0)","v":0},{"$f":"IFERROR(I28/i_AAOEL2,0)","v":0},{"$f":"IFERROR(J28/i_AAOEL3,0)","v":0},{"$f":"IFERROR(K28/i_AAOEL3,0)","v":0},{"$f":"IFERROR(L28/i_AAOEL3,0)","v":0},{"$f":"IFERROR(M28/i_AAOEL3,0)","v":0},{"$f":"IFERROR(N28/i_AAOEL4,0)","v":0},{"$f":"IFERROR(O28/i_AAOEL4,0)","v":0},{"$f":"IFERROR(P28/i_AAOEL4,0)","v":0},{"$f":"IFERROR(Q28/i_AAOEL4,0)","v":0},{"$f":"IF(COUNTA('Data entry'!D27:G27)<2,\"N/A\",FIXED(B29+F29+J29+N29,3))","v":"N/A"},{"$f":"IF(COUNTA('Data entry'!D27:G27)<2,\"N/A\",FIXED(C29+G29+K29+O29,3))","v":"N/A"},{"$f":"IF(COUNTA('Data entry'!D27:G27)<2,\"N/A\",FIXED(D29+H29+L29+P29,3))","v":"N/A"},{"$f":"IF(COUNTA('Data entry'!D27:G27)<2,\"N/A\",FIXED(E29+I29+M29+Q29,3))","v":"N/A"}]
["1-3 year old child","Spray drift (95th percentile)","Vapour (95th percentile)","Surface deposits (95th percentile)","Entry into treated crops (95th percentile)","Spray drift (95th percentile)","Vapour (95th percentile)","Surface deposits (95th percentile)","Entry into treated crops (95th percentile)","Spray drift (95th percentile)","Vapour (95th percentile)","Surface deposits (95th percentile)","Entry into treated crops (95th percentile)","Spray drift (95th percentile)","Vapour (95th percentile)","Surface deposits (95th percentile)","Entry into treated crops (95th percentile)","Spray drift (95th percentile)","Vapour (95th percentile)","Surface deposits (95th percentile)","Entry into treated crops (95th percentile)"]
["Total systemic exposure (mg a.s./day)",{"$f":"B42","v":{"$error":"#N/A"}},{"$f":"B43","v":8.0000000000000002E-3},{"$f":"B45+B46+B47","v":{"$error":"#N/A"}},{"$f":"B49+B50+B51","v":0},{"$f":"F42","v":{"$error":"#N/A"}},{"$f":"F43","v":8.0000000000000002E-3},{"$f":"F45+F46+F47","v":{"$error":"#N/A"}},{"$f":"F49+F50+F51","v":0},{"$f":"J42","v":{"$error":"#N/A"}},{"$f":"J43","v":8.0000000000000002E-3},{"$f":"J45+J46+J47","v":{"$error":"#N/A"}},{"$f":"J49+J50+J51","v":0},{"$f":"N42","v":{"$error":"#N/A"}},{"$f":"N43","v":8.0000000000000002E-3},{"$f":"N45+N46+N47","v":{"$error":"#N/A"}},{"$f":"N49+N50+N51","v":0},"Hazard Index"]
["Total systemic dose [mg/kg bw/day]",{"$f":"D42","v":0},{"$f":"D43","v":8.0000000000000004E-4},{"$f":"D45+D46+D47","v":{"$error":"#VALUE!"}},{"$f":"D49+D50+D51","v":0},{"$f":"H42","v":0},{"$f":"H43","v":8.0000000000000004E-4},{"$f":"H45+H46+H47","v":{"$error":"#VALUE!"}},{"$f":"H49+H50+H51","v":0},{"$f":"L42","v":0},{"$f":"L43","v":8.0000000000000004E-4},{"$f":"L45+L46+L47","v":{"$error":"#VALUE!"}},{"$f":"L49+L50+L51","v":0},{"$f":"P42","v":0},{"$f":"P43","v":8.0000000000000004E-4},{"$f":"P45+P46+P47","v":{"$error":"#VALUE!"}},{"$f":"P49+P50+P51","v":0}]
["% of AAOEL",{"$f":"IFERROR(B32/i_AAOEL1,0)","v":0},{"$f":"IFERROR(C32/i_AAOEL1,0)","v":0},{"$f":"IFERROR(D32/i_AAOEL1,0)","v":0},{"$f":"IFERROR(E32/i_AAOEL1,0)","v":0},{"$f":"IFERROR(F32/i_AAOEL2,0)","v":0},{"$f":"IFERROR(G32/i_AAOEL2,0)","v":0},{"$f":"IFERROR(H32/i_AAOEL2,0)","v":0},{"$f":"IFERROR(I32/i_AAOEL2,0)","v":0},{"$f":"IFERROR(J32/i_AAOEL3,0)","v":0},{"$f":"IFERROR(K32/i_AAOEL3,0)","v":0},{"$f":"IFERROR(L32/i_AAOEL3,0)","v":0},{"$f":"IFERROR(M32/i_AAOEL3,0)","v":0},{"$f":"IFERROR(N32/i_AAOEL4,0)","v":0},{"$f":"IFERROR(O32/i_AAOEL4,0)","v":0},{"$f":"IFERROR(P32/i_AAOEL4,0)","v":0},{"$f":"IFERROR(Q32/i_AAOEL4,0)","v":0},{"$f":"IF(COUNTA('Data entry'!D27:G27)<2,\"N/A\",FIXED(B33+F33+J33+N33,3))","v":"N/A"},{"$f":"IF(COUNTA('Data entry'!D27:G27)<2,\"N/A\",FIXED(C33+G33+K33+O33,3))","v":"N/A"},{"$f":"IF(COUNTA('Data entry'!D27:G27)<2,\"N/A\",FIXED(D33+H33+L33+P33,3))","v":"N/A"},{"$f":"IF(COUNTA('Data entry'!D27:G27)<2,\"N/A\",FIXED(E33+I33+M33+Q33,3))","v":"N/A"}]
[]
["2. Details",{"$f":"i_SubstName1","v":0},null,null,null,{"$f":"i_SubstName2","v":0},null,null,null,{"$f":"i_SubstName3","v":0},null,null,null,{"$f":"i_SubstName4","v":0},null,null,null,"Comments"]
["Adult","Systemic exposure [mg a.s./day]",null,"Systemic dose [mg a.s./kg bw/day]",null,"Systemic exposure [mg a.s./day]",null,"Systemic dose [mg a.s./kg bw/day]",null,"Systemic exposure [mg a.s./day]",null,"Systemic dose [mg a.s./kg bw/day]",null,"Systemic exposure [mg a.s./day]",null,"Systemic dose [mg a.s./kg bw/day]"]
["Spray drift",{"$f":"IF(i_FormVal=\"Granules, fine granules\",0,(($C18*i_AbsorpInuse1*(1-d_ClothAF))+$C20)*d_ConcAs1*(1-Driftreduction))","v":{"$error":"#N/A"}},null,{"$f":"IF(ISNUMBER(B37),B37/d_BwAdult,0)","v":0},null,{"$f":"IF(i_FormVal=\"Granules, fine granules\", 0,(($C18*i_AbsorpInuse2*(1-d_ClothAF))+$C20)*d_ConcAs2*(1-Driftreduction))","v":{"$error":"#N/A"}},null,{"$f":"IF(ISNUMBER(F37),F37/d_BwAdult,0)","v":0},null,{"$f":"IF(i_FormVal=\"Granules, fine granules\", 0,(($C18*i_AbsorpInuse3*(1-d_ClothAF))+$C20)*d_ConcAs3*(1-Driftreduction))","v":{"$error":"#N/A"}},null,{"$f":"IF(ISNUMBER(J37),J37/d_BwAdult,0)","v":0},null,{"$f":"IF(i_FormVal=\"Granules, fine granules\", 0,(($C18*i_AbsorpInuse4*(1-d_ClothAF))+$C20)*d_ConcAs4*(1-Driftreduction))","v":{"$error":"#N/A"}},null,{"$f":"IF(ISNUMBER(N37),N37/d_BwAdult,0)","v":0},null,{"$f":"IF(i_FormVal=\"Granules, fine granules\", \"NA for application of granules\",IF(i_AppMeth=\"Upward spraying\",\"the only available values are for the 8 m distance downwind from the middle of the tree trunk, which are assumed to represent 5 m distance from the edge of orchard; the same value is used for 5 and 10 m. \",IF(Driftreduction = 0.5,\"Since drift reducing nozzles are selected a 50% reduction factor has been applied\",\"\")))","v":""}]
["Vapour",{"$f":"i_AbsorpInhalation1*d_AirCon1*d_BreathRAd*d_BwAdult","v":1.6199999999999999E-2},null,{"$f":"IF(ISNUMBER(B38),B38/d_BwAdult,\"\")","v":2.7E-4},null,{"$f":"i_AbsorpInhalation2*d_AirCon2*d_BreathRAd*d_BwAdult","v":1.6199999999999999E-2},null,{"$f":"IF(ISNUMBER(F38),F38/d_BwAdult,\"\")","v":2.7E-4},null,{"$f":"i_AbsorpInhalation3*d_AirCon3*d_BreathRAd*d_BwAdult","v":1.6199999999999999E-2},null,{"$f":"IF(ISNUMBER(J38),J38/d_BwAdult,\"\")","v":2.7E-4},null,{"$f":"i_AbsorpInhalation4*d_AirCon4*d_BreathRAd*d_BwAdult","v":1.6199999999999999E-2},null,{"$f":"IF(ISNUMBER(N38),N38/d_BwAdult,\"\")","v":2.7E-4}]
["Surface deposits (dermal)",{"$f":"IF(i_AppMeth=\"In furrow application of granules\", \"\",(i_AppRateAS1/100)*$C23*d_Turf*d_ByTCAd*d_ByExpDur*MAX(i_AbsorpProduct1,i_AbsorpInuse1)*d_MAF1*(1-Driftreduction))","v":{"$error":"#N/A"}},null,{"$f":"IF(ISNUMBER(B39),B39/d_BwAdult,\"\")","v":""},null,{"$f":"IF(i_AppMeth=\"In furrow application of granules\", \"\",(i_AppRateAS2/100)*$C23*d_Turf*d_ByTCAd*d_ByExpDur*MAX(i_AbsorpProduct2,i_AbsorpInuse2)*d_MAF2*(1-Driftreduction))","v":{"$error":"#N/A"}},null,{"$f":"IF(ISNUMBER(F39),F39/d_BwAdult,\"\")","v":""},null,{"$f":"IF(i_AppMeth=\"In furrow application of granules\", \"\",(i_AppRateAS3/100)*$C23*d_Turf*d_ByTCAd*d_ByExpDur*MAX(i_AbsorpProduct3,i_AbsorpInuse3)*d_MAF3*(1-Driftreduction))","v":{"$error":"#N/A"}},null,{"$f":"IF(ISNUMBER(J39),J39/d_BwAdult,\"\")","v":""},null,{"$f":"IF(i_AppMeth=\"In furrow application of granules\", \"\",(i_AppRateAS4/100)*$C23*d_Turf*d_ByTCAd*d_ByExpDur*MAX(i_AbsorpProduct4,i_AbsorpInuse4)*d_MAF4*(1-Driftreduction))","v":{"$error":"#N/A"}},null,{"$f":"IF(ISNUMBER(N39),N39/d_BwAdult,\"\")","v":""},null,{"$f":"IF(OR(i_AppMeth=\"In furrow application of granules\", i_AppMeth=\"Manual application of granules\"), \"NA for in furrow or manual application of granules\",IF(Driftreduction=0.5,\"Since drift reducing nozzles are selected a 50% reduction factor has been applied\",\"\"))","v":""}]
["Entry into treated crops (dermal)",{"$f":"IF(OR(i_FormVal=\"Granules, fine granules\",AND(i_IndoorOutdoor<>\"Outdoor\",$E$4=\"No\")),0, IF(i_CropType=\"Amenity grassland\", (i_AppRateAS1/100)*d_MAF1*d_Turf*d_ByTCAd*d_ExpDurTreatCrop*MAX(i_AbsorpProduct1,i_AbsorpInuse1), (d_TcEntryAd*0.25*d_DFR1*d_MAF1)/1000*MAX(i_AbsorpProduct1,i_AbsorpInuse1)))","v":0},null,{"$f":"IF(ISNUMBER(B40),B40/d_BwAdult,0)","v":0},null,{"$f":"IF(OR(i_FormVal=\"Granules, fine granules\",AND(i_IndoorOutdoor<>\"Outdoor\",$E$4=\"No\")),0,IF(i_CropType=\"Amenity grassland\", (i_AppRateAS2/100)*d_MAF2*d_Turf*d_ByTCAd*d_ExpDurTreatCrop*MAX(i_AbsorpProduct2,i_AbsorpInuse2), (d_TcEntryAd*0.25*d_DFR2*d_MAF2)/1000*MAX(i_AbsorpProduct2,i_AbsorpInuse2)))","v":0},null,{"$f":"IF(ISNUMBER(F40),F40/d_BwAdult,0)","v":0},null,{"$f":"IF(OR(i_FormVal=\"Granules, fine granules\",AND(i_IndoorOutdoor<>\"Outdoor\",$E$4=\"No\")),0, IF(i_CropType=\"Amenity grassland\", (i_AppRateAS3/100)*d_MAF3*d_Turf*d_ByTCAd*d_ExpDurTreatCrop*MAX(i_AbsorpProduct3,i_AbsorpInuse3), (d_TcEntryAd*0.25*d_DFR3*d_MAF3)/1000*MAX(i_AbsorpProduct3,i_AbsorpInuse3)))","v":0},null,{"$f":"IF(ISNUMBER(J40),J40/d_BwAdult,0)","v":0},null,{"$f":"IF(OR(i_FormVal=\"Granules, fine granules\",AND(i_IndoorOutdoor<>\"Outdoor\",$E$4=\"No\")),0,IF(i_CropType=\"Amenity grassland\", (i_AppRateAS4/100)*d_MAF4*d_Turf*d_ByTCAd*d_ExpDurTreatCrop*MAX(i_AbsorpProduct4,i_AbsorpInuse4), (d_TcEntryAd*0.25*d_DFR4*d_MAF4)/1000*MAX(i_AbsorpProduct4,i_AbsorpInuse4)))","v":0},null,{"$f":"IF(ISNUMBER(N40),N40/d_BwAdult,0)","v":0},null,{"$f":"IF(i_FormVal=\"Granules, fine granules\",\"NA for application of granules since calculation is same as for worker exposure and have no worker exposure for application of granules\",\"\")","v":""}]
["1-3 year old child","Systemic exposure [mg a.s./day]",null,"Systemic dose [mg a.s./kg bw/day]",null,"Systemic exposure [mg a.s./day]",null,"Systemic dose [mg a.s./kg bw/day]",null,"Systemic exposure [mg a.s./day]",null,"Systemic dose [mg a.s./kg bw/day]",null,"Systemic exposure [mg a.s./day]",null,"Systemic dose [mg a.s./kg bw/day]",null,"Comments"]
["Spray drift",{"$f":"IF(i_FormVal=\"Granules, fine granules\",0,(($C19*i_AbsorpInuse1*(1-d_ClothAF))+$C21)*d_ConcAs1*(1-Driftreduction))","v":{"$error":"#N/A"}},null,{"$f":"IF(ISNUMBER(B42),B42/d_BwChild,0)","v":0},null,{"$f":"IF(i_FormVal=\"Granules, fine granules\",0,(($C19*i_AbsorpInuse2*(1-d_ClothAF))+$C21)*d_ConcAs2*(1-Driftreduction))","v":{"$error":"#N/A"}},null,{"$f":"IF(ISNUMBER(F42),F42/d_BwChild,0)","v":0},null,{"$f":"IF(i_FormVal=\"Granules, fine granules\",0,(($C19*i_AbsorpInuse3*(1-d_ClothAF))+$C21)*d_ConcAs3*(1-Driftreduction))","v":{"$error":"#N/A"}},null,{"$f":"IF(ISNUMBER(J42),J42/d_BwChild,0)","v":0},null,{"$f":"IF(i_FormVal=\"Granules, fine granules\",0,(($C19*i_AbsorpInuse4*(1-d_ClothAF))+$C21)*d_ConcAs4*(1-Driftreduction))","v":{"$error":"#N/A"}},null,{"$f":"IF(ISNUMBER(N42),N42/d_BwChild,0)","v":0},null,{"$f":"IF(i_FormVal=\"Granules, fine granules\", \"NA for application of granules\",IF(i_AppMeth=\"Upward spraying\",\"the only available values are for the 8 m distance downwind from the middle of the tree trunk, which are assumed to represent 5 m distance from the edge of orchard; the same value is used for 5 and 10 m. \",IF(Driftreduction = 0.5,\"Since drift reducing nozzles are selected a 50% reduction factor has been applied\",\"\")))","v":""}]
["Vapour",{"$f":"i_AbsorpInhalation1*d_AirCon1*d_BreathRCh*d_BwChild","v":8.0000000000000002E-3},null,{"$f":"IF(ISNUMBER(B43),B43/d_BwChild,\"\")","v":8.0000000000000004E-4},null,{"$f":"i_AbsorpInhalation2*d_AirCon2*d_BreathRCh*d_BwChild","v":8.0000000000000002E-3},null,{"$f":"IF(ISNUMBER(F43),F43/d_BwChild,\"\")","v":8.0000000000000004E-4},null,{"$f":"i_AbsorpInhalation3*d_AirCon3*d_BreathRCh*d_BwChild","v":8.0000000000000002E-3},null,{"$f":"IF(ISNUMBER(J43),J43/d_BwChild,\"\")","v":8.0000000000000004E-4},null,{"$f":"i_AbsorpInhalation4*d_AirCon4*d_BreathRCh*d_BwChild","v":8.0000000000000002E-3},null,{"$f":"IF(ISNUMBER(N43),N43/d_BwChild,\"\")","v":8.0000000000000004E-4}]
["Surface deposits",null,null,"",null,null,null,"",null,null,null,"",null,null,null,""]
["Dermal",{"$f":"IF(i_AppMeth=\"In furrow application of granules\", \"\",(d_TTR1/1000)*$C23*d_ByTCCh*d_ByExpDur*MAX(i_AbsorpProduct1,i_AbsorpInuse1)*d_MAF1*(1-Driftreduction))","v":{"$error":"#N/A"}},null,"",null,{"$f":"IF(i_AppMeth=\"In furrow application of granules\", \"\",(d_TTR2/1000)*$C23*d_ByTCCh*d_ByExpDur*MAX(i_AbsorpProduct2,i_AbsorpInuse2)*d_MAF2*(1-Driftreduction))","v":{"$error":"#N/A"}},null,"",null,{"$f":"IF(i_AppMeth=\"In furrow application of granules\", \"\",(d_TTR3/1000)*$C23*d_ByTCCh*d_ByExpDur*MAX(i_AbsorpProduct3,i_AbsorpInuse3)*d_MAF3*(1-Driftreduction))","v":{"$error":"#N/A"}},null,"",null,{"$f":"IF(i_AppMeth=\"In furrow application of granules\", \"\",(d_TTR4/1000)*$C23*d_ByTCCh*d_ByExpDur*MAX(i_AbsorpProduct4,i_AbsorpInuse4)*d_MAF4*(1-Driftreduction))","v":{"$error":"#N/A"}},null,"",null,{"$f":"IF(Driftreduction = 0.5,\"Since drift reducing nozzles are selected a 50% reduction factor has been applied\",\"\")","v":""}]
["Hand to mouth",{"$f":"IF(i_AppMeth=\"In furrow application of granules\",\"\",(i_AppRateAS1/100)*$C23*d_Turf*d_SalExt*d_AreaHM*d_ByFreqHM*d_ByExpDur*i_AbsorpOralInuse1*d_MAF1*(1-Driftreduction))","v":{"$error":"#N/A"}},null,"",null,{"$f":"IF(i_AppMeth=\"In furrow application of granules\",\"\",(i_AppRateAS2/100)*$C23*d_Turf*d_SalExt*d_AreaHM*d_ByFreqHM*d_ByExpDur*i_AbsorpOralInuse2*d_MAF2*(1-Driftreduction))","v":{"$error":"#N/A"}},null,"",null,{"$f":"IF(i_AppMeth=\"In furrow application of granules\",\"\",(i_AppRateAS3/100)*$C23*d_Turf*d_SalExt*d_AreaHM*d_ByFreqHM*d_ByExpDur*i_AbsorpOralInuse3*d_MAF3*(1-Driftreduction))","v":{"$error":"#N/A"}},null,"",null,{"$f":"IF(i_AppMeth=\"In furrow application of granules\",\"\",(i_AppRateAS4/100)*$C23*d_Turf*d_SalExt*d_AreaHM*d_ByFreqHM*d_ByExpDur*i_AbsorpOralInuse4*d_MAF4*(1-Driftreduction))","v":{"$error":"#N/A"}},null,"",null,{"$f":"IF(Driftreduction = 0.5,\"Since drift reducing nozzles are selected a 50% reduction factor has been applied\",\"\")","v":""}]
["Object to mouth",{"$f":"IF(i_AppMeth=\"In furrow application of granules\",\"\",(i_AppRateAS1/100)*$C23*d_DRP*d_MouthGrass*i_AbsorpOralInuse1*d_MAF1*(1-Driftreduction))","v":{"$error":"#N/A"}},null,"",null,{"$f":"IF(i_AppMeth=\"In furrow application of granules\",\"\",(i_AppRateAS2/100)*$C23*d_DRP*d_MouthGrass*i_AbsorpOralInuse2*d_MAF2*(1-Driftreduction))","v":{"$error":"#N/A"}},null,"",null,{"$f":"IF(i_AppMeth=\"In furrow application of granules\",\"\",(i_AppRateAS3/100)*$C23*d_DRP*d_MouthGrass*i_AbsorpOralInuse3*d_MAF3*(1-Driftreduction))","v":{"$error":"#N/A"}},null,"",null,{"$f":"IF(i_AppMeth=\"In furrow application of granules\",\"\",(i_AppRateAS4/100)*$C23*d_DRP*d_MouthGrass*i_AbsorpOralInuse4*d_MAF4*(1-Driftreduction))","v":{"$error":"#N/A"}},null,"",null,{"$f":"IF(Driftreduction = 0.5,\"Since drift reducing nozzles are selected a 50% reduction factor has been applied\",\"\")","v":""}]
["Entry into treated crops",null,null,"",null,null,null,"",null,null,null,"",null,null,null,""]
["Dermal",{"$f":"IF(OR(i_FormVal=\"Granules, fine granules\",AND(i_IndoorOutdoor<>\"Outdoor\",$E$4=\"No\")),0,IF(i_CropType=\"Amenity grassland\",(d_TTR1/1000)*d_MAF1*d_ByTCCh*d_ExpDurTreatCrop*MAX(i_AbsorpProduct1,i_AbsorpInuse1),(d_TcEntryCh*0.25*d_DFR1*d_MAF1)/1000*MAX(i_AbsorpProduct1,i_AbsorpInuse1)))","v":0},null,{"$f":"IF(ISNUMBER(B49),B49/d_BwChild,0)","v":0},null,{"$f":"IF(OR(i_FormVal=\"Granules, fine granules\",AND(i_IndoorOutdoor<>\"Outdoor\",$E$4=\"No\")),0,IF(i_CropType=\"Amenity grassland\", (d_TTR2/1000)*d_MAF2*d_ByTCCh*d_ExpDurTreatCrop*MAX(i_AbsorpProduct2,i_AbsorpInuse2), (d_TcEntryCh*0.25*d_DFR2*d_MAF2)/1000*MAX(i_AbsorpProduct2,i_AbsorpInuse2)))","v":0},null,{"$f":"IF(ISNUMBER(F49),F49/d_BwChild,0)","v":0},null,{"$f":"IF(OR(i_FormVal=\"Granules, fine granules\",AND(i_IndoorOutdoor<>\"Outdoor\",$E$4=\"No\")),0,IF(i_CropType=\"Amenity grassland\", (d_TTR3/1000)*d_MAF3*d_ByTCCh*d_ExpDurTreatCrop*MAX(i_AbsorpProduct3,i_AbsorpInuse3), (d_TcEntryCh*0.25*d_DFR3*d_MAF3)/1000*MAX(i_AbsorpProduct3,i_AbsorpInuse3)))","v":0},null,{"$f":"IF(ISNUMBER(J49),J49/d_BwChild,0)","v":0},null,{"$f":"IF(OR(i_FormVal=\"Granules, fine granules\",AND(i_IndoorOutdoor<>\"Outdoor\",$E$4=\"No\")),0,IF(i_CropType=\"Amenity grassland\", (d_TTR4/1000)*d_MAF4*d_ByTCCh*d_ExpDurTreatCrop*MAX(i_AbsorpProduct4,i_AbsorpInuse4), (d_TcEntryCh*0.25*d_DFR4*d_MAF4)/1000*MAX(i_AbsorpProduct4,i_AbsorpInuse4)))","v":0},null,{"$f":"IF(ISNUMBER(N49),N49/d_BwChild,0)","v":0},null,{"$f":"IF(i_FormVal=\"Granules, fine granules\",\"NA for application of granules since calculation is same as for worker exposure and have no worker exposure for application of granules\",\"\")","v":""}]
["Hand to mouth",{"$f":"IF(OR(i_FormVal=\"Granules, fine granules\",AND(i_IndoorOutdoor<>\"Outdoor\",$E$4=\"No\")),0,IF(i_CropType=\"Amenity grassland\",(d_TTR1/1000)*d_MAF1*d_SalExt*d_AreaHM*d_ByFreqHM*d_ExpDurTreatCrop*i_AbsorpOralInuse1,0))","v":0},null,{"$f":"IF(ISNUMBER(B50),B50/d_BwChild,0)","v":0},null,{"$f":"IF(OR(i_FormVal=\"Granules, fine granules\",AND(i_IndoorOutdoor<>\"Outdoor\",$E$4=\"No\")),0,IF(i_CropType=\"Amenity grassland\",(d_TTR2/1000)*d_MAF2*d_SalExt*d_AreaHM*d_ByFreqHM*d_ExpDurTreatCrop*i_AbsorpOralInuse2,0))","v":0},null,{"$f":"IF(ISNUMBER(F50),F50/d_BwChild,0)","v":0},null,{"$f":"IF(OR(i_FormVal=\"Granules, fine granules\",AND(i_IndoorOutdoor<>\"Outdoor\",$E$4=\"No\")),0,IF(i_CropType=\"Amenity grassland\",(d_TTR3/1000)*d_MAF3*d_SalExt*d_AreaHM*d_ByFreqHM*d_ExpDurTreatCrop*i_AbsorpOralInuse3,0))","v":0},null,{"$f":"IF(ISNUMBER(J50),J50/d_BwChild,0)","v":0},null,{"$f":"IF(OR(i_FormVal=\"Granules, fine granules\",AND(i_IndoorOutdoor<>\"Outdoor\",$E$4=\"No\")),0,IF(i_CropType=\"Amenity grassland\",(d_TTR4/1000)*d_MAF4*d_SalExt*d_AreaHM*d_ByFreqHM*d_ExpDurTreatCrop*i_AbsorpOralInuse4,0))","v":0},null,{"$f":"IF(ISNUMBER(N50),N50/d_BwChild,0)","v":0},null,{"$f":"IF(i_CropType=\"Amenity grassland\",\"\",\"Considered only for application on amenity grassland. \")","v":"Considered only for application on amenity grassland. "}]
["Object to mouth",{"$f":"IF(OR(i_FormVal=\"Granules, fine granules\",AND(i_IndoorOutdoor<>\"Outdoor\",$E$4=\"No\")),0,IF(i_CropType=\"Amenity grassland\",(i_AppRateAS1/100)*d_DRP*d_MouthGrass*i_AbsorpOralInuse1*d_MAF1,0))","v":0},null,{"$f":"IF(ISNUMBER(B51),B51/d_BwChild,0)","v":0},null,{"$f":"IF(OR(i_FormVal=\"Granules, fine granules\",AND(i_IndoorOutdoor<>\"Outdoor\",$E$4=\"No\")),0,IF(i_CropType=\"Amenity grassland\",(i_AppRateAS2/100)*d_DRP*d_MouthGrass*i_AbsorpOralInuse2*d_MAF2,0))","v":0},null,{"$f":"IF(ISNUMBER(F51),F51/d_BwChild,0)","v":0},null,{"$f":"IF(OR(i_FormVal=\"Granules, fine granules\",AND(i_IndoorOutdoor<>\"Outdoor\",$E$4=\"No\")),0,IF(i_CropType=\"Amenity grassland\",(i_AppRateAS3/100)*d_DRP*d_MouthGrass*i_AbsorpOralInuse3*d_MAF3,0))","v":0},null,{"$f":"IF(ISNUMBER(J51),J51/d_BwChild,0)","v":0},null,{"$f":"IF(OR(i_FormVal=\"Granules, fine granules\",AND(i_IndoorOutdoor<>\"Outdoor\",$E$4=\"No\")),0,IF(i_CropType=\"Amenity grassland\",(i_AppRateAS4/100)*d_DRP*d_MouthGrass*i_AbsorpOralInuse4*d_MAF4,0))","v":0},null,{"$f":"IF(ISNUMBER(N51),N51/d_BwChild,0)","v":0},null,{"$f":"IF(i_CropType=\"Amenity grassland\",\"\",\"Considered only for application on amenity grassland. \")","v":"Considered only for application on amenity grassland. "}]

{"sheet":"Recreational Exposure","index":20,"n_rows":35,"n_cols":10,"rows_kept":35,"cut":false,"hidden":false,"merged":[[12,3,12,4],[12,5,12,6],[12,7,12,8],[10,3,10,4],[10,5,10,6],[10,7,10,8],[11,3,11,4],[11,5,11,6],[11,7,11,8],[7,3,7,4],[7,5,7,6],[7,7,7,8],[8,3,8,4],[8,5,8,6],[8,7,8,8],[23,5,23,6],[23,7,23,8],[14,5,14,6],[14,7,14,8],[15,5,15,6],[15,7,15,8],[16,5,16,6],[16,7,16,8],[21,5,21,6],[21,7,21,8],[2,3,2,4],[5,0,5,1],[5,3,5,4],[4,1,4,3],[23,1,23,2],[23,3,23,4],[14,0,14,1],[14,3,14,4],[15,0,15,1],[15,3,15,4],[16,0,16,1],[16,3,16,4],[6,1,6,2],[6,3,6,4],[9,3,9,4],[7,1,7,2],[9,1,9,2],[10,1,10,2],[11,1,11,2],[12,1,12,2],[2,1,2,2],[8,1,8,2],[17,0,17,1],[17,3,17,4],[18,0,18,1],[18,3,18,4],[19,0,19,1],[19,3,19,4],[20,0,20,1],[20,3,20,4],[21,0,21,1],[21,3,21,4],[20,5,20,6],[2,5,2,6],[2,7,2,8],[5,5,5,6],[5,7,5,8],[20,7,20,8],[17,5,17,6],[17,7,17,8],[18,5,18,6],[18,7,18,8],[19,5,19,6],[19,7,19,8],[6,7,6,8],[9,7,9,8],[6,5,6,6],[9,5,9,6]]}
[{"$f":"\"Recreational exposure for \"&i_ProductName","v":"Recreational exposure for "},null,{"$f":"IF(i_CropType = \"Amenity grassland\",\"\",\"This sheet is only to be used for treatment of grassland used for recreational purposes\")","v":"This sheet is only to be used for treatment of grassland used for recreational purposes"}]
["Crop type",null,{"$f":"i_CropType","v":0}]
["Application method",{"$f":"i_AppMeth","v":0}]
["Application equipment",null,{"$f":"i_AppEquip","v":0},null,null,null,null,null,null,"i_AppEquip"]
["Formulation type",{"$f":"i_FormVal","v":0},null,null,null,null,null,null,null,"i_FormVal"]
["Application rate of the product",null,{"$f":"i_AppRatePPP","v":0},{"$f":"'Data entry'!E9","v":"kg/ha"},null,null,null,null,null,"i_AppRatePPP"]
[null,{"$f":"i_SubstName1","v":0},null,{"$f":"i_SubstName2","v":0},null,{"$f":"i_SubstName3","v":0},null,{"$f":"i_SubstName4","v":0}]
["Application rate of the a.s. (kg a.s./ha)",{"$f":"i_AppRateAS1","v":0},null,{"$f":"i_AppRateAS2","v":0},null,{"$f":"i_AppRateAS3","v":0},null,{"$f":"i_AppRateAS4","v":0},null,"i_AppRateAS"]
[{"$f":"\"Concentration of active substance (in-use dilution for liquid applications)\"&\" \"&IF(i_FormVal=\"Granules, fine granules\",\"(kg a.s./kg)\",\"(g a.s./L)\")","v":"Concentration of active substance (in-use dilution for liquid applications) (g a.s./L)"},{"$f":"d_ConcAs1","v":{"$error":"#DIV/0!"}},null,{"$f":"d_ConcAs2","v":{"$error":"#DIV/0!"}},null,{"$f":"d_ConcAs3","v":{"$error":"#DIV/0!"}},null,{"$f":"d_ConcAs4","v":{"$error":"#DIV/0!"}},null,"d_ConcAS"]
["Dermal absorption of product",{"$f":"i_AbsorpProduct1","v":0},null,{"$f":"i_AbsorpProduct2","v":0},null,{"$f":"i_AbsorpProduct3","v":0},null,{"$f":"i_AbsorpProduct4","v":0},null,"i_AbsorpProduct"]
["Dermal absorption of in-use dilution",{"$f":"i_AbsorpInuse1","v":0},null,{"$f":"i_AbsorpInuse2","v":0},null,{"$f":"i_AbsorpInuse3","v":0},null,{"$f":"i_AbsorpInuse4","v":0},null,"i_AbsorpInuse"]
["Oral absorption",{"$f":"IF(i_AbsorpOralInuse1>0.8,1,i_AbsorpOralInuse1)","v":1},null,{"$f":"IF(i_AbsorpOralInuse2>0.8,1,i_AbsorpOralInuse2)","v":1},null,{"$f":"IF(i_AbsorpOralInuse3>0.8,1,i_AbsorpOralInuse3)","v":1},null,{"$f":"IF(i_AbsorpOralInuse4>0.8,1,i_AbsorpOralInuse4)","v":1},null,"i_AbsorpOralInuse"]
[{"$f":"\"Turf transferable residue (i_AppRate*d_Turf)\"&\" (μg a.s./cm²)\"","v":"Turf transferable residue (i_AppRate*d_Turf) (μg a.s./cm²)"},{"$f":"d_TTR1","v":0},null,{"$f":"d_TTR2","v":0},null,{"$f":"d_TTR3","v":0},null,{"$f":"d_TTR4","v":0},null,"d_TTR"]
["Light clothing adjustment factor adult resident",null,{"$f":"d_ClothAF","v":0.18},null,null,null,null,null,null,"d_ClothAF"]
["Drift percentage on surface",null,1]
["Turf transferable residues percentage",null,{"$f":"d_Turf","v":0.05},null,null,null,null,null,null,"d_Turf"]
["Transfer coeff. of surface deposits-adult (cm²/h)",null,{"$f":"d_ReTCAd","v":7300},null,null,null,null,null,null,"d_ReTCAd"]
["Transfer coeff. of surface deposits-child (1-3 year old)  (cm²/h)",null,{"$f":"d_ReTCCh","v":2600},null,null,null,null,null,null,"d_ReTCCh"]
["Saliva extraction percentage",null,{"$f":"d_SalExt","v":0.5},null,null,null,null,null,null,"d_SalExt"]
["Surface area of hands mouthed (cm²)",null,{"$f":"d_AreaHM","v":20},null,null,null,null,null,null,"d_AreaHM"]
["Frequency of hand to mouth activity (events/h)",null,{"$f":"d_ReFreqHM","v":9.5},null,null,null,null,null,null,"d_ReFreqHM"]
["Ingestion rate for mouthing of grass per day (cm²)",null,{"$f":"d_MouthGrass","v":25},null,null,null,null,null,null,"d_MouthGrass"]
[]
["2. Details",{"$f":"i_SubstName1","v":0},null,{"$f":"i_SubstName2","v":0},null,{"$f":"i_SubstName3","v":0},null,{"$f":"i_SubstName4","v":0},null,"Combined"]
[null,"Systemic exposure [mg a.s./day]","Systemic dose [mg a.s./kg bw/day]","Systemic exposure [mg a.s./day]","Systemic dose [mg a.s./kg bw/day]","Systemic exposure [mg a.s./day]","Systemic dose [mg a.s./kg bw/day]","Systemic exposure [mg a.s./day]","Systemic dose [mg a.s./kg bw/day]","Systemic dose [mg a.s./kg bw/day]"]
["1-3 year old child"]
["Surface deposits"]
["Dermal",{"$f":"IF(i_AppMeth=\"In furrow application of granules\", \"\",(d_TTR1/1000)*$C15*d_ReTCCh*d_ReExpDur*MAX(i_AbsorpProduct1,i_AbsorpInuse1)*d_MAF1)","v":0},{"$f":"IF(ISNUMBER(B28), B28/d_BwChild,\"\")","v":0},{"$f":"IF(i_AppMeth=\"In furrow application of granules\", \"\",(d_TTR2/1000)*$C15*d_ReTCCh*d_ReExpDur*MAX(i_AbsorpProduct2,i_AbsorpInuse2)*d_MAF2)","v":0},{"$f":"IF(ISNUMBER(D28), D28/d_BwChild,\"\")","v":0},{"$f":"IF(i_AppMeth=\"In furrow application of granules\", \"\",(d_TTR3/1000)*$C15*d_ReTCCh*d_ReExpDur*MAX(i_AbsorpProduct3,i_AbsorpInuse3)*d_MAF3)","v":0},{"$f":"IF(ISNUMBER(F28), F28/d_BwChild,\"\")","v":0},{"$f":"IF(i_AppMeth=\"In furrow application of granules\", \"\",(d_TTR4/1000)*$C15*d_ReTCCh*d_ReExpDur*MAX(i_AbsorpProduct4,i_AbsorpInuse4)*d_MAF4)","v":0},{"$f":"IF(ISNUMBER(H28), H28/d_BwChild,\"\")","v":0}]
["Hand to mouth",{"$f":"IF(i_AppMeth=\"In furrow application of granules\",\"\",(i_AppRateAS1/100)*$C15*d_Turf*d_SalExt*d_AreaHM*d_ReFreqHM*d_ReExpDur*i_AbsorpOralInuse1*d_MAF1)","v":0},{"$f":"IF(ISNUMBER(B29), B29/d_BwChild,\"\")","v":0},{"$f":"IF(i_AppMeth=\"In furrow application of granules\",\"\",(i_AppRateAS2/100)*$C15*d_Turf*d_SalExt*d_AreaHM*d_ReFreqHM*d_ReExpDur*i_AbsorpOralInuse2*d_MAF2)","v":0},{"$f":"IF(ISNUMBER(D29), D29/d_BwChild,\"\")","v":0},{"$f":"IF(i_AppMeth=\"In furrow application of granules\",\"\",(i_AppRateAS3/100)*$C15*d_Turf*d_SalExt*d_AreaHM*d_ReFreqHM*d_ReExpDur*i_AbsorpOralInuse3*d_MAF3)","v":0},{"$f":"IF(ISNUMBER(F29), F29/d_BwChild,\"\")","v":0},{"$f":"IF(i_AppMeth=\"In furrow application of granules\",\"\",(i_AppRateAS4/100)*$C15*d_Turf*d_SalExt*d_AreaHM*d_ReFreqHM*d_ReExpDur*i_AbsorpOralInuse4*d_MAF4)","v":0},{"$f":"IF(ISNUMBER(H29), H29/d_BwChild,\"\")","v":0}]
["Object to mouth",{"$f":"IF(i_AppMeth=\"In furrow application of granules\",\"\",(i_AppRateAS1/100)*$C15*d_DRP*d_MouthGrass*i_AbsorpOralInuse1*d_MAF1)","v":0},{"$f":"IF(ISNUMBER(B30), B30/d_BwChild,\"\")","v":0},{"$f":"IF(i_AppMeth=\"In furrow application of granules\",\"\",(i_AppRateAS2/100)*$C15*d_DRP*d_MouthGrass*i_AbsorpOralInuse2*d_MAF2)","v":0},{"$f":"IF(ISNUMBER(D30), D30/d_BwChild,\"\")","v":0},{"$f":"IF(i_AppMeth=\"In furrow application of granules\",\"\",(i_AppRateAS3/100)*$C15*d_DRP*d_MouthGrass*i_AbsorpOralInuse3*d_MAF3)","v":0},{"$f":"IF(ISNUMBER(F30), F30/d_BwChild,\"\")","v":0},{"$f":"IF(i_AppMeth=\"In furrow application of granules\",\"\",(i_AppRateAS4/100)*$C15*d_DRP*d_MouthGrass*i_AbsorpOralInuse4*d_MAF4)","v":0},{"$f":"IF(ISNUMBER(H30), H30/d_BwChild,\"\")","v":0}]
["Total systemic exposure",{"$f":"SUM(B28:B30)","v":0},{"$f":"IF(ISNUMBER(B31),B31/d_BwChild,\"\")","v":0},{"$f":"SUM(D28:D30)","v":0},{"$f":"IF(ISNUMBER(D31),D31/d_BwChild,\"\")","v":0},{"$f":"SUM(F28:F30)","v":0},{"$f":"IF(ISNUMBER(F31),F31/d_BwChild,\"\")","v":0},{"$f":"SUM(H28:H30)","v":0},{"$f":"IF(ISNUMBER(H31),H31/d_BwChild,\"\")","v":0},"Hazard Index"]
["% of AOEL",null,{"$f":"IF(i_CropType = \"Amenity grassland\",IFERROR(C31/i_AOEL1,0),0)","v":0},null,{"$f":"IF(i_CropType = \"Amenity grassland\",IFERROR(E31/i_AOEL2,0),0)","v":0},null,{"$f":"IF(i_CropType = \"Amenity grassland\",IFERROR(G31/i_AOEL3,0),0)","v":0},null,{"$f":"IF(i_CropType = \"Amenity grassland\",IFERROR(I31/i_AOEL4,0),0)","v":0},{"$f":"IF(i_CropType = \"Amenity grassland\",IF(COUNTA('Data entry'!D26:G26)<2,\"N/A\",FIXED(RecSysExpChProzAOEL+E32+G32+I32,3)),\"\")","v":""}]
["Adult"]
["Surface deposits (dermal)",{"$f":"IF(i_AppMeth=\"In furrow application of granules\", \"\",(i_AppRateAS1/100)*$C15*d_Turf*d_ReTCAd*d_ReExpDur*MAX(i_AbsorpProduct1,i_AbsorpInuse1)*d_MAF1)","v":0},{"$f":"IF(ISNUMBER(B34),B34/d_BwAdult,\"\")","v":0},{"$f":"IF(i_AppMeth=\"In furrow application of granules\", \"\",(i_AppRateAS2/100)*C15*d_Turf*d_ReTCAd*d_ReExpDur*MAX(i_AbsorpProduct2,i_AbsorpInuse2)*d_MAF2)","v":0},{"$f":"IF(ISNUMBER(D34),D34/d_BwAdult,\"\")","v":0},{"$f":"IF(i_AppMeth=\"In furrow application of granules\", \"\",(i_AppRateAS3/100)*C15*d_Turf*d_ReTCAd*d_ReExpDur*MAX(i_AbsorpProduct3,i_AbsorpInuse3)*d_MAF3)","v":0},{"$f":"IF(ISNUMBER(F34),F34/d_BwAdult,\"\")","v":0},{"$f":"IF(i_AppMeth=\"In furrow application of granules\", \"\",(i_AppRateAS4/100)*C15*d_Turf*d_ReTCAd*d_ReExpDur*MAX(i_AbsorpProduct4,i_AbsorpInuse4)*d_MAF4)","v":0},{"$f":"IF(ISNUMBER(H34),H34/d_BwAdult,\"\")","v":0},"Hazard Index"]
["% of AOEL",null,{"$f":"IF(i_CropType = \"Amenity grassland\",IFERROR(C34/i_AOEL1,0),0)","v":0},null,{"$f":"IF(i_CropType = \"Amenity grassland\",IFERROR(E34/i_AOEL2,0),0)","v":0},null,{"$f":"IF(i_CropType = \"Amenity grassland\",IFERROR(G34/i_AOEL3,0),0)","v":0},null,{"$f":"IF(i_CropType = \"Amenity grassland\",IFERROR(I34/i_AOEL4,0),0)","v":0},{"$f":"IF(i_CropType = \"Amenity grassland\",IF(COUNTA('Data entry'!D26:G26)<2,\"N/A\",FIXED(RecSysExpAdProzAOEL+E35+G35+I35,3)),\"\")","v":""}]

{"sheet":"Default values","index":21,"n_rows":51,"n_cols":7,"rows_kept":51,"cut":false,"hidden":false,"merged":[]}
["d_AirConVol","Concentration in air of moderately volatile substances",1.4999999999999999E-2,"mg/m3"]
["d_AirConNonVol","Concentration in air of low volatile substances",1E-3,"mg/m3"]
["d_AreaHM","Surface area of hands mouthed",20,"cm²"]
["d_AreaTreated","Area treated (defined by crop type)",{"$f":"IF(LEFT(i_IndoorOutdoor,2)=\"In\",1,IF(LEFT(i_AppEquip,15)=\"Vehicle-mounted\",INDEX(ay_CropType,MATCH(i_CropType,key_CropType,0),9),IF(i_AppEquip=\"Manual-Hand held\",IF(i_Season=\"late (dense foliage)\",1,4),1)))","v":1},"ha"]
["d_BreathRAd","Breathing rate adult residents",0.27,"m³/day/kg"]
["d_BreathRCh","Breathing rate child (1-3 year old) residents",0.8,"m³/day/kg"]
["d_BreathWorker","Breathing rate worker",1.25,"m³/h"]
["d_BwAdult","Adult body weight",60,"kg"]
["d_BwChild","Child body weight (1 to < 3 year olds)",10,"kg"]
["d_ByBreathRAd","Breathing rate adult bystander",5.2999999999999999E-2,"m³/h/kg"]
["d_ByBreathRCh","Breathing rate child (1-3 year old) bystander",0.22800000000000001,"m³/h/kg"]
["d_ByExpDur","Exposure duration intense activity breathing rates",2,"h"]
["d_ByFreqHM","Frequency of hand to mouth activity",20,"events/h"]
["d_ByTCAd","Transfer coeff. of surface deposits-adult",14500,"cm²/h"]
["d_ByTCCh","Transfer coeff. of surface deposits-child (1-3 year old)",5200,"cm²/h"]
["d_ClothAF","Light clothing adjustment factor resident and bystanders",0.18]
[null,null,{"$f":"i_SubstName1","v":0},{"$f":"i_SubstName2","v":0},{"$f":"i_SubstName3","v":0},{"$f":"i_SubstName4","v":0}]
["d_ConcAs","Concentration of active substance (in-use dilution for liquid applications)",{"$f":"IF(i_FormVal=\"Granules, fine granules\",\"N/A\",(i_AppRateAS1/i_MinVol)*1000)","v":{"$error":"#DIV/0!"}},{"$f":"IF(i_FormVal=\"Granules, fine granules\",\"N/A\",(i_AppRateAS2/i_MinVol)*1000)","v":{"$error":"#DIV/0!"}},{"$f":"IF(i_FormVal=\"Granules, fine granules\",\"N/A\",(i_AppRateAS3/i_MinVol)*1000)","v":{"$error":"#DIV/0!"}},{"$f":"IF(i_FormVal=\"Granules, fine granules\",\"N/A\",(i_AppRateAS4/i_MinVol)*1000)","v":{"$error":"#DIV/0!"}},{"$f":"IF(i_FormVal=\"Granules, fine granules\",\"N/A\",\"g a.s./L\")","v":"g a.s./L"}]
["d_DFR","Dislodgeable foliar residue (i_AppRate*i_DFR)",{"$f":"i_AppRateAS1*IF(i_DFR1>0,i_DFR1,3)","v":0},{"$f":"i_AppRateAS2*IF(i_DFR2>0,i_DFR2,3)","v":0},{"$f":"i_AppRateAS3*IF(i_DFR3>0,i_DFR3,3)","v":0},{"$f":"i_AppRateAS4*IF(i_DFR4>0,i_DFR4,3)","v":0},"μg a.s./cm²"]
["d_TTR","Turf transferable residue (i_AppRate*d_Turf)",{"$f":"i_AppRateAS1*d_Turf*10","v":0},{"$f":"i_AppRateAS2*d_Turf*10","v":0},{"$f":"i_AppRateAS3*d_Turf*10","v":0},{"$f":"i_AppRateAS4*d_Turf*10","v":0},"μg a.s./cm²"]
["conc_soil","Concentration in soil (i_AppRate/100 * 1/d_soilDepth)",{"$f":"i_AppRateAS1/100/d_soilDepth","v":0},{"$f":"i_AppRateAS2/100/d_soilDepth","v":0},{"$f":"i_AppRateAS3/100/d_soilDepth","v":0},{"$f":"i_AppRateAS4/100/d_soilDepth","v":0},"mg/m³"]
["conc_dust","Concentration in dust (ConcSoil1*d_InhalDustExp/d_SoilDensity)",{"$f":"ConcSoil1*d_InhalDustExp/d_soilDensity","v":0},{"$f":"ConcSoil2*d_InhalDustExp/d_soilDensity","v":0},{"$f":"ConcSoil3*d_InhalDustExp/d_soilDensity","v":0},{"$f":"ConcSoil4*d_InhalDustExp/d_soilDensity","v":0},"mg/m³"]
["d_SVC","Saturated vapour concentration (0.41*i_VP*i_MW)",{"$f":"IF(AND(i_VP1<>0,i_MW1<>0),0.41*i_VP1*i_MW1,\"N/A\")","v":"N/A"},{"$f":"IF(AND(i_VP2<>0,i_MW2<>0),0.41*i_VP2*i_MW2,\"N/A\")","v":"N/A"},{"$f":"IF(AND(i_VP3<>0,i_MW3<>0),0.41*i_VP3*i_MW3,\"N/A\")","v":"N/A"},{"$f":"IF(AND(i_VP4<>0,i_MW4<>0),0.41*i_VP4*i_MW4,\"N/A\")","v":"N/A"},"mg/m³"]
["d_HalflifeAS","Foliar half-life of active substance (DT50)",{"$f":"IF(i_DT50_1>0,i_DT50_1,30)","v":30},{"$f":"IF(i_DT50_2>0,i_DT50_2,30)","v":30},{"$f":"IF(i_DT50_3>0,i_DT50_3,30)","v":30},{"$f":"IF(i_DT50_4>0,i_DT50_4,30)","v":30},"days"]
["d_MAF","Multiple application factor",{"$f":"(1-(EXP(-(i_AppNo*i_AppInt*(LN(2)/d_HalflifeAS1)))))/(1-(EXP(-(i_AppInt*(LN(2)/d_HalflifeAS1)))))","v":1},{"$f":"(1-(EXP(-(i_AppNo*i_AppInt*(LN(2)/d_HalflifeAS2)))))/(1-(EXP(-(i_AppInt*(LN(2)/d_HalflifeAS2)))))","v":1},{"$f":"(1-(EXP(-(i_AppNo*i_AppInt*(LN(2)/d_HalflifeAS3)))))/(1-(EXP(-(i_AppInt*(LN(2)/d_HalflifeAS3)))))","v":1},{"$f":"(1-(EXP(-(i_AppNo*i_AppInt*(LN(2)/d_HalflifeAS4)))))/(1-(EXP(-(i_AppInt*(LN(2)/d_HalflifeAS4)))))","v":1}]
["d_InhalTcManual","Inhalation transfer coefficient ",{"$f":"INDEX(ay_Worker_activity,MATCH(sys_keyworker,key_worker_activity,0),13)","v":{"$error":"#N/A"}},"ha/h*10^(-3)"]
["d_DRP","Dislodgeable residues percentage transferability for object to mouth",0.2]
["d_MouthGrass","Ingestion rate for mouthing of grass per day",25,"cm² grass/day"]
["d_ReExpDur","Exposure duration resident dermal",2,"h"]
["d_ReExpDurInhal","Exposure duration resident inhalation",24,"h"]
["d_ExpDurTreatCrop","Exposure duration for resident and bystander entry into treated crops",0.25,"h"]
["d_ReFreqHM","Frequency of hand to mouth activity",9.5,"events/h"]
["d_ReTCAd","Transfer coeff. of surface deposits-adult",7300,"cm²/h"]
["d_ReTCCh","Transfer coeff. of surface deposits-child (1-3 year old)",2600,"cm²/h"]
["d_SalExt","Saliva extraction percentage",0.5]
["d_HandSurface","Hand surface loading worker",820,"cm²"]
["d_handSoilLoading","Hand soil loading worker",0.44,"mg/cm²"]
["d_soilDepth","Soil depth",5,"cm"]
["d_soilDensity","Soil density",1500,"mg/cm³"]
["d_InhalDustExp","Inhalation dust exposure",98.6,"mg/m³"]
["d_TcEntryAd","Transfer coefficient for entry into treated crops 75th percentile - adult",7500,"cm²/h"]
["d_TcEntryCh","Transfer coefficient for entry into treated crops 75th percentile - child",{"$f":"d_TcEntryAd*0.3","v":2250},"cm²/h"]
["d_TcEntryMeanAd","Transfer coefficient for entry into treated crops mean - adult",5980,"cm²/h"]
["d_TcEntryMeanCh","Transfer coefficient for entry into treated crops mean - child",{"$f":"d_TcEntryMeanAd*0.3","v":1794},"cm²/h"]
["d_Turf","Turf transferable residues percentage",{"$f":"IF(i_FormVal=\"Granules, fine granules\",0.01,0.05)","v":0.05}]
["d_PctExtrapolation","For LCHH above this amount linear extrapolation is performed",{"$f":"IF(i_IndoorOutdoor='Look up'!A19,1.5,IF(i_IndoorOutdoor='Look up'!A17,0.6,0.075))","v":7.4999999999999997E-2},"kg"]
["d_head75ProtectionFactor","Cooefficient to estimate head protection factor 75th Percentile",{"$f":"IF(Hole_D25=\"Face shield\",-1.67,0)","v":0}]
["d_head95ProtectionFactor","Cooefficient to estimate head protection factor 95th Percentile",{"$f":"IF(Hole_D25=\"Face shield\",-1.16,0)","v":0}]
["skinAdhSoil","Adherence of soil to skin",{"$f":"d_handSoilLoading/d_soilDensity","v":2.9333333333333333E-4},"cm"]
["sys_KeyOperator","Variables for operator exposure lookup key",{"$f":"i_IndoorOutdoor&i_FormVal&i_AppMeth&i_AppEquip","v":""}]
["sys_OperatorModel","Operator model",{"$f":"IF(i_FormVal='Look up'!A5,2,1)","v":1}]